{"text_format":"1","workbook":"xlsx","n_sheets":54,"sheets":["LDC Info","Index","COS Flowchart","List of Key References","App.2-A_Requested_Approvals","App.2-AA_Cap Proj_SysAccess","App.2-AA_Cap Proj_SysRen","App.2-AA_Cap Proj_SysServ","App.2-AA_Cap Proj_GenPlant","App.2-AB_Capital Expenditures","Hidden_CAPEX","App.2-AC_Customer Engagement","App.2-B_Acctg Instructions","App.2-BA_Fixed Asset Cont","Appendix 2-BB Service Life  ","App.2-C_DepExp","App.2-D_Overhead","App.2-EA_Account 1575 (2015)","App.2-EB_Account 1576 (2012)","App.2-EC_Account 1576 (2013)","App.2-FA Proposed REG Invest.","Hidden_REG Invest.","App.2-FB Calc of REG Improvemnt","Hidden_REG Improvement","App.2-FC Calc of REG Expansion","Hidden_REG Expansion","App.2-G SQI","App.2-H_Other_Oper_Rev","Hidden_Other Revenue","App_2-I LF_CDM","App.2-IA_Load_Forecast_Instrct","App.2-IB_Load_Forecast_Analysis","App.2-JA_OM&A_Summary_Analys","Hidden_OM&A Summary","App.2-JB_OM&A_Cost _Drivers","App.2-JC_OMA Programs","App.2-K_Employee Costs","Hidden_Employee Costs","App.2-L_OM&A_per_Cust_FTE","App.2-L_OM&A_per_Cust_FTEE_exp","App.2-M_Regulatory_Costs","Hidden_RegulatoryCosts1","Hidden_RegulatoryCosts2","App.2-N_Corp_Cost_Allocation","App.2-OA Capital Structure","App.2-OB_Debt Instruments","App.2-Q_Cost of Serv. Emb. Dx","App.2-R_Loss Factors","App.2-S_Stranded Meters","App.2-Y_MIFRS Summary Impacts","Sheet19","App.2-YA_IFRS Transition Costs","App.2-Z_Commodity Expense","Sheet1"],"not_rendered":{"charts":0,"images":5,"macros":1,"external_links":21,"defined_names":726,"comments":6,"pivot_tables":0},"unopened":[],"bounds":{"document_bytes":16777216,"sheet_cells":100000,"rows_first":2000,"rows_last":500,"rows_between":2000,"halvings":0,"cell_chars":16384,"cell_head_chars":4096},"cells_cut":0,"cells_raw":0,"read":"whole","date_system":"1900"}

{"sheet":"LDC Info","index":0,"n_rows":77,"n_cols":27,"rows_kept":77,"cut":false,"hidden":false,"merged":[[17,4,17,10],[13,4,13,10],[15,4,15,8],[19,4,19,8],[25,4,25,6],[23,4,23,6],[21,4,21,8],[45,0,45,3],[50,2,50,11],[54,2,54,12],[52,2,52,13],[27,4,27,6],[30,4,30,6],[29,0,30,3],[42,0,43,3],[38,0,39,3],[39,4,39,6],[32,0,33,3],[33,4,33,6],[35,0,36,3]]}
[]
[]
[null,null,null,null,null,null,null,null,null,null,null,null,null,null,null,null,null,null,null,null,null,null,null,null,null,1,"Alectra Utilities Corporation"]
[null,null,null,null,null,null,null,null,null,null,null,null,null,null,null,null,null,null,null,null,null,null,null,null,null,2,"Alectra Utilities Corporation - Brampton service territory"]
[null,null,null,null,null,null,null,null,null,null,null,null,null,null,null,null,null,null,null,null,null,null,null,null,null,3,"Alectra Utilities Corporation - Horizon Utilities service territory"]
[null,null,null,null,null,null,null,null,null,null,null,null,null,null,null,null,null,null,null,null,null,null,null,null,null,4,"Alectra Utilities Corporation - Mississauga service territory"]
[null,null,null,null,null,null,null,null,null,null,null,null,null,null,null,null,null,null,null,null,null,null,null,null,null,5,"Alectra Utilities Corporation - PowerStream service territory"]
[null,null,null,null,null,null,null,null,null,null,null,null,null,null,null,null,null,null,null,null,null,null,null,null,null,6,"Algoma Power Inc."]
[null,null,null,null,null,null,null,null,null,null,null,null,null,null,null,null,null,null,null,null,null,null,null,null,null,7,"Atikokan Hydro Inc."]
[null,null,null,null,null,null,null,null,null,null,null,null,null,null,null,null,null,null,null,null,null,null,null,null,null,8,"Attawapiskat Power Corporation"]
[null,null,null,null,null,null,null,null,null,null,null,null,null,null,null,null,null,null,null,null,null,null,null,null,null,9,"Bluewater Power Distribution Corporation"]
[null,null,null,null,null,null,null,null,null,null,null,null,null,null,null,null,null,null,null,null,null,null,null,null,null,10,"Brantford Power Inc."]
[null,null,null,null,null,null,null,null,null,null,null,null,null,null,null,null,null,null,null,null,null,null,null,null,null,11,"Burlington Hydro Inc."]
[null,null,null,"Utility Name   ","Algoma Power Inc.",null,null,null,null,null,null,null,null,null,null,null,null,null,null,null,null,null,null,null,null,12,"Canadian Niagara Power Inc. (Eastern Ontario Power/Fort Erie/Port Colborne)"]
[null,null,null,null,null,null,null,null,null,null,null,null,null,null,null,null,null,null,null,null,null,null,null,null,null,13,"Centre Wellington Hydro Ltd."]
[null,null,null,"Assigned EB Number","EB-2019-0019",null,null,null,null,null,null,null,null,null,null,null,null,null,null,null,null,null,null,null,null,14,"Chapleau Public Utilities Corporation"]
[null,null,null,null,null,null,null,null,null,null,null,null,null,null,null,null,null,null,null,null,null,null,null,null,null,15,"COLLUS PowerStream Corp."]
[null,null,null,"Name of Contact and Title","Greg Beharriell - Manager, Regulatory Affairs",null,null,null,null,null,null,null,null,null,null,null,null,null,null,null,null,null,null,null,null,16,"Cooperative Hydro Embrun Inc."]
[null,null,null,null,null,null,null,null,null,null,null,null,null,null,null,null,null,null,null,null,null,null,null,null,null,17,"E.L.K. Energy Inc."]
[null,null,null,"Phone Number   ","905-871-0330  ext 3278",null,null,null,null,null,null,null,null,null,null,null,null,null,null,null,null,null,null,null,null,18,"Energy + Inc."]
[null,null,null,null,null,null,null,null,null,null,null,null,null,null,null,null,null,null,null,null,null,null,null,null,null,19,"Enersource Hydro Mississauga Inc."]
[null,null,null,"Email Address   ","regulatoryaffairs@fortisontario.com",null,null,null,null,null,null,null,null,null,null,null,null,null,null,null,null,null,null,null,null,20,"Entegrus Powerlines Inc."]
[null,null,null,null,null,null,null,null,null,null,null,null,null,null,null,null,null,null,null,null,null,null,null,null,null,21,"ENWIN Utilities Ltd."]
[null,null,null,"Test Year",2020,null,null,null,null,null,null,null,null,null,null,null,null,null,null,null,null,null,null,null,null,22,"Erie Thames Powerlines Corporation"]
[null,null,null,null,null,null,null,null,null,null,null,null,null,null,null,null,null,null,null,null,null,null,null,null,null,23,"Espanola Regional Hydro Distribution Corporation"]
[null,null,null,"Bridge Year",{"$f":"IF(ISBLANK(E24), \"\", E24-1)","v":2019},null,null,null,null,null,null,null,null,null,null,null,null,null,null,null,null,null,null,null,null,24,"Essex Powerlines Corporation"]
[null,null,null,null,null,null,null,null,null,null,null,null,null,null,null,null,null,null,null,null,null,null,null,null,null,25,"Festival Hydro Inc."]
[null,null,null,"Last Rebasing Year",2015,null,null,null,null,null,null,null,null,null,null,null,null,null,null,null,null,null,null,null,null,26,"Fort Albany Power Corporation"]
[null,null,null,null,null,null,null,null,null,null,null,null,null,null,null,null,null,null,null,null,null,null,null,null,null,27,"Fort Frances Power Corporation"]
["Identify the accounting standard used for the test year",null,null,null,null,null,null,null,null,null,null,null,null,null,null,null,null,null,null,null,null,null,null,null,null,28,"Greater Sudbury Hydro Inc."]
[null,null,null,null,"MIFRS",null,null,null,null,null,null,null,null,null,null,null,null,null,null,null,null,null,null,null,null,29,"Grimsby Power Inc."]
[null,null,null,null,null,null,null,null,null,null,null,null,null,null,null,null,null,null,null,null,null,null,null,null,null,30,"Guelph Hydro Electric Systems Inc."]
["Did you update your depreciation and capitalization policies and reflect the changes in policies in a prior rebasing application?",null,null,null,null,null,null,null,null,null,null,null,null,null,null,null,null,null,null,null,null,null,null,null,null,31,"Halton Hills Hydro Inc."]
[null,null,null,null,"Yes",null,null,null,null,null,null,null,null,null,null,null,null,null,null,null,null,null,null,null,null,32,"Hearst Power Distribution Company Limited"]
[null,null,null,null,null,null,null,null,null,null,null,null,null,null,null,null,null,null,null,null,null,null,null,null,null,33,"Hydro 2000 Inc."]
["When did you update your actual depreciation and capitalization policies?",null,null,null,null,null,null,null,null,null,null,null,null,null,null,null,null,null,null,null,null,null,null,null,null,34,"Hydro Hawkesbury Inc."]
[null,null,null,null,"2001-01-01",2013,null,null,null,null,null,null,null,null,null,null,null,null,null,null,null,null,null,null,null,35,"Hydro One Networks Inc."]
[null,null,null,null,null,null,null,null,null,null,null,null,null,null,null,null,null,null,null,null,null,null,null,null,null,36,"Hydro One Networks Inc. - Norfolk, Haldimand, Woodstock"]
["Identify the year the applicant adopted IFRS for financial reporting purposes",null,null,null,null,null,null,null,null,null,null,null,null,null,null,null,null,null,null,null,null,null,null,null,null,37,"Hydro One Remote Communities Inc."]
[null,null,null,null,null,null,null,null,null,null,null,null,null,null,null,null,null,null,null,null,null,null,null,null,null,38,"Hydro Ottawa Limited"]
[null,null,null,null,null,null,null,null,null,null,null,null,null,null,null,null,null,null,null,null,null,null,null,null,null,39,"Innpower Corporation"]
[null,null,null,null,null,null,null,null,null,null,null,null,null,null,null,null,null,null,null,null,null,null,null,null,null,40,"Kashechewan Power Corporation"]
["Are you applying for cost recovery for the test and/or future year(s) for Green Energy initiatives?",null,null,null,null,null,null,null,null,null,null,null,null,null,null,null,null,null,null,null,null,null,null,null,null,41,"Kenora Hydro Electric Corporation Ltd."]
[null,null,null,null,"No",null,null,null,null,null,null,null,null,null,null,null,null,null,null,null,null,null,null,null,null,42,"Kingston Hydro Corporation"]
[null,null,null,null,null,null,null,null,null,null,null,null,null,null,null,null,null,null,null,null,null,null,null,null,null,43,"Kitchener-Wilmot Hydro Inc."]
[{"$f":"\"Is \" & E14 & \" an embedded distributor?\"","v":"Is Algoma Power Inc. an embedded distributor?"},null,null,null,"No",null,null,null,null,null,null,null,null,null,null,null,null,null,null,null,null,null,null,null,null,44,"Lakefront Utilities Inc."]
[null,null,null,null,null,null,null,null,null,null,null,null,null,null,null,null,null,null,null,null,null,null,null,null,null,45,"Lakeland Power Distribution Ltd."]
[null,null,null,null,null,null,null,null,null,null,null,null,null,null,null,null,null,null,null,null,null,null,null,null,null,46,"London Hydro Inc."]
[null,"Notes",null,null,null,null,null,null,null,null,null,null,null,null,null,null,null,null,null,null,null,null,null,null,null,47,"Midland Power Utility Corporation"]
[null,null,null,null,null,null,null,null,null,null,null,null,null,null,null,null,null,null,null,null,null,null,null,null,null,48,"Milton Hydro Distribution Inc."]
[null,null,"Pale green cells represent input cells.",null,null,null,null,null,null,null,null,null,null,null,null,null,null,null,null,null,null,null,null,null,null,49,"Newmarket-Tay Power Distribution Ltd."]
[null,null,null,null,null,null,null,null,null,null,null,null,null,null,null,null,null,null,null,null,null,null,null,null,null,50,"Niagara Peninsula Energy Inc."]
[null,null,"Pale blue cells represent drop-down lists.  The applicant should select the appropriate item from the drop-down list.",null,null,null,null,null,null,null,null,null,null,null,null,null,null,null,null,null,null,null,null,null,null,51,"Niagara-on-the-Lake Hydro Inc."]
[null,null,null,null,null,null,null,null,null,null,null,null,null,null,null,null,null,null,null,null,null,null,null,null,null,52,"North Bay Hydro Distribution Limited"]
[null,null,"White cells contain fixed values, automatically generated values or formulae. ",null,null,null,null,null,null,null,null,null,null,{"$f":"IF(LEN($G55)>1, (SUMPRODUCT(--($C$78:$C$1000=$C55),--($A$78:$A$1000=$D55), --($B$78:$B$1000=$B55&\"_TOTAL\"), $L$78:$L$1000)), \"\")","v":""},{"$f":"IF(LEN($G55)>1, (SUMPRODUCT(--($C$78:$C$1000=$C55),--($A$78:$A$1000=$D55), --($B$78:$B$1000=$B55&\"_TOTAL\"), $M$78:$M$1000)), \"\")","v":""},null,null,null,null,null,null,null,null,null,null,53,"Northern Ontario Wires Inc."]
[null,null,null,null,null,null,null,null,null,null,null,null,null,{"$f":"IF(LEN($G56)>1, (SUMPRODUCT(--($C$78:$C$1000=$C56),--($A$78:$A$1000=$D56), --($B$78:$B$1000=$B56&\"_TOTAL\"), $L$78:$L$1000)), \"\")","v":""},{"$f":"IF(LEN($G56)>1, (SUMPRODUCT(--($C$78:$C$1000=$C56),--($A$78:$A$1000=$D56), --($B$78:$B$1000=$B56&\"_TOTAL\"), $M$78:$M$1000)), \"\")","v":""},null,null,null,null,null,null,null,null,null,null,54,"Oakville Hydro Electricity Distribution Inc."]
[null,null,null,null,null,null,null,null,null,null,null,null,null,"","",null,null,null,null,null,null,null,null,null,null,55,"Orangeville Hydro Limited"]
[null,null,null,null,null,null,null,null,null,null,null,null,null,"","",null,null,null,null,null,null,null,null,null,null,56,"Orillia Power Distribution Corporation"]
[null,null,null,null,null,null,null,null,null,null,null,null,null,"","",null,null,null,null,null,null,null,null,null,null,57,"Oshawa PUC Networks Inc."]
[null,null,null,null,null,null,null,null,null,null,null,null,null,"","",null,null,null,null,null,null,null,null,null,null,58,"Ottawa River Power Corporation"]
[null,null,null,null,null,null,null,null,null,null,null,null,null,"","",null,null,null,null,null,null,null,null,null,null,59,"Peterborough Distribution Inc."]
[null,null,null,null,null,null,null,null,null,null,null,null,null,"","",null,null,null,null,null,null,null,null,null,null,60,"PUC Distribution Inc."]
[null,null,null,null,null,null,null,null,null,null,null,null,null,"","",null,null,null,null,null,null,null,null,null,null,61,"Renfrew Hydro Inc."]
[null,null,null,null,null,null,null,null,null,null,null,null,null,"","",null,null,null,null,null,null,null,null,null,null,62,"Rideau St. Lawrence Distribution Inc."]
[null,null,null,null,null,null,null,null,null,null,null,null,null,"","",null,null,null,null,null,null,null,null,null,null,63,"Sioux Lookout Hydro Inc."]
[null,null,null,null,null,null,null,null,null,null,null,null,null,"","",null,null,null,null,null,null,null,null,null,null,64,"St. Thomas Energy Inc."]
[null,null,null,null,null,null,null,null,null,null,null,null,null,"","",null,null,null,null,null,null,null,null,null,null,65,"Thunder Bay Hydro Electricity Distribution Inc."]
[null,null,null,null,null,null,null,null,null,null,null,null,null,"","",null,null,null,null,null,null,null,null,null,null,66,"Tillsonburg Hydro Inc."]
[null,null,null,null,null,null,null,null,null,null,null,null,null,"","",null,null,null,null,null,null,null,null,null,null,67,"Toronto Hydro-Electric System Limited"]
[null,null,null,null,null,null,null,null,null,null,null,null,null,"","",null,null,null,null,null,null,null,null,null,null,68,"Veridian Connections Inc."]
[null,null,null,null,null,null,null,null,null,null,null,null,null,"","",null,null,null,null,null,null,null,null,null,null,69,"Wasaga Distribution Inc."]
[null,null,null,null,null,null,null,null,null,null,null,null,null,"","",null,null,null,null,null,null,null,null,null,null,70,"Waterloo North Hydro Inc."]
[null,null,null,null,null,null,null,null,null,null,null,null,null,"","",null,null,null,null,null,null,null,null,null,null,71,"Welland Hydro-Electric System Corp."]
[null,null,null,null,null,null,null,null,null,null,null,null,null,"","",null,null,null,null,null,null,null,null,null,null,72,"Wellington North Power Inc."]
[null,null,null,null,null,null,null,null,null,null,null,null,null,null,null,null,null,null,null,null,null,null,null,null,null,73,"West Coast Huron Energy Inc."]
[null,null,null,null,null,null,null,null,null,null,null,null,null,null,null,null,null,null,null,null,null,null,null,null,null,74,"Westario Power Inc."]
[null,null,null,null,null,null,null,null,null,null,null,null,null,null,null,null,null,null,null,null,null,null,null,null,null,75,"Whitby Hydro Electric Corporation"]

{"sheet":"Index","index":1,"n_rows":42,"n_cols":6,"rows_kept":42,"cut":false,"hidden":false,"merged":[[41,1,41,5]]}
[]
[]
[]
[]
[]
[]
[]
[]
[]
[]
[]
[]
[]
[]
[1,"LDC Information Sheet",null,null,20,"App.2-G: Service Reliability Indicators"]
[2,"Index",null,null,21,"App.2-H: Other Operating Revenue (TO BE UPDATED AT THE DRAFT RATE ORDER STAGE)"]
[3,"Cost of Service Application Flowchart",null,null,22,"App.2-I: Load Forecast CDM Adjustment Workform"]
[4,"List of Key References",null,null,23,"App.2-IA: Load Forecast Data Instructions"]
[5,"App.2-A: List of Requested Approvals",null,null,24,"App.2-IB:  Actual and Forecast Load and Customer Data"]
[6,"App.2-AA: Capital Projects Table",null,null,25,"App.2-JA: OM&A Summary Analysis (TO BE UPDATED AT THE DRAFT RATE ORDER STAGE) "]
[7,"App.2-AB: Capital Expenditures (TO BE UPDATED AT THE DRAFT RATE ORDER STAGE)",null,null,26,"App.2-JB: Recoverable OM&A Cost Driver Table"]
[8,"App. 2-AC: Customer Engagement Worksheet",null,null,27,"App.2-JC: OM&A Programs Table"]
[9,"App.2-B: General Accounting Instructions",null,null,28,"App.2-K: Employee Costs (TO BE UPDATED AT THE DRAFT RATE ORDER STAGE)"]
[10,"App.2-BA: Fixed Asset Continuity Schedule",null,null,29,"App.2-L: Recoverable OM&A Cost per Customer and per FTE"]
[11,"Appendix 2-BB: Service Life Comparison",null,null,30,"App.2-M: Regulatory Costs Schedule (TO BE UPDATED AT THE DRAFT RATE ORDER STAGE)"]
[12,"App.2-C_DepExp: Depreciation and Amortization Expense",null,null,31,"App.2-N: Shared Services and Corporate Cost Allocation"]
[13,"App.2-D: Overhead Expenses",null,null,32,"App.2-OA: Capital Structure and Cost of Capital"]
[14,"App.2-EA: Account 1575 PP&E Deferral Account (2015 IFRS Adopters) - CONTACT OEB STAFF IF TAB REQUIRED",null,null,33,"App.2-OB: Debt Instruments"]
[15,"App.2-EB: Account 1576 - Accounting Changes Under CGAAP (2012 Changes) - CONTACT OEB STAFF IF TAB REQUIRED",null,null,34,"App.2-Q: Cost of Serving Embedded Distributor(s)"]
[16,"App.2-EC: Account 1576 - Accounting Changes Under CGAAP (2013 Changes) - CONTACT OEB STAFF IF TAB REQUIRED",null,null,35,"App.2-R: Loss Factors"]
[17,"App.2-FA: Renewable Generation Connection Investment Summary (TO BE UPDATED AT THE DRAFT RATE ORDER STAGE)",null,null,36,"App.2-S: Stranded Meter Treatment"]
[18,"App.2-FB: Calculation of Renewable Generation Connection Direct Benefits/Provincial Amount: Renewable Enabling Improvement Investments (TO BE UPDATED AT THE DRAFT RATE ORDER STAGE)",null,null,37,"App.2-Y: Transition to MIFRS Summary Impact - CONTACT OEB STAFF IF TAB REQUIRED"]
[19,"App.2-FC: Calculation of Renewable Generation Connection Direct Benefits/Provincial Amount: Renewable Expansion Investments (TO BE UPDATED AT THE DRAFT RATE ORDER STAGE)",null,null,38,"App.2-YA: One-Time Incremental IFRS Transition Costs - CONTACT OEB STAFF IF TAB REQUIRED"]
[null,null,null,null,39,"App.2-Z: Commodity Expense"]
[]
[]
[]
[]
[]
[]
[]
["Note:","Appendices for the Tariff of Rates and Charges at Current and Proposed Rates, and for the Bill Impacts are now in a separate spreadsheet model. These appendices were formerly 2-Z and 2-W."]

{"sheet":"COS Flowchart","index":2,"n_rows":6,"n_cols":2,"rows_kept":6,"cut":false,"hidden":false,"merged":[[5,1,5,6],[2,1,2,6],[3,1,3,6]]}
[]
[]
[]
[null,"Cost of Service Rate Application Schematic"]
[]
[null,"The Cost of Service Rate Application Schematic is a flowchart that is included as a guide for the components of an application. The schematic demonstrates how demand and costs interrelate to derive the revenue requirement and how the revenue requirement is allocated between classes and through fixed/variable splits to derive rates that will be compensatory for the annual revenue requirement, based on the the forecasted demand.  There is no form to be filled out; therefore, this Schedule is not required to be filed."]

{"sheet":"List of Key References","index":3,"n_rows":4,"n_cols":2,"rows_kept":4,"cut":false,"hidden":false,"merged":[[1,1,1,11],[3,0,3,11]]}
[]
[null,"List of Key References"]
[]
["A list of key references for understanding the Filing Requirements has been embedded in the document below. To access the list of references and associated hyperlinks double-click the icon below."]

{"sheet":"App.2-A_Requested_Approvals","index":4,"n_rows":46,"n_cols":8,"rows_kept":46,"cut":false,"hidden":false,"merged":[[13,1,13,7],[15,1,15,7],[17,1,17,7],[19,5,19,7],[43,5,43,7],[45,5,45,7],[41,5,41,7],[8,1,8,7],[33,5,33,7],[35,5,35,7],[37,5,37,7],[39,5,39,7],[9,1,9,7],[11,1,11,7],[29,5,29,7],[23,5,23,7],[25,5,25,7],[27,5,27,7],[31,5,31,7],[21,5,21,7]]}
[" ",null,null,null,null,null,"File Number:",{"$f":"EBNUMBER","v":"EB-2019-0019"}]
[null,null,null,null,null,null,"Exhibit:",1]
[null,null,null,null,null,null,"Tab:"]
[null,null,null,null,null,null,"Schedule:"]
[null,null,null,null,null,null,"Page:"]
[]
[null,null,null,null,null,null,"Date:","2019-06-03"]
[]
[null,"Appendix 2-A"]
[null,"List of Requested Approvals"]
[]
[null,"The distributor must fill out the following sheet with the complete list of specific approvals requested and relevant section(s) of the legislation must be provided. All approvals, including accounting orders (deferral and variance accounts) new rate classes, revised specific service charges or retail service charges which the applicant is seeking, must be separately identified, as well being clearly documented in the appropriate sections of the application."]
[]
[null,"Additional requests may be added by copying and pasting blank input rows, as needed."]
[]
[null,"If additional requests arise, or requested approvals are removed, during the processing of the application, the distributor should update this list."]
[]
[null,{"$f":"CONCATENATE('LDC Info'!E14,\" is seeking the following approvals in this application:\")","v":"Algoma Power Inc. is seeking the following approvals in this application:"}]
[]
[null,1,null,null,null,"Approval to charge distribution rates effective January 1, 2020 to recover a base revenue requirement of $25,885,176, which includes a revenue deficiency of $2,192,853 as detailed in Exhibit 6.  The schedule of proposed rates is set out in Exhibit 8"]
[]
[null,2,null,null,null,"Approval of the 2020 RRRP Adjustment Factor and the 2020 RRRP Funding amount payable to API, as described in Exhibit 8"]
[]
[null,3,null,null,null,"Approval to adjust the Retail Transmission Rates – Network and Connection as calculated in Exhibit 8"]
[]
[null,4,null,null,null,"Approval of the proposed loss factors as calculated in Exhibit 8"]
[]
[null,5,null,null,null,"Approval to continue to charge Wholesale Market and Rural Rate Protection Charges approved in the Board Decision and Order in the matter of EB-2018-0294"]
[]
[null,6,null,null,null,"Approval of the Distribution System Plan included in Exhibit 2"]
[]
[null,7,null,null,null,"Approval of the rate riders for disposition of the Deferral and Variance Accounts, including LRAMVA, as detailed in Exhibit 9"]
[]
[null,8,null,null,null,"Approval for Advanced Capital Module (“ACM”) treatment of the 2021 Echo River TS Project and the 2022 Sault Facility Project, as described in Exhibit 2 and the DSP"]
[]
[null,9,null,null,null,"Approval of API’s proposed approach for ACM cost recovery in consideration of the RRRP framework, as detailed in Section 1.3.5"]
[]
[null,10,null,null,null,"Such other approvals that API may request and that the OEB accepts"]
[]
[null,11,null,null,null,"[Intentionally withdrawn June 3, 2019]"]
[]
[null,12,null,null,null,"Approval of API’s methodology for allocating costs attributable to the Dubreuilville service area, as summarized in Section 1.3.7"]
[]
[null,13,null,null,null,"Approval of API’s methodologies with respect to ongoing disposition of the Interim Licence Deferral account and with respect to recovery of costs recorded in the Transaction and Integration Costs Deferral Account, both in relation to the Dubreuilville service area, as summarized in Section 1.3.7"]
[]
[null,14,null,null,null,"Approval to resume charging Seasonal rate class customers a rate rider of $0.0307/kWh related to the Disposition of Account 1574, effective no later than January 1, 2020, as summarized in Section 1.3.8"]

{"sheet":"App.2-AA_Cap Proj_SysAccess","index":5,"n_rows":31,"n_cols":9,"rows_kept":31,"cut":false,"hidden":false,"merged":[[8,0,8,8],[9,0,9,8]]}
[null,null,null,null,null,null,"File Number:",{"$f":"EBNUMBER","v":"EB-2019-0019"}]
[null,null,null,null,null,null,"Exhibit:",2]
[null,null,null,null,null,null,"Tab:"]
[null,null,null,null,null,null,"Schedule:"]
[null,null,null,null,null,null,"Page:"]
[]
[null,null,null,null,null,null,"Date:","2019-09-24"]
[]
["Appendix 2-AA"]
["Capital Projects Table"]
[]
["Reporting Basis","Reporting Basis",null,"MIFRS","MIFRS","MIFRS","MIFRS","MIFRS","MIFRS"]
["Projects","Projects","USoA ",2015,2016,2017,2018,2019,2020]
[]
["System Access","System Access",null,{"$f":"D13","v":2015},{"$f":"E13","v":2016},2017,2018,2019,2020]
[null,"New Meters",null,63906.909999999996,102942.49,107366.97,23492.1,48113.64,67398.600000000006]
[null,"New Cust Additions OH - Wawa",null,70247.12,80786.850000000006,73580.12,79069.930000000008,94194.72,87706.2]
[null,"New Transformers - Service",null,31139.200000000001,128823.29,42080.44,63462.979999999996,76800,76800]
[null,"New Cust Additions OH - Desb",null,76597.01999999999,232268.00000000003,225733.05000000008,267188.54999999993,233482.92,224736.96]
[null,"New Cust Additions UG - Desb",null,269617.15999999997,2644.0299999999997,1927,-820.26,11186.16,11441.52]
[null,"New Cust Additions OH - Sault",null,187802.99999999997,364253.69000000006,431991.76999999996,469220.35000000003,391586.88,367882.2]
[null,"New Cust Additions UG - Sault",null,221692.06,13742.570000000002,0,654,17713.68,16562.04]
[]
[null,"Miscellaneous SA",null,42142.35,66079.839999999997,495.06,58003.71,39626.160000000003,50879.519999999997]
[]
["Contributed Capital"]
[null,null,null,-147270.49,71036.3,-78474.98,-64304.36,-140000,-101850]
[]
[]
[]
["Total  System Access",{"$f":"A31","v":"Total  System Access"},null,{"$f":"SUM(D16:D25)+SUM(D27:D30)","v":815874.33},1062577.06,804699.43000000017,895966.99999999988,772704.16000000015,801557.04]

{"sheet":"App.2-AA_Cap Proj_SysRen","index":6,"n_rows":62,"n_cols":9,"rows_kept":62,"cut":false,"hidden":false,"merged":[[8,0,8,8],[9,0,9,8]]}
[null,null,null,null,null,null,"File Number:",{"$f":"EBNUMBER","v":"EB-2019-0019"}]
[null,null,null,null,null,null,"Exhibit:",2]
[null,null,null,null,null,null,"Tab:"]
[null,null,null,null,null,null,"Schedule:"]
[null,null,null,null,null,null,"Page:"]
[]
[null,null,null,null,null,null,"Date:","2019-09-24"]
[]
["Appendix 2-AA"]
["Capital Projects Table"]
[]
["Reporting Basis","Reporting Basis",null,"MIFRS","MIFRS","MIFRS","MIFRS","MIFRS","MIFRS"]
["Projects","Projects","USoA ",2015,2016,2017,2018,2019,2020]
[]
["System Renewal","System Renewal",null,{"$f":"D13","v":2015},{"$f":"E13","v":2016},2017,2018,2019,2020]
[null,"API Storm Rebuilds - Wawa",null,34816.83,35338.899999999994,35514.400000000001,0,40648.32,40315.800000000003]
[null,"API Storm Rebuilds - Desbarats",null,98145.15,34910.090000000004,137605.43000000002,28978.68,109033.32,98219.4]
[null,"API Storm Rebuilds - Sault",null,60314.099999999991,49515.840000000004,43062.05000000001,31584.039999999997,71095.08,66796.56]
[null,"API Small Lines Capital - Wawa",null,128955.30999999998,192946.06000000003,75220.39,66815.06,94415.88,103239.6]
[null,"API Small Lines Capital - Desb.",null,224607.18999999992,160131.52000000002,95726.28,171560.08999999994,129149.64,139177.56]
[null,"API Small Lines Capital - Sault",null,211994.96999999997,101782.34999999999,144253.15999999997,179743.32999999996,132131.88,150142.68]
[null,"API Replace Recloser, Regulator, etc.",null,107832.95,101948.72,82299.02,98452.97,80223.520000000004,81828]
[null,"Cond Repl - Centre Line Rd. (Phase 2)",null,188405.51]
[null,"Cond Repl - Neal Dr, Old Moffat Bay, Big Pit",null,143516.47]
[null,"Line Rebuild - Along Hwy 17 North from MTO yard to Northwood Dr",null,468411.64]
[null,"Line Rebuild - 20th Side Rd/I Line/V Line Rd SJI",null,383503.95999999996]
[null,"Pole Replacement From Pole Testing Program",null,{"$f":"132723.77+105120.66","v":237844.43},181082.92,128962.79,{"$f":"282271.05+147977.46","v":430248.51}]
[null,"Line Rebuild - Along Hwy 17 South of Frater Rd",null,null,519321.81000000006]
[null,"Line Rebuild - Shore Rd",null,null,307700.5]
[null,"Line Rebuild - River side, Lake side off Boyles side Rd",null,null,293597.28999999998]
[null,"Line Rebuild - Tamawa Rd off Hwy 17N",null,null,242072.01999999996]
[null,"Line Rebuild - Four Seasons Drive",null,null,183677.80000000002]
[null,"Line Rebuild - Hillton Rd (Base Line to Hilton Beach)",null,null,177364.26]
[null,"Line Rebuild - HWY17 Batchewana Bay P102-P129",null,null,114819,164194.98000000001]
[null,"Line Rebuild - Hwy 532 to end of line",null,null,null,648568.81999999995,157273.97]
[null,"Line Rebuild - HWY17 Wawa P1-P110",null,null,null,472635.38000000006]
[null,"Line Rebuild - Hwy 552 West",null,null,null,258639.34]
[null,"Line Rebuild - B-Line",null,null,null,180631.33000000002]
[null,"Line Rebuild - Hwy17N at step up xfmr to mirian lake",null,null,null,156152.55000000002,677495.81]
[null,"Line Rebuild - Pancake to Mamainse",null,null,null,null,604454.61]
[null,"Line Rebuild - Hwy 17W of MacLennan Rd",null,null,null,null,343873.16]
[null,"Line Rebuild - Mackay to Rabbit Blanket - Eng",null,null,null,null,236771.94]
[null,"Line Rebuild - 10th Side Rd (f&g to d line)",null,null,null,null,215151.39]
[null,"Line Rebuild - F&G Line between 10th Side & A Line",null,null,null,null,151328.17000000001]
[null,"Line Rebuild - McKinley Ave Wawa",null,null,null,null,114559.7]
[null,"Line Rebuilds (See DSP for Add'l Detail)",null,null,null,null,null,3380788.68,2783071.56]
[null,"Wawa 34kV Rebuild",null,519281.73000000004,null,191760.92,374368.89]
[null,"No 4 Circuit Rebuild",null,164269.66,1038638.5499999999,272240.24999999994,612436.36999999988]
[null,"API SubTransmission Rebuilds (Small)",null,72824.87,11574,8270,82614.63]
[null,"SubTransmission Rebuilds (See DSP for Add'l Detail)",null,null,null,null,null,969206.76,912061.08]
[null,"API NewTransf-Replace Failed/End of Life",null,53455.44,18762.240000000002,29165.99,30203.14,76800,76800]
[null,"API Substation Small Capital",null,61118.45,63503.78,50034,2660,60364.08,42740.160000000003]
[null,"Substation Capital - Dubr",null,null,null,null,null,null,{"$f":"1245948.84+250000","v":1495948.84}]
[]
[null,"Miscellaneous SR",null,649357.91,400230.86000000004,258952.80000000002,360113.81,0,{"$f":"24797.52+8038","v":32835.520000000004}]
[null," "]
["Contributed Capital"]
[null,null,null,0,-43751.96,-54003.21,-4959.3100000000004]
[]
[]
[]
["Total System Renewal",{"$f":"A62","v":"Total System Renewal"},null,{"$f":"SUM(D16:D56)+SUM(D58:D61)","v":3808656.5700000003},4185166.55,3379886.67,4965728.96,5143857.16,6023176.7599999998]

{"sheet":"App.2-AA_Cap Proj_SysServ","index":7,"n_rows":25,"n_cols":9,"rows_kept":25,"cut":false,"hidden":false,"merged":[[9,0,9,8],[8,0,8,8]]}
[null,null,null,null,null,null,"File Number:",{"$f":"EBNUMBER","v":"EB-2019-0019"}]
[null,null,null,null,null,null,"Exhibit:",2]
[null,null,null,null,null,null,"Tab:"]
[null,null,null,null,null,null,"Schedule:"]
[null,null,null,null,null,null,"Page:"]
[]
[null,null,null,null,null,null,"Date:","2019-09-24"]
[]
["Appendix 2-AA"]
["Capital Projects Table"]
[]
["Reporting Basis","Reporting Basis",null,"MIFRS","MIFRS","MIFRS","MIFRS","MIFRS","MIFRS"]
["Projects","Projects","USoA ",2015,2016,2017,2018,2019,2020]
[]
["System Service","System Service",null,{"$f":"D13","v":2015},{"$f":"E13","v":2016},2017,2018,2019,2020]
[null,"API New Transf-Volt Conv/Capacity Incr",null,19589.82,62243.05,26424.82,47179.72,38400,38400]
[null,"Hawk Junction DS rebuild",null,2805051.98,771046.46]
[null,"API Protection Automation Reliability",null,102675,156669.01999999999,16486.439999999999,122336.82,286943.82,256832.16]
[null,"API Sub/Subtrans Reliability Improvement",null,105951.45,0,16445.91,122499.78,263346.18,267093.71999999997]
[null,"API Desbarats DS Projects",null,null,null,1377.52,47015.82,279624.7]
[null,"Mackay API primary metering relocation",null,null,null,131704.74]
[]
["Contributed Capital"]
[null,null,null,0,0,0,0,0,0]
["Total System Service",{"$f":"A25","v":"Total System Service"},null,{"$f":"SUM(D16:D22)+SUM(D24:D24)","v":3033268.25},989958.53,192439.43,339032.14,868314.7,562325.88]

{"sheet":"App.2-AA_Cap Proj_GenPlant","index":8,"n_rows":31,"n_cols":9,"rows_kept":31,"cut":false,"hidden":false,"merged":[[8,0,8,7],[9,0,9,7]]}
[null,null,null,null,null,null,"File Number:",{"$f":"EBNUMBER","v":"EB-2019-0019"}]
[null,null,null,null,null,null,"Exhibit:",2]
[null,null,null,null,null,null,"Tab:"]
[null,null,null,null,null,null,"Schedule:"]
[null,null,null,null,null,null,"Page:"]
[]
[null,null,null,null,null,null,"Date:","2019-09-24"]
[]
["Appendix 2-AA"]
["Capital Projects Table"]
[]
["Reporting Basis","Reporting Basis",null,"MIFRS","MIFRS","MIFRS","MIFRS","MIFRS","MIFRS"]
["Projects","Projects","USoA ",2015,2016,2017,2018,2019,2020]
[]
["General Plant","General Plant",null,{"$f":"D13","v":2015},{"$f":"E13","v":2016},2017,2018,2019,2020]
[null,"API Right Of Way Expansion and Access",null,1715770.9,1554505.2200000002,1563219.53,1129614.8700000001,97335.6,99660.36]
[null,"API Distribution Tools & Equipment",null,45316.46,60944.200000000004,109171.76,82853.570000000007,94360.44,96247.679999999993]
[null,"API Vegetation Mgmt System Development",null,110660.08,21318.2,436.5,210]
[null,"API Land Rights",null,29159.25,30833.690000000002,15958.03,51962.450000000004,25809.24,28605]
[null,"API  SCADA",null,51694.94,9814.85,4916.4399999999996,15186.44,93599.28,92879.88]
[null,"API Transportation & Work Equipment",null,437311.3,537568.73,605783.73,454300.34,621412.80000000005,661608.95999999996]
[null,"API  IT - Hardware",null,178079.7,32949.78,60353.5,126128,149001.60000000001,227400]
[null,"API-Specific Engineering Soft. Develop.",null,41322.629999999997,39713,115254,114122.59,63912.959999999999,38979.72]
[null,"API Building Desbarats",null,26004.86,30666.55,4878.3900000000003,875895.09,103733.52,24153.599999999999]
[null,"API Building Wawa",null,326920.28000000003,33520.17,404370.35,299577.74,154892.88,24153.599999999999]
[]
[null,"Miscellaneous GP",null,121652.49,17308.32,78455.66,90392.22,95729.76,63028.08]
[]
["Contributed Capital"]
[null,null,null,-9847.5,0,-4054.12,0]
["Total General Plant",{"$f":"A31","v":"Total General Plant"},null,{"$f":"SUM(D16:D28)+SUM(D30:D30)","v":3074045.3899999997},2369142.7099999995,2958743.7700000005,3240243.31,1499788.0800000003,1356716.8800000001]

{"sheet":"App.2-AB_Capital Expenditures","index":9,"n_rows":38,"n_cols":37,"rows_kept":38,"cut":false,"hidden":false,"merged":[[13,32,14,32],[15,10,15,11],[15,1,15,2],[26,0,26,32],[15,13,15,14],[15,16,15,17],[15,19,15,20],[15,22,15,23],[15,25,15,26],[8,0,8,32],[9,0,9,32],[13,19,13,21],[13,22,13,24],[13,25,13,27],[13,28,14,28],[13,29,14,29],[12,1,12,27],[13,10,13,12],[13,1,13,3],[12,0,15,0],[12,28,12,32],[13,13,13,15],[13,16,13,18],[13,30,14,30],[13,31,14,31],[13,34,13,36],[15,34,15,35],[34,0,35,32],[37,0,38,32],[36,0,36,32],[29,0,29,32],[30,0,30,32],[31,0,32,32],[33,0,33,32],[27,0,27,32],[25,0,25,32],[13,7,13,9],[15,7,15,8],[13,4,13,6],[15,4,15,5],[15,28,15,32]]}
[null,null,null,null,null,null,null,null,null,null,null,null,null,null,null,null,null,null,null,null,null,null,null,null,null,null,null,null,null,null,"File Number:",null,{"$f":"EBNUMBER","v":"EB-2019-0019"}]
[null,null,null,null,null,null,null,null,null,null,null,null,null,null,null,null,null,null,null,null,null,null,null,null,null,null,null,null,null,null,"Exhibit:",null,2]
[null,null,null,null,null,null,null,null,null,null,null,null,null,null,null,null,null,null,null,null,null,null,null,null,null,null,null,null,null,null,"Tab:"]
[null,null,null,null,null,null,null,null,null,null,null,null,null,null,null,null,null,null,null,null,null,null,null,null,null,null,null,null,null,null,"Schedule:"]
["TO BE UPDATED AT THE DRAFT RATE ORDER STAGE",null,null,null,null,null,null,null,null,null,null,null,null,null,null,null,null,null,null,null,null,null,null,null,null,null,null,null,null,null,"Page:"]
[]
[null,null,null,null,null,null,null,null,null,null,null,null,null,null,null,null,null,null,null,null,null,null,null,null,null,null,null,null,null,null,"Date:",null,"2019-09-24"]
[]
["Appendix 2-AB"]
["Table 2 - Capital Expenditure Summary from Chapter 5 Consolidated\nDistribution System Plan Filing Requirements"]
["First year of Forecast Period:"]
[{"$f":"TestYear","v":2020}]
["CATEGORY","Historical Period (previous plan1 & actual)",null,null,null,null,null,null,null,null,null,null,null,null,null,null,null,null,null,null,null,null,null,null,null,null,null,null,"Forecast Period (planned)"]
[null,{"$f":"E14-1","v":2011},null,null,{"$f":"H14-1","v":2012},null,null,{"$f":"K14-1","v":2013},null,null,{"$f":"N14-1","v":2014},null,null,{"$f":"Q14-1","v":2015},null,null,{"$f":"T14-1","v":2016},null,null,{"$f":"W14-1","v":2017},null,null,{"$f":"Z14-1","v":2018},null,null,{"$f":"AC14-1","v":2019},null,null,{"$f":"A12","v":2020},{"$f":"AC14+1","v":2021},{"$f":"AD14+1","v":2022},{"$f":"AE14+1","v":2023},{"$f":"AF14+1","v":2024},null,2015]
[null,"Plan","Actual","Var","Plan","Actual","Var","Plan","Actual","Var","Plan","Actual","Var","Plan","Actual","Var","Plan","Actual","Var","Plan","Actual","Var","Plan","Actual","Var","Plan","Actual2","Var",null,null,null,null,null,null,"Plan","Actual","Var"]
[null,"$ '000",null,"%","$ '000",null,"%","$ '000",null,"%","$ '000",null,"%","$ '000",null,"%","$ '000",null,"%","$ '000",null,"%","$ '000",null,"%","$ '000",null,"%","$ '000",null,null,null,null,null,"$ '000",null,"%"]
["System Access",null,null,{"$f":"IF(ISERROR((C17-B17)/B17),\"--\",(C17-B17)/B17)","v":"--"},null,null,{"$f":"IF(ISERROR((F17-E17)/E17),\"--\",(F17-E17)/E17)","v":"--"},null,null,{"$f":"IF(ISERROR((I17-H17)/H17),\"--\",(I17-H17)/H17)","v":"--"},null,null,{"$f":"IF(ISERROR((L17-K17)/K17),\"--\",(L17-K17)/K17)","v":"--"},null,null,{"$f":"IF(ISERROR((O17-N17)/N17),\"--\",(O17-N17)/N17)","v":"--"},1020,991.54075999999998,{"$f":"IF(ISERROR((R17-Q17)/Q17),\"--\",(R17-Q17)/Q17)","v":-2.790121568627453E-2},1020,883.17441000000019,{"$f":"IF(ISERROR((U17-T17)/T17),\"--\",(U17-T17)/T17)","v":-0.13414273529411747},1020,960.27135999999985,{"$f":"IF(ISERROR((X17-W17)/W17),\"--\",(X17-W17)/W17)","v":-5.8557490196078581E-2},1020,912.70416000000012,{"$f":"IF(ISERROR((AA17-Z17)/Z17),\"--\",(AA17-Z17)/Z17)","v":-0.10519199999999988},903.40704000000005,963,930,906,906,null,1020,963.14481999999998,{"$f":"IF(ISERROR((AJ17-AI17)/AI17),\"--\",(AJ17-AI17)/AI17)","v":-5.5740372549019625E-2}]
["System Renewal",null,null,{"$f":"IF(ISERROR((C18-B18)/B18),\"--\",(C18-B18)/B18)","v":"--"},null,null,{"$f":"IF(ISERROR((F18-E18)/E18),\"--\",(F18-E18)/E18)","v":"--"},null,null,{"$f":"IF(ISERROR((I18-H18)/H18),\"--\",(I18-H18)/H18)","v":"--"},null,null,{"$f":"IF(ISERROR((L18-K18)/K18),\"--\",(L18-K18)/K18)","v":"--"},null,null,{"$f":"IF(ISERROR((O18-N18)/N18),\"--\",(O18-N18)/N18)","v":"--"},4834,4228.9185099999995,{"$f":"IF(ISERROR((R18-Q18)/Q18),\"--\",(R18-Q18)/Q18)","v":-0.12517200868845688},4834,3433.8898799999997,{"$f":"IF(ISERROR((U18-T18)/T18),\"--\",(U18-T18)/T18)","v":-0.28963800579230459},4834,4970.6882699999996,{"$f":"IF(ISERROR((X18-W18)/W18),\"--\",(X18-W18)/W18)","v":2.8276431526685901E-2},4834,5143.8571600000005,{"$f":"IF(ISERROR((AA18-Z18)/Z18),\"--\",(AA18-Z18)/Z18)","v":6.4099536615639316E-2},6023.1767599999994,4700,4822,6494,4616,null,4044,3808.6565700000001,{"$f":"IF(ISERROR((AJ18-AI18)/AI18),\"--\",(AJ18-AI18)/AI18)","v":-5.8195704747774454E-2}]
["System Service",null,null,"--",null,null,"--",null,null,"--",null,null,"--",null,null,"--",538,989.95853,0.8400716171003717,5088,192.43942999999999,-0.96217778498427664,538,339.03214000000003,-0.36982873605947952,538,868.3146999999999,0.61396784386617087,562.32587999999998,7978,472,461,461,null,1232,3033.2682500000001,1.4620683847402598]
["General Plant",null,null,"--",null,null,"--",null,null,"--",null,null,"--",null,null,"--",2679,2369.1427099999996,-0.11566154908547979,2529,2962.7978900000007,0.17152941478845424,2029,3240.2433099999998,0.59696565303104965,1029,1499.7880800000003,0.45752000000000026,1356.7168800000002,1238,15408,1178,1098,null,2679,3083.8928899999996,0.15113583053378113]
["TOTAL EXPENDITURE",{"$f":"SUM(B17:B20)","v":0},{"$f":"SUM(C17:C20)","v":0},"--",{"$f":"SUM(E17:E20)","v":0},{"$f":"SUM(F17:F20)","v":0},"--",{"$f":"SUM(H17:H20)","v":0},{"$f":"SUM(I17:I20)","v":0},"--",{"$f":"SUM(K17:K20)","v":0},{"$f":"SUM(L17:L20)","v":0},"--",{"$f":"SUM(N17:N20)","v":0},{"$f":"SUM(O17:O20)","v":0},"--",9071,8579.5605099999993,-5.4176991511410061E-2,13471,7472.3016100000013,-0.44530460916041859,8421,9510.2350799999986,0.12934747417171341,7421,8424.6641000000018,0.13524647621614361,8845.6265600000006,14879,21632,9039,{"$f":"SUM(AG17:AG20)","v":7081},null,{"$f":"SUM(AI17:AI20)","v":8975},10888.962530000001,0.21325487799442905]
["Capital Contributions",null,null,"--",null,null,"--",null,null,"--",null,null,"--",null,null,"--",-100,27.284340000000004,-1.2728434,-100,-136.53231,0.36532309999999996,-100,-69.263670000000005,-0.30736329999999995,-100,-140,0.4,-101.85,-100,-100,-100,-100,null,-100,-157.11798999999999,0.57117989999999996]
["Net Capital Expenditures",null,null,"--",null,null,"--",null,null,"--",null,null,"--",null,null,"--",8971,8606.8448499999995,-4.0592481328725949E-2,13371,7335.7693000000017,-0.45136719018771954,8321,9440.9714099999983,0.13459577094099245,7321,8284.6641000000018,0.1316301188362248,{"$f":"AC21+AC22","v":8743.7765600000002},{"$f":"AD21+AD22","v":14779},21532,8939,6981,null,8875,10731.84454,0.20922192000000001]
["System O&M",null,null,"--",null,null,"--",null,null,"--",null,null,"--",null,null,"--",6896.5729199999996,6361.4865800000007,-7.7587280843250908E-2,7034.5043784,6715.3830099999996,-4.536515314140506E-2,7175.1944659680003,6711.6399000000001,-6.4605157137781116E-2,7318.6983552873608,7016.3004299999993,-4.1318539254851981E-2,7080.2471800000012,7186.4508877000007,7294.2476510155002,7403.661365780732,7514.7162862674422,null,6761.3459999999995,6296.4280900000022,-6.8761147558488708E-2]
[]
["Notes to the Table:"]
["1. Historical “previous plan” data is not required unless a plan has previously been filed. However, use the last Board-approved, at least on a Total (Capital) Expenditure basis for the last cost of service rebasing year, and the applicant should include their planned budget in each subsequent historical year up to and including the Bridge Year."]
["2. Indicate the number of months of 'actual' data included in the last year of the Historical Period (normally a 'bridge' year):"]
[]
["Explanatory Notes on Variances (complete only if applicable)"]
["Notes on shifts in forecast vs. historical budgets by category"]
["System Access - costs are customer-driven - declining trend in actuals results in lower budget for forecast period\nSystem Renewal - greater number of substation rebuilds during forecast period\nSystem Service - large substation project (Echo River TS) forecasted in 2021 (not started in 2017 as orignally planned)\nGeneral Plant - new facility construction in 2022; amounts excluding this project are lower than historical due to completion of ROW Hardening program"]
[]
["Notes on year over year Plan vs. Actual variances for Total Expenditures"]
["2015 - primary driver is Hawk Junction (see DSP 4.3.2.1)\n2016 - underspending on SR/GP partially offset by overspending on SS\n2017 - primary drivers are:  Echo River TS project deferred to 2021 and Line Rebuild projects deferred to 2018 due to weather/access\n2018 - primary driver is Desbarats facility (see DSP 4.3.2.3)"]
[]
["Notes on Plan vs. Actual variance trends for individual expenditure categories"]
["See Section 4.3.1 of DSP for Year-over-Year detail in each category. "]

{"sheet":"Hidden_CAPEX","index":10,"n_rows":113,"n_cols":9,"rows_kept":113,"cut":false,"hidden":true,"merged":[]}
["Utility Name","EB Number","Test Year","Bridge Year","Last Rebasing Year","Category","Year","Plan","Actual"]
[{"$f":"'LDC Info'!$E$14","v":"Algoma Power Inc."},{"$f":"EBNUMBER","v":"EB-2019-0019"},{"$f":"TestYear","v":2020},{"$f":"BridgeYear","v":2019},{"$f":"RebaseYear","v":2015},"System Access",2010,{"$f":"'App.2-AB_Capital Expenditures'!B17","v":0},{"$f":"'App.2-AB_Capital Expenditures'!C17","v":0}]
[{"$f":"'LDC Info'!$E$14","v":"Algoma Power Inc."},"EB-2019-0019",2020,2019,2015,"System Renewal",2010,{"$f":"'App.2-AB_Capital Expenditures'!B18","v":0},{"$f":"'App.2-AB_Capital Expenditures'!C18","v":0}]
[{"$f":"'LDC Info'!$E$14","v":"Algoma Power Inc."},"EB-2019-0019",2020,2019,2015,"System Service",2010,{"$f":"'App.2-AB_Capital Expenditures'!B19","v":0},{"$f":"'App.2-AB_Capital Expenditures'!C19","v":0}]
[{"$f":"'LDC Info'!$E$14","v":"Algoma Power Inc."},"EB-2019-0019",2020,2019,2015,"General Plant",2010,{"$f":"'App.2-AB_Capital Expenditures'!B20","v":0},{"$f":"'App.2-AB_Capital Expenditures'!C20","v":0}]
[{"$f":"'LDC Info'!$E$14","v":"Algoma Power Inc."},"EB-2019-0019",2020,2019,2015,"Total Expenditure",2010,{"$f":"'App.2-AB_Capital Expenditures'!B21","v":0},{"$f":"'App.2-AB_Capital Expenditures'!C21","v":0}]
[{"$f":"'LDC Info'!$E$14","v":"Algoma Power Inc."},"EB-2019-0019",2020,2019,2015,"Capital Contributions",2010,{"$f":"'App.2-AB_Capital Expenditures'!B22","v":0},{"$f":"'App.2-AB_Capital Expenditures'!C22","v":0}]
[{"$f":"'LDC Info'!$E$14","v":"Algoma Power Inc."},"EB-2019-0019",2020,2019,2015,"Net Capital Expenditures ",2010,{"$f":"'App.2-AB_Capital Expenditures'!B23","v":0},{"$f":"'App.2-AB_Capital Expenditures'!C23","v":0}]
[{"$f":"'LDC Info'!$E$14","v":"Algoma Power Inc."},"EB-2019-0019",2020,2019,2015,"System O&M",2010,{"$f":"'App.2-AB_Capital Expenditures'!B24","v":0},{"$f":"'App.2-AB_Capital Expenditures'!C24","v":0}]
[{"$f":"'LDC Info'!$E$14","v":"Algoma Power Inc."},"EB-2019-0019",2020,2019,2015,"System Access",2011,{"$f":"'App.2-AB_Capital Expenditures'!E17","v":0},{"$f":"'App.2-AB_Capital Expenditures'!F17","v":0}]
[{"$f":"'LDC Info'!$E$14","v":"Algoma Power Inc."},"EB-2019-0019",2020,2019,2015,"System Renewal",2011,{"$f":"'App.2-AB_Capital Expenditures'!E18","v":0},{"$f":"'App.2-AB_Capital Expenditures'!F18","v":0}]
[{"$f":"'LDC Info'!$E$14","v":"Algoma Power Inc."},"EB-2019-0019",2020,2019,2015,"System Service",2011,{"$f":"'App.2-AB_Capital Expenditures'!E19","v":0},{"$f":"'App.2-AB_Capital Expenditures'!F19","v":0}]
[{"$f":"'LDC Info'!$E$14","v":"Algoma Power Inc."},"EB-2019-0019",2020,2019,2015,"General Plant",2011,{"$f":"'App.2-AB_Capital Expenditures'!E20","v":0},{"$f":"'App.2-AB_Capital Expenditures'!F20","v":0}]
[{"$f":"'LDC Info'!$E$14","v":"Algoma Power Inc."},"EB-2019-0019",2020,2019,2015,"Total Expenditure",2011,{"$f":"'App.2-AB_Capital Expenditures'!E21","v":0},{"$f":"'App.2-AB_Capital Expenditures'!F21","v":0}]
[{"$f":"'LDC Info'!$E$14","v":"Algoma Power Inc."},"EB-2019-0019",2020,2019,2015,"Capital Contributions",2011,{"$f":"'App.2-AB_Capital Expenditures'!E22","v":0},{"$f":"'App.2-AB_Capital Expenditures'!F22","v":0}]
[{"$f":"'LDC Info'!$E$14","v":"Algoma Power Inc."},"EB-2019-0019",2020,2019,2015,"Net Capital Expenditures ",2011,{"$f":"'App.2-AB_Capital Expenditures'!E23","v":0},{"$f":"'App.2-AB_Capital Expenditures'!F23","v":0}]
[{"$f":"'LDC Info'!$E$14","v":"Algoma Power Inc."},"EB-2019-0019",2020,2019,2015,"System O&M",2011,{"$f":"'App.2-AB_Capital Expenditures'!E24","v":0},{"$f":"'App.2-AB_Capital Expenditures'!F24","v":0}]
[{"$f":"'LDC Info'!$E$14","v":"Algoma Power Inc."},"EB-2019-0019",2020,2019,2015,"System Access",2012,{"$f":"'App.2-AB_Capital Expenditures'!H17","v":0},{"$f":"'App.2-AB_Capital Expenditures'!I17","v":0}]
[{"$f":"'LDC Info'!$E$14","v":"Algoma Power Inc."},"EB-2019-0019",2020,2019,2015,"System Renewal",2012,{"$f":"'App.2-AB_Capital Expenditures'!H18","v":0},{"$f":"'App.2-AB_Capital Expenditures'!I18","v":0}]
[{"$f":"'LDC Info'!$E$14","v":"Algoma Power Inc."},"EB-2019-0019",2020,2019,2015,"System Service",2012,{"$f":"'App.2-AB_Capital Expenditures'!H19","v":0},{"$f":"'App.2-AB_Capital Expenditures'!I19","v":0}]
[{"$f":"'LDC Info'!$E$14","v":"Algoma Power Inc."},"EB-2019-0019",2020,2019,2015,"General Plant",2012,{"$f":"'App.2-AB_Capital Expenditures'!H20","v":0},{"$f":"'App.2-AB_Capital Expenditures'!I20","v":0}]
[{"$f":"'LDC Info'!$E$14","v":"Algoma Power Inc."},"EB-2019-0019",2020,2019,2015,"Total Expenditure",2012,{"$f":"'App.2-AB_Capital Expenditures'!H21","v":0},{"$f":"'App.2-AB_Capital Expenditures'!I21","v":0}]
[{"$f":"'LDC Info'!$E$14","v":"Algoma Power Inc."},"EB-2019-0019",2020,2019,2015,"Capital Contributions",2012,{"$f":"'App.2-AB_Capital Expenditures'!H22","v":0},{"$f":"'App.2-AB_Capital Expenditures'!I22","v":0}]
[{"$f":"'LDC Info'!$E$14","v":"Algoma Power Inc."},"EB-2019-0019",2020,2019,2015,"Net Capital Expenditures ",2012,{"$f":"'App.2-AB_Capital Expenditures'!H23","v":0},{"$f":"'App.2-AB_Capital Expenditures'!I23","v":0}]
[{"$f":"'LDC Info'!$E$14","v":"Algoma Power Inc."},"EB-2019-0019",2020,2019,2015,"System O&M",2012,{"$f":"'App.2-AB_Capital Expenditures'!H24","v":0},{"$f":"'App.2-AB_Capital Expenditures'!I24","v":0}]
[{"$f":"'LDC Info'!$E$14","v":"Algoma Power Inc."},"EB-2019-0019",2020,2019,2015,"System Access",2013,{"$f":"'App.2-AB_Capital Expenditures'!K17","v":0},{"$f":"'App.2-AB_Capital Expenditures'!L17","v":0}]
[{"$f":"'LDC Info'!$E$14","v":"Algoma Power Inc."},"EB-2019-0019",2020,2019,2015,"System Renewal",2013,{"$f":"'App.2-AB_Capital Expenditures'!K18","v":0},{"$f":"'App.2-AB_Capital Expenditures'!L18","v":0}]
[{"$f":"'LDC Info'!$E$14","v":"Algoma Power Inc."},"EB-2019-0019",2020,2019,2015,"System Service",2013,{"$f":"'App.2-AB_Capital Expenditures'!K19","v":0},{"$f":"'App.2-AB_Capital Expenditures'!L19","v":0}]
[{"$f":"'LDC Info'!$E$14","v":"Algoma Power Inc."},"EB-2019-0019",2020,2019,2015,"General Plant",2013,{"$f":"'App.2-AB_Capital Expenditures'!K20","v":0},{"$f":"'App.2-AB_Capital Expenditures'!L20","v":0}]
[{"$f":"'LDC Info'!$E$14","v":"Algoma Power Inc."},"EB-2019-0019",2020,2019,2015,"Total Expenditure",2013,{"$f":"'App.2-AB_Capital Expenditures'!K21","v":0},{"$f":"'App.2-AB_Capital Expenditures'!L21","v":0}]
[{"$f":"'LDC Info'!$E$14","v":"Algoma Power Inc."},"EB-2019-0019",2020,2019,2015,"Capital Contributions",2013,{"$f":"'App.2-AB_Capital Expenditures'!K22","v":0},{"$f":"'App.2-AB_Capital Expenditures'!L22","v":0}]
[{"$f":"'LDC Info'!$E$14","v":"Algoma Power Inc."},"EB-2019-0019",2020,2019,2015,"Net Capital Expenditures ",2013,{"$f":"'App.2-AB_Capital Expenditures'!K23","v":0},{"$f":"'App.2-AB_Capital Expenditures'!L23","v":0}]
[{"$f":"'LDC Info'!$E$14","v":"Algoma Power Inc."},"EB-2019-0019",2020,2019,2015,"System O&M",2013,{"$f":"'App.2-AB_Capital Expenditures'!K24","v":0},{"$f":"'App.2-AB_Capital Expenditures'!L24","v":0}]
[{"$f":"'LDC Info'!$E$14","v":"Algoma Power Inc."},{"$f":"EBNUMBER","v":"EB-2019-0019"},{"$f":"TestYear","v":2020},{"$f":"BridgeYear","v":2019},{"$f":"RebaseYear","v":2015},"System Access",2014,{"$f":"'App.2-AB_Capital Expenditures'!N17","v":0},{"$f":"'App.2-AB_Capital Expenditures'!O17","v":0}]
[{"$f":"'LDC Info'!$E$14","v":"Algoma Power Inc."},"EB-2019-0019",2020,2019,2015,"System Renewal",2014,{"$f":"'App.2-AB_Capital Expenditures'!N18","v":0},{"$f":"'App.2-AB_Capital Expenditures'!O18","v":0}]
[{"$f":"'LDC Info'!$E$14","v":"Algoma Power Inc."},"EB-2019-0019",2020,2019,2015,"System Service",2014,{"$f":"'App.2-AB_Capital Expenditures'!N19","v":0},{"$f":"'App.2-AB_Capital Expenditures'!O19","v":0}]
[{"$f":"'LDC Info'!$E$14","v":"Algoma Power Inc."},"EB-2019-0019",2020,2019,2015,"General Plant",2014,{"$f":"'App.2-AB_Capital Expenditures'!N20","v":0},{"$f":"'App.2-AB_Capital Expenditures'!O20","v":0}]
[{"$f":"'LDC Info'!$E$14","v":"Algoma Power Inc."},"EB-2019-0019",2020,2019,2015,"Total Expenditure",2014,{"$f":"'App.2-AB_Capital Expenditures'!N21","v":0},{"$f":"'App.2-AB_Capital Expenditures'!O21","v":0}]
[{"$f":"'LDC Info'!$E$14","v":"Algoma Power Inc."},"EB-2019-0019",2020,2019,2015,"Capital Contributions",2014,{"$f":"'App.2-AB_Capital Expenditures'!N22","v":0},{"$f":"'App.2-AB_Capital Expenditures'!O22","v":0}]
[{"$f":"'LDC Info'!$E$14","v":"Algoma Power Inc."},"EB-2019-0019",2020,2019,2015,"Net Capital Expenditures ",2014,{"$f":"'App.2-AB_Capital Expenditures'!N23","v":0},{"$f":"'App.2-AB_Capital Expenditures'!O23","v":0}]
[{"$f":"'LDC Info'!$E$14","v":"Algoma Power Inc."},"EB-2019-0019",2020,2019,2015,"System O&M",2014,{"$f":"'App.2-AB_Capital Expenditures'!N24","v":0},{"$f":"'App.2-AB_Capital Expenditures'!O24","v":0}]
[{"$f":"'LDC Info'!$E$14","v":"Algoma Power Inc."},"EB-2019-0019",2020,2019,2015,"System Access",2015,{"$f":"'App.2-AB_Capital Expenditures'!Q17","v":1020},{"$f":"'App.2-AB_Capital Expenditures'!R17","v":991.54075999999998}]
[{"$f":"'LDC Info'!$E$14","v":"Algoma Power Inc."},"EB-2019-0019",2020,2019,2015,"System Renewal",2015,{"$f":"'App.2-AB_Capital Expenditures'!Q18","v":4834},{"$f":"'App.2-AB_Capital Expenditures'!R18","v":4228.9185099999995}]
[{"$f":"'LDC Info'!$E$14","v":"Algoma Power Inc."},"EB-2019-0019",2020,2019,2015,"System Service",2015,{"$f":"'App.2-AB_Capital Expenditures'!Q19","v":538},{"$f":"'App.2-AB_Capital Expenditures'!R19","v":989.95853}]
[{"$f":"'LDC Info'!$E$14","v":"Algoma Power Inc."},"EB-2019-0019",2020,2019,2015,"General Plant",2015,{"$f":"'App.2-AB_Capital Expenditures'!Q20","v":2679},{"$f":"'App.2-AB_Capital Expenditures'!R20","v":2369.1427099999996}]
[{"$f":"'LDC Info'!$E$14","v":"Algoma Power Inc."},"EB-2019-0019",2020,2019,2015,"Total Expenditure",2015,{"$f":"'App.2-AB_Capital Expenditures'!Q21","v":9071},{"$f":"'App.2-AB_Capital Expenditures'!R21","v":8579.5605099999993}]
[{"$f":"'LDC Info'!$E$14","v":"Algoma Power Inc."},"EB-2019-0019",2020,2019,2015,"Capital Contributions",2015,{"$f":"'App.2-AB_Capital Expenditures'!Q22","v":-100},{"$f":"'App.2-AB_Capital Expenditures'!R22","v":27.284340000000004}]
[{"$f":"'LDC Info'!$E$14","v":"Algoma Power Inc."},"EB-2019-0019",2020,2019,2015,"Net Capital Expenditures ",2015,{"$f":"'App.2-AB_Capital Expenditures'!Q23","v":8971},{"$f":"'App.2-AB_Capital Expenditures'!R23","v":8606.8448499999995}]
[{"$f":"'LDC Info'!$E$14","v":"Algoma Power Inc."},"EB-2019-0019",2020,2019,2015,"System O&M",2015,{"$f":"'App.2-AB_Capital Expenditures'!Q24","v":6896.5729199999996},{"$f":"'App.2-AB_Capital Expenditures'!R24","v":6361.4865800000007}]
[{"$f":"'LDC Info'!$E$14","v":"Algoma Power Inc."},"EB-2019-0019",2020,2019,2015,"System Access",2016,{"$f":"'App.2-AB_Capital Expenditures'!T17","v":1020},{"$f":"'App.2-AB_Capital Expenditures'!U17","v":883.17441000000019}]
[{"$f":"'LDC Info'!$E$14","v":"Algoma Power Inc."},"EB-2019-0019",2020,2019,2015,"System Renewal",2016,{"$f":"'App.2-AB_Capital Expenditures'!T18","v":4834},{"$f":"'App.2-AB_Capital Expenditures'!U18","v":3433.8898799999997}]
[{"$f":"'LDC Info'!$E$14","v":"Algoma Power Inc."},"EB-2019-0019",2020,2019,2015,"System Service",2016,{"$f":"'App.2-AB_Capital Expenditures'!T19","v":5088},{"$f":"'App.2-AB_Capital Expenditures'!U19","v":192.43942999999999}]
[{"$f":"'LDC Info'!$E$14","v":"Algoma Power Inc."},"EB-2019-0019",2020,2019,2015,"General Plant",2016,{"$f":"'App.2-AB_Capital Expenditures'!T20","v":2529},{"$f":"'App.2-AB_Capital Expenditures'!U20","v":2962.7978900000007}]
[{"$f":"'LDC Info'!$E$14","v":"Algoma Power Inc."},"EB-2019-0019",2020,2019,2015,"Total Expenditure",2016,{"$f":"'App.2-AB_Capital Expenditures'!T21","v":13471},{"$f":"'App.2-AB_Capital Expenditures'!U21","v":7472.3016100000013}]
[{"$f":"'LDC Info'!$E$14","v":"Algoma Power Inc."},"EB-2019-0019",2020,2019,2015,"Capital Contributions",2016,{"$f":"'App.2-AB_Capital Expenditures'!T22","v":-100},{"$f":"'App.2-AB_Capital Expenditures'!U22","v":-136.53231}]
[{"$f":"'LDC Info'!$E$14","v":"Algoma Power Inc."},"EB-2019-0019",2020,2019,2015,"Net Capital Expenditures ",2016,{"$f":"'App.2-AB_Capital Expenditures'!T23","v":13371},{"$f":"'App.2-AB_Capital Expenditures'!U23","v":7335.7693000000017}]
[{"$f":"'LDC Info'!$E$14","v":"Algoma Power Inc."},"EB-2019-0019",2020,2019,2015,"System O&M",2016,{"$f":"'App.2-AB_Capital Expenditures'!T24","v":7034.5043784},{"$f":"'App.2-AB_Capital Expenditures'!U24","v":6715.3830099999996}]
[{"$f":"'LDC Info'!$E$14","v":"Algoma Power Inc."},"EB-2019-0019",2020,2019,2015,"System Access",2017,{"$f":"'App.2-AB_Capital Expenditures'!W17","v":1020},{"$f":"'App.2-AB_Capital Expenditures'!X17","v":960.27135999999985}]
[{"$f":"'LDC Info'!$E$14","v":"Algoma Power Inc."},"EB-2019-0019",2020,2019,2015,"System Renewal",2017,{"$f":"'App.2-AB_Capital Expenditures'!W18","v":4834},{"$f":"'App.2-AB_Capital Expenditures'!X18","v":4970.6882699999996}]
[{"$f":"'LDC Info'!$E$14","v":"Algoma Power Inc."},"EB-2019-0019",2020,2019,2015,"System Service",2017,{"$f":"'App.2-AB_Capital Expenditures'!W19","v":538},{"$f":"'App.2-AB_Capital Expenditures'!X19","v":339.03214000000003}]
[{"$f":"'LDC Info'!$E$14","v":"Algoma Power Inc."},"EB-2019-0019",2020,2019,2015,"General Plant",2017,{"$f":"'App.2-AB_Capital Expenditures'!W20","v":2029},{"$f":"'App.2-AB_Capital Expenditures'!X20","v":3240.2433099999998}]
[{"$f":"'LDC Info'!$E$14","v":"Algoma Power Inc."},"EB-2019-0019",2020,2019,2015,"Total Expenditure",2017,{"$f":"'App.2-AB_Capital Expenditures'!W21","v":8421},{"$f":"'App.2-AB_Capital Expenditures'!X21","v":9510.2350799999986}]
[{"$f":"'LDC Info'!$E$14","v":"Algoma Power Inc."},"EB-2019-0019",2020,2019,2015,"Capital Contributions",2017,{"$f":"'App.2-AB_Capital Expenditures'!W22","v":-100},{"$f":"'App.2-AB_Capital Expenditures'!X22","v":-69.263670000000005}]
[{"$f":"'LDC Info'!$E$14","v":"Algoma Power Inc."},"EB-2019-0019",2020,2019,2015,"Net Capital Expenditures ",2017,{"$f":"'App.2-AB_Capital Expenditures'!W23","v":8321},{"$f":"'App.2-AB_Capital Expenditures'!X23","v":9440.9714099999983}]
[{"$f":"'LDC Info'!$E$14","v":"Algoma Power Inc."},"EB-2019-0019",2020,2019,2015,"System O&M",2017,{"$f":"'App.2-AB_Capital Expenditures'!W24","v":7175.1944659680003},{"$f":"'App.2-AB_Capital Expenditures'!X24","v":6711.6399000000001}]
[{"$f":"'LDC Info'!$E$14","v":"Algoma Power Inc."},{"$f":"EBNUMBER","v":"EB-2019-0019"},{"$f":"TestYear","v":2020},{"$f":"BridgeYear","v":2019},{"$f":"RebaseYear","v":2015},"System Access",2018,{"$f":"'App.2-AB_Capital Expenditures'!Z17","v":1020},{"$f":"'App.2-AB_Capital Expenditures'!AA17","v":912.70416000000012}]
[{"$f":"'LDC Info'!$E$14","v":"Algoma Power Inc."},"EB-2019-0019",2020,2019,2015,"System Renewal",2018,{"$f":"'App.2-AB_Capital Expenditures'!Z18","v":4834},{"$f":"'App.2-AB_Capital Expenditures'!AA18","v":5143.8571600000005}]
[{"$f":"'LDC Info'!$E$14","v":"Algoma Power Inc."},"EB-2019-0019",2020,2019,2015,"System Service",2018,{"$f":"'App.2-AB_Capital Expenditures'!Z19","v":538},{"$f":"'App.2-AB_Capital Expenditures'!AA19","v":868.3146999999999}]
[{"$f":"'LDC Info'!$E$14","v":"Algoma Power Inc."},"EB-2019-0019",2020,2019,2015,"General Plant",2018,{"$f":"'App.2-AB_Capital Expenditures'!Z20","v":1029},{"$f":"'App.2-AB_Capital Expenditures'!AA20","v":1499.7880800000003}]
[{"$f":"'LDC Info'!$E$14","v":"Algoma Power Inc."},"EB-2019-0019",2020,2019,2015,"Total Expenditure",2018,{"$f":"'App.2-AB_Capital Expenditures'!Z21","v":7421},{"$f":"'App.2-AB_Capital Expenditures'!AA21","v":8424.6641000000018}]
[{"$f":"'LDC Info'!$E$14","v":"Algoma Power Inc."},"EB-2019-0019",2020,2019,2015,"Capital Contributions",2018,{"$f":"'App.2-AB_Capital Expenditures'!Z22","v":-100},{"$f":"'App.2-AB_Capital Expenditures'!AA22","v":-140}]
[{"$f":"'LDC Info'!$E$14","v":"Algoma Power Inc."},"EB-2019-0019",2020,2019,2015,"Net Capital Expenditures ",2018,{"$f":"'App.2-AB_Capital Expenditures'!Z23","v":7321},{"$f":"'App.2-AB_Capital Expenditures'!AA23","v":8284.6641000000018}]
[{"$f":"'LDC Info'!$E$14","v":"Algoma Power Inc."},"EB-2019-0019",2020,2019,2015,"System O&M",2018,{"$f":"'App.2-AB_Capital Expenditures'!Z24","v":7318.6983552873608},{"$f":"'App.2-AB_Capital Expenditures'!AA24","v":7016.3004299999993}]
[{"$f":"'LDC Info'!$E$14","v":"Algoma Power Inc."},"EB-2019-0019",2020,2019,2015,"System Access",2019,{"$f":"'App.2-AB_Capital Expenditures'!AC17","v":903.40704000000005}]
[{"$f":"'LDC Info'!$E$14","v":"Algoma Power Inc."},"EB-2019-0019",2020,2019,2015,"System Renewal",2019,{"$f":"'App.2-AB_Capital Expenditures'!AC18","v":6023.1767599999994}]
[{"$f":"'LDC Info'!$E$14","v":"Algoma Power Inc."},"EB-2019-0019",2020,2019,2015,"System Service",2019,{"$f":"'App.2-AB_Capital Expenditures'!AC19","v":562.32587999999998}]
[{"$f":"'LDC Info'!$E$14","v":"Algoma Power Inc."},"EB-2019-0019",2020,2019,2015,"General Plant",2019,{"$f":"'App.2-AB_Capital Expenditures'!AC20","v":1356.7168800000002}]
[{"$f":"'LDC Info'!$E$14","v":"Algoma Power Inc."},"EB-2019-0019",2020,2019,2015,"Total Expenditure",2019,{"$f":"'App.2-AB_Capital Expenditures'!AC21","v":8845.6265600000006}]
[{"$f":"'LDC Info'!$E$14","v":"Algoma Power Inc."},"EB-2019-0019",2020,2019,2015,"Capital Contributions",2019,{"$f":"'App.2-AB_Capital Expenditures'!AC22","v":-101.85}]
[{"$f":"'LDC Info'!$E$14","v":"Algoma Power Inc."},"EB-2019-0019",2020,2019,2015,"Net Capital Expenditures ",2019,{"$f":"'App.2-AB_Capital Expenditures'!AC23","v":8743.7765600000002}]
[{"$f":"'LDC Info'!$E$14","v":"Algoma Power Inc."},"EB-2019-0019",2020,2019,2015,"System O&M",2019,{"$f":"'App.2-AB_Capital Expenditures'!AC24","v":7080.2471800000012}]
[{"$f":"'LDC Info'!$E$14","v":"Algoma Power Inc."},"EB-2019-0019",2020,2019,2015,"System Access",2020,{"$f":"'App.2-AB_Capital Expenditures'!AD17","v":963}]
[{"$f":"'LDC Info'!$E$14","v":"Algoma Power Inc."},"EB-2019-0019",2020,2019,2015,"System Renewal",2020,{"$f":"'App.2-AB_Capital Expenditures'!AD18","v":4700}]
[{"$f":"'LDC Info'!$E$14","v":"Algoma Power Inc."},"EB-2019-0019",2020,2019,2015,"System Service",2020,{"$f":"'App.2-AB_Capital Expenditures'!AD19","v":7978}]
[{"$f":"'LDC Info'!$E$14","v":"Algoma Power Inc."},"EB-2019-0019",2020,2019,2015,"General Plant",2020,{"$f":"'App.2-AB_Capital Expenditures'!AD20","v":1238}]
[{"$f":"'LDC Info'!$E$14","v":"Algoma Power Inc."},"EB-2019-0019",2020,2019,2015,"Total Expenditure",2020,{"$f":"'App.2-AB_Capital Expenditures'!AD21","v":14879}]
[{"$f":"'LDC Info'!$E$14","v":"Algoma Power Inc."},"EB-2019-0019",2020,2019,2015,"Capital Contributions",2020,{"$f":"'App.2-AB_Capital Expenditures'!AD22","v":-100}]
[{"$f":"'LDC Info'!$E$14","v":"Algoma Power Inc."},"EB-2019-0019",2020,2019,2015,"Net Capital Expenditures ",2020,{"$f":"'App.2-AB_Capital Expenditures'!AD23","v":14779}]
[{"$f":"'LDC Info'!$E$14","v":"Algoma Power Inc."},"EB-2019-0019",2020,2019,2015,"System O&M",2020,{"$f":"'App.2-AB_Capital Expenditures'!AD24","v":7186.4508877000007}]
[{"$f":"'LDC Info'!$E$14","v":"Algoma Power Inc."},"EB-2019-0019",2020,2019,2015,"System Access",2021,{"$f":"'App.2-AB_Capital Expenditures'!AE17","v":930}]
[{"$f":"'LDC Info'!$E$14","v":"Algoma Power Inc."},"EB-2019-0019",2020,2019,2015,"System Renewal",2021,{"$f":"'App.2-AB_Capital Expenditures'!AE18","v":4822}]
[{"$f":"'LDC Info'!$E$14","v":"Algoma Power Inc."},"EB-2019-0019",2020,2019,2015,"System Service",2021,{"$f":"'App.2-AB_Capital Expenditures'!AE19","v":472}]
[{"$f":"'LDC Info'!$E$14","v":"Algoma Power Inc."},"EB-2019-0019",2020,2019,2015,"General Plant",2021,{"$f":"'App.2-AB_Capital Expenditures'!AE20","v":15408}]
[{"$f":"'LDC Info'!$E$14","v":"Algoma Power Inc."},"EB-2019-0019",2020,2019,2015,"Total Expenditure",2021,{"$f":"'App.2-AB_Capital Expenditures'!AE21","v":21632}]
[{"$f":"'LDC Info'!$E$14","v":"Algoma Power Inc."},"EB-2019-0019",2020,2019,2015,"Capital Contributions",2021,{"$f":"'App.2-AB_Capital Expenditures'!AE22","v":-100}]
[{"$f":"'LDC Info'!$E$14","v":"Algoma Power Inc."},"EB-2019-0019",2020,2019,2015,"Net Capital Expenditures ",2021,{"$f":"'App.2-AB_Capital Expenditures'!AE23","v":21532}]
[{"$f":"'LDC Info'!$E$14","v":"Algoma Power Inc."},"EB-2019-0019",2020,2019,2015,"System O&M",2021,{"$f":"'App.2-AB_Capital Expenditures'!AE24","v":7294.2476510155002}]
[{"$f":"'LDC Info'!$E$14","v":"Algoma Power Inc."},{"$f":"EBNUMBER","v":"EB-2019-0019"},{"$f":"TestYear","v":2020},{"$f":"BridgeYear","v":2019},{"$f":"RebaseYear","v":2015},"System Access",2022,{"$f":"'App.2-AB_Capital Expenditures'!AF17","v":906}]
[{"$f":"'LDC Info'!$E$14","v":"Algoma Power Inc."},"EB-2019-0019",2020,2019,2015,"System Renewal",2022,{"$f":"'App.2-AB_Capital Expenditures'!AF18","v":6494}]
[{"$f":"'LDC Info'!$E$14","v":"Algoma Power Inc."},"EB-2019-0019",2020,2019,2015,"System Service",2022,{"$f":"'App.2-AB_Capital Expenditures'!AF19","v":461}]
[{"$f":"'LDC Info'!$E$14","v":"Algoma Power Inc."},"EB-2019-0019",2020,2019,2015,"General Plant",2022,{"$f":"'App.2-AB_Capital Expenditures'!AF20","v":1178}]
[{"$f":"'LDC Info'!$E$14","v":"Algoma Power Inc."},"EB-2019-0019",2020,2019,2015,"Total Expenditure",2022,{"$f":"'App.2-AB_Capital Expenditures'!AF21","v":9039}]
[{"$f":"'LDC Info'!$E$14","v":"Algoma Power Inc."},"EB-2019-0019",2020,2019,2015,"Capital Contributions",2022,{"$f":"'App.2-AB_Capital Expenditures'!AF22","v":-100}]
[{"$f":"'LDC Info'!$E$14","v":"Algoma Power Inc."},"EB-2019-0019",2020,2019,2015,"Net Capital Expenditures ",2022,{"$f":"'App.2-AB_Capital Expenditures'!AF23","v":8939}]
[{"$f":"'LDC Info'!$E$14","v":"Algoma Power Inc."},"EB-2019-0019",2020,2019,2015,"System O&M",2022,{"$f":"'App.2-AB_Capital Expenditures'!AF24","v":7403.661365780732}]
[{"$f":"'LDC Info'!$E$14","v":"Algoma Power Inc."},"EB-2019-0019",2020,2019,2015,"System Access",2023,{"$f":"'App.2-AB_Capital Expenditures'!AG17","v":906}]
[{"$f":"'LDC Info'!$E$14","v":"Algoma Power Inc."},"EB-2019-0019",2020,2019,2015,"System Renewal",2023,{"$f":"'App.2-AB_Capital Expenditures'!AG18","v":4616}]
[{"$f":"'LDC Info'!$E$14","v":"Algoma Power Inc."},"EB-2019-0019",2020,2019,2015,"System Service",2023,{"$f":"'App.2-AB_Capital Expenditures'!AG19","v":461}]
[{"$f":"'LDC Info'!$E$14","v":"Algoma Power Inc."},"EB-2019-0019",2020,2019,2015,"General Plant",2023,{"$f":"'App.2-AB_Capital Expenditures'!AG20","v":1098}]
[{"$f":"'LDC Info'!$E$14","v":"Algoma Power Inc."},"EB-2019-0019",2020,2019,2015,"Total Expenditure",2023,{"$f":"'App.2-AB_Capital Expenditures'!AG21","v":7081}]
[{"$f":"'LDC Info'!$E$14","v":"Algoma Power Inc."},"EB-2019-0019",2020,2019,2015,"Capital Contributions",2023,{"$f":"'App.2-AB_Capital Expenditures'!AG22","v":-100}]
[{"$f":"'LDC Info'!$E$14","v":"Algoma Power Inc."},"EB-2019-0019",2020,2019,2015,"Net Capital Expenditures ",2023,{"$f":"'App.2-AB_Capital Expenditures'!AG23","v":6981}]
[{"$f":"'LDC Info'!$E$14","v":"Algoma Power Inc."},"EB-2019-0019",2020,2019,2015,"System O&M",2023,{"$f":"'App.2-AB_Capital Expenditures'!AG24","v":7514.7162862674422}]

{"sheet":"App.2-AC_Customer Engagement","index":11,"n_rows":57,"n_cols":3,"rows_kept":57,"cut":false,"hidden":false,"merged":[[36,0,36,2],[41,0,41,2],[48,0,48,2],[9,0,9,2],[8,0,8,2],[12,0,12,2],[18,0,18,2],[27,0,27,2]]}
[null,"File Number:",{"$f":"EBNUMBER","v":"EB-2019-0019"}]
[null,"Exhibit:",1]
[null,"Tab:"]
[null,"Schedule:"]
[null,"Page:"]
[]
[null,"Date:","2019-05-17"]
[]
["Appendix 2-AC"]
["Customer Engagement Activities Summary"]
[]
["Provide a list of customer engagement activities","Provide a list of customer needs and preferences identified through each engagement activity","Actions taken to respond to identified needs and preferences.  If no action was taken, explain why."]
["Customer Satisfaction Surveys"]
["- Residential & Small Business Customer Survey 2018 (telephone)","The primary purpose of the Annual Customer Satisfaction survey is to gather information about satisfaction, customer affinity, feelings about outages and bills. Respondents are given an open-ended question to provide suggestions for improvement. For Fall 2018 additional questions around preferred method for LDC to communicate with customers when there is a billing issue or an unplanned outage. Respondents were asked about their satisfaction with their access to services and their priority rating for 12 operational issues.","Questions used in the telephone survey about communication preferences, satisfaction with access to services, and priority ratings were replicated in the Taking A.I.M. online process.  Feedback and insights are used to shape the COS 5 year plan."]
["- Residential & Small Business Customer Survey 2017 & 2016 (telephone)","In addition to the primary purpose of the Annual Customer Satisfaction survey, feedback about the role technology plays in achieving higher levels of service for customers and making the LDC more efficient were asked. Respondents were asked to assign an importance level for 10 customer relevant technologically enabled operational items.","Algoma Power respondents are more cautious about the effect of technology on their lives than other Ontario LDC respondents. Year over year comparison, 2017 vs 2016,  of the importance of online access for certain items showed growth.  To make getting service easier, Algoma Power responded by putting a series of forms covering 20+ items on their website.  Customers can also email customer service directly from the website. Algoma Power also added a \"Make Your Voice Count\" link to encourage customers to provide their opinions, views and ideas. Taking A.I.M. Chapter 6 and Chapter 7 surveys were enhanced to gather more insight into the technologically enabled operational items. "]
["- Residential & Small Business Customer Survey 2015 (telephone)","In addition to the primary purpose of the Annual Customer Satisfaction survey, Algoma Power took the opportunity to learn more about respondent expectations as they relate to Outages and Outage Management.","Algoma Power survey respondents rate API just as favourably as found in the UtilityPULSE database for other LDCs, as it relates to having a standard of reliability that meets their expectation.  However that standard is less stringent. For example 41% of UtilityPULSE database respondents indicated that 1-2 outages per year was acceptable, it was 1 in 3 (32%) for API respondents.  Further follow-up on outages and outage management shaped the Taking A.I.M. Chapter 4 survey, included were questions about willingness to pay for improvements in reliability. "]
["- Electricity Safety survey 2015","This is a standardized survey to engage consumers in Algoma Power community about electricity safety.","This was a baseline survey, Algoma results were compared with the results from 34 LDCs."]
["- Electricity Safety survey 2017","Second run to engage consumers about electricity safety.","Algoma Power's score of 82 was identical to the average score for 33 Ontario LDCs. In order to help educate, Algoma Power put an interactive electricity safety quiz, with supporting explainer videos, on line."]
["Community Outreach/Stakeholder Sessions"]
["Your Kilowatt Hour Sessions - provide walk-in locations for customers to have face-to-face interactions with customer service and/or CDM staff.  Opportunity to edcuate customers and address any concerns. Four sessions held in primary locations."]
["Your Kilowatt Hour Session - Wawa - January 11, 2018","Scheduled meetings to answer cust questions. 2 Customers made appointments but did not show due to weather conditions.","Spoke with customer about her needs over the phone (how OESP amount is determined, CDM measures, Explanation of delivery charges, Usage chart, doesn't like TOU due to being a senior with limited income and home at peak times).  The other came to our office at another time wanting to understand his Equal Billing Plan."]
["Your Kilowatt Hour Session - Garden River-January 31, 2018","Scheduled meetings to answer cust questions.  1 Customer made appointment but did not show. ","Spoke with customer about her needs over the phone."]
["Your Kilowatt Hour Session - Searchmont - October 10, 2018","Scheduled meetings to answer cust questions.  4 Customers made appointments. ","1 cancelled as found API's website helpful to understand delivery charges and to understand her bill.  Another cancelled as it worked better for her to attended our office to discuss delivery charges as a seasonal customer.  Of the  2 who attended 1 wanted to understand bill (overview) and recieve energy efficiency ideas, and the other wanted to understand his bill relating to seasonal rate class."]
["Your Kilowatt Hour Sessions - St. Joe Island -Nov 27, 2018 ","Scheduled meetings to answer cust questions. 9 Customers scheduled appointments.","The topics discussed were Bill understanding, rates, delivery charges, options for electirc heat, and efficiency ideas. One microFit customer requested breakdown on how he was billed.  This was provided to him three days after the event."]
["Annual API Contractor Night - April 25, 2018","Engage contractors to meet customer needs","Followup with contractor per individual needs"]
["Annual Roads Superintendents Meeting","Co-ordinate work plans per municipality","Followup with Rd. Sup't per individual needs"]
["Community Stakeholder Meeting - Nov 28, 2018","Invite all municipalities & boards with presentation\n covering Customer Engagement, Operations, \nCapital & Maintenance.  \nProvide updates regarding:\no API’s Capital and Maintenance Programs 2016/17\no Stakeholdering\no Capital Workflow – Road Relocations/Expansions\no Vegetation Management\no Forestry activities and timelines \no Connection Plans\no Working in Proximity, Electrical Hazards etc.\n","Minutes sent to all attendees after the event.  A few reached out about the \"Make Your Voice Count\" survey."]
["Forestry Outreach"]
["- Forestry Outreach - held seven sessions to provide customers with information on API vegetation mananagement program.  This forum also allowed for customers to ask questions and provide feedback."]
["- Seedy Saturday SSM - March 10, 2018","Vegetation Mgmt Program display/overview:  Had a table at this community event and handed out phamplets and brochures on environmental topics and cdm programs. Provided public with info on VM work program and why and how we manage vegetation","API followed up with customers to discuss vegetation management practices, property related concerns and to discuss right tree, right place providing recommendations of plant species based on site locations. API followed up with approximately 15 customers from this event.\n"]
["- Sustain Algoma Expo - June 2, 2018","Vegetation Mgmt Program display/overview:  Had a table at this community event and handed out phamplets and brochures on environmental topics and cdm programs. Provided public with info on VM work program and why and how we manage vegetation","API followed up with customers to discuss vegetation management practices, property related concerns and to discuss right tree, right place providing recommendations of plant species based on site locations. API followed up with approximately 15 customers from this event.\n"]
["- Lower Island Lake landowner Meeting - April 5, 2018","The meeting presentations provided an overview of API’s obligation and rights as an LDC to provide safe, reliable service, industry standards and best management practices and API’s Vegetation Management Plan as it relates to our service territory. The meeting concluded with a question and answer period for consumers and landowners. .  Handouts where provided to attendees including API’s Frequently Asked Question’s, Electrical Safety Authority’s (ESA) brochures: ESA Tree Trimming, ESA Tree Trimming Obligations and ESA Tree Planting Guide, and Corridors for Life brochure on Right, Tree, Right Place.","Contacted individual customers who were having concerns with the VM program, 5 additional site visits resulted"]
["- Wawa Notification Meeting Wawa – June 7, 2018","The meeting presentations provided an overview of API’s obligation and rights as an LDC to provide safe, reliable service, industry standards and best management practices and API’s Vegetation Management Plan as it relates to our service territory. The meeting concluded with a question and answer period for consumers and landowners. .  Handouts where provided to attendees including API’s Frequently Asked Question’s, Electrical Safety Authority’s (ESA) brochures: ESA Tree Trimming, ESA Tree Trimming Obligations and ESA Tree Planting Guide, and Corridors for Life brochure on Right, Tree, Right Place.","Contacted individual customers who were having concerns with the VM program, more site visits resulted"]
["- Bruce Mines Community Meeting - June 25, 2018","The meeting presentations provided an overview of API’s obligation and rights as an LDC to provide safe, reliable service, industry standards and best management practices and API’s Vegetation Management Plan as it relates to our service territory. The meeting concluded with a question and answer period for consumers and landowners. .  Handouts where provided to attendees including API’s Frequently Asked Question’s, Electrical Safety Authority’s (ESA) brochures: ESA Tree Trimming, ESA Tree Trimming Obligations and ESA Tree Planting Guide, and Corridors for Life brochure on Right, Tree, Right Place.","Contacted individual customers who were having concerns with the VM program, 4 additional site visits resulted"]
["- Desbarats Community Meeting - June 28, 2018","The meeting presentations provided an overview of API’s obligation and rights as an LDC to provide safe, reliable service, industry standards and best management practices and API’s Vegetation Management Plan as it relates to our service territory. The meeting concluded with a question and answer period for consumers and landowners. .  Handouts where provided to attendees including API’s Frequently Asked Question’s, Electrical Safety Authority’s (ESA) brochures: ESA Tree Trimming, ESA Tree Trimming Obligations and ESA Tree Planting Guide, and Corridors for Life brochure on Right, Tree, Right Place.","Contacted individual customers who were having concerns with the VM program, 4 additional site visits resulted"]
["- Heyden, Goulais River, Batchawana Community Meeting\nJuly 16, 2018","The meeting presentations provided an overview of API’s obligation and rights as an LDC to provide safe, reliable service, industry standards and best management practices and API’s Vegetation Management Plan as it relates to our service territory. The meeting concluded with a question and answer period for consumers and landowners. .  Handouts where provided to attendees including API’s Frequently Asked Question’s, Electrical Safety Authority’s (ESA) brochures: ESA Tree Trimming, ESA Tree Trimming Obligations and ESA Tree Planting Guide, and Corridors for Life brochure on Right, Tree, Right Place.","Contacted individual customers who were having concerns with the VM program, 5 additional site visits resulted"]
["CDM Outreach"]
["- Three sessions held to educate customers on various conservation programs while also allowing for feedback."," Through its CDM programs, API has developed a strong working relationship with a number of customers in the residential, commercial and industrial sectors."," As a result of the knowledge gained about the operations of these customers, API is able to proactively reach out to these customers as new programs become available.  These customers also reach out to API to seek advice as they make their own investment decisions."]
["- Michipicoten High School Presentation - May 3, 2018","Wawa Energy Plan Implementation Initiative - Addresses energy efficeincy concepts and programs","Program information provided directly to attendees at the event, inclusive of application avenues and contact information."]
["- Wawa BIA Meeting - February 13, 2018","Presentation Re: SOE incentives for businesses, specifically the Retrofit program","Continual communication as program participation interest arises."]
["- Sustain Algoma Expo - June 2, 2018","Promotion of Save ON Energy suite of programs as well as the AffordAbility Fund program. ","Program information provided directly to customers at the event, inclusive of application avenues and contact information."]
["Other Supporting Engagement Activities"]
["- Social Media (Outage Communication specific)","Social media consumption has been fairly low (approx 3% of total customers)","API does post outage related information via the social media channels (Twitter and Facebook) to keep following customers informed."]
["- Social Media (general communications)","Customer look for the latest utility, government information.  Access to providing opinions and/or signing up for new programs such as e-billing","The API website is constantly responding to these requests with content updates to ensure the information is kept current with what's going on in the industry and what's important to customers"]
["- Technology Based","Continued requests for self help portal.  Information around consumption and bill payment","Myhydro Eye and e-billing information is provided to customers who subscribe to the services."]
["- Front Desk Support","Face to face interaction with customers has always been requested for bill payments or general inquiries","API will continue to foster this form of communication as it allows the organization to \"connect\" with customers."]
["Newsletter - sent out May and November, 2018","These Newsletters advise of Safety concerns, Engagement tools, Contests, What we are doing in our Communities, Regulatory information.  November contained \"Make Your Voice Count\" survey information and invitation to add input.\nNovember also covered charges and rate application information in the \"Legislation Corner.\"","There were not any inquiries API is aware of"]
["- Social Services","Low income customers have unique needs to support payment of services.","API recognizes these needs and will make every effort to communicate special programs and/or services to support eligible customers."]
["Taking AIM - Customer Engagement Program"]
["- UtilityPULSE facilitated review of Customer Engagement activities","The purpose of this session was to:\n- Conduct a review of current CE activities   \n- Leverage CE activities for gathering feedback   \n- Identify ways to get the best from internal resources   \n- Ensure understanding of requirements to support COS application","Clarification of roles and responsibilities between internal resources, corporate resources and third party resources as they relate to various customer engagement activities. Project time-table was also established. UtilityPULSE also lead a discussio about current industry & customer trends. \nAction was taken to leverage API's investment in the annual telephone customer survey to capture additional customer feedback. Topic areas for online surveys were identified."]
["- Taking AIM Applied Insights Methodology 7 online surveys 2018-2019 - Chapter survey 1","Chapter survey 1 is designed to gauge the level of respondent disposition, i.e., positive or negative, towards Algoma Power as a company. Respondents would be introduced to important concepts such as: Make Your Voice Count and Wisdom from Customers. This was a Level 1 (Informing & Information Gathering) & 2 (Gathering Feedback) engagement survey which is about raising awareness, providing education, and capturing perceptions. The primary goal of the Taking A.I.M. process is to break down a large complex topics into smaller more manageable pieces.","AP is very highly rated as a trusted and trustworthy company. This finding, along with others in Chapter 1 survey, helped shape the style and format of future chapter surveys.  Respondents were given \"open\" space to provide feedback about the COS application, their wants & needs, and any other topic they would like to raise. Additionally, there was a second  \"open\" space question to request contact from an AP professional."]
["- Taking AIM Applied Insights Methodology 7 online surveys 2018-2019 - Chapter survey 2","Chapter survey 2 is designed to gauge respondent's knowledge level about the industry. This survey is meant as an industry educational piece for respondents. Respondents were introduced to a concept called Test Your Knowledge. This was a Level 1 Engagement survey which is about raising awareness and providing education.","Knowledge level about the industry is low, the average score was 35 out of 100. However we did learn that there was no need to shy away from putting actual $$$ in costs or investments in questions. However future chapter surveys will have to take into account that the knowledge level is low. "]
["- Taking AIM Applied Insights Methodology 7 online surveys 2018-2019 - Chapter survey 3","Chapter survey 3 is about gaining a better understanding of customer priorities and testing out various strategy options for dealing with issues which affects costs.  This was a Level 2 (Gathering Feedback) and Level 3 (Capturing Insights by Involving Stakeholders) engagement survey. This survey also introduced respondents to a concept called Help Us Decide.","Respondents were asked to assign a priority level to 13 operational items which affect costs. Results are used to determine which items have more support by the customer base. Findings include, from respondent feedback, the majority of respondents support status quo or current standards as it relates to things such as: vegetation management. Survey results also show that current availability of call-centre staff can continue at current levels."]
["- Taking AIM Applied Insights Methodology 7 online surveys 2018-2019 - Chapter survey 4","Chapter survey 4 is about billing and outages. This is a Level 2 and Level 3 engagement survey.  Bills & blackouts (outages) are known as the \"Killer B's\" - a very important topic for customers. Barriers to moving to e-bills were ranked by respondents.  Questions about current reliability standards, expectations about the acceptable number and length of outages, and willingness to pay for an improvement in the standard of reliability was asked.","Survey results do not support a need to raise current standards are they relate to: accurately billing customers, standard of reliability, or quickly handling outages. API learned that the 2 major barriers for moving customers to e-bills was \"some customers do not have access to the internet\" and \"some customers are not comfortable with technology\". API also learned that customers much prefer telephone notification for push type of communications over other means. These findings, coupled with other findings in the Taking A.I.M. process indicates that the adoption for technology based operational improvements will be slower than LDCs in large urban areas. "]
["- Taking AIM Applied Insights Methodology 7 online surveys 2018-2019 - Chapter survey 5","Chapter survey 5 is about prioritizing capital investments in the electricity network. This is a Level 2 and Level 3 engagement survey. Topics covered include: Consulting other electricity entities when planning capital expenses for the electricity network, Meeting regulatory and legal requirements, Replacing equipment, Planning for the longer term, Keeping facilities, tools, and equipment in good working order.\n","API's COS application is influenced by findings from consultation and interaction with other parties regarding local and regional planning issues. Findings include: System access investments should be about meeting mandated obligations and helping the community.  Going forward System Renewal should be at a level  that doesn't increase outages any higher than those experienced over the past 3 years. The COS application should maitain the current level of investment in facilities, tools and equipment."]
["- Taking AIM Applied Insights Methodology 7 online surveys 2018-2019 - Chapter survey 6","Chapter survey 6 is about identifying priorities and testing concepts as they relate to subjects such as: communication, customer care operations, satisfaction with information provided on things such as electricity safety, and facilities. This is a Level 3 and Level 4 (Gaining Wisdom by Participating with People) engagement survey.","Findings include a desire for more communication. API put an electricity safety quiz with explainer videos on their website. Respondents were asked about their willingness to pay for 12 Customer Care operational items, Chapter 7 questions on the same 12 items were adjusted in order to gain further insight. Findings also show that respondents would support a pragmatic approach to retro-fitting or replacing facilities. "]
["- Taking AIM Applied Insights Methodology 7 online surveys 2018-2019 - Chapter survey 7","Chapter survey 7 is about specific DSP topics, capital and other investments in Operations and Customer Care operational changes/enhancements. This survey is a Level 3 and Level 4 engagement survey. ","Decision making for API's COS application will be influenced by respondents' ranking of 9 decision-making criteria.  The top three: Keep costs low. Maintain safe, reliable distribution of electricity and reduce response times to outages.  Data shows there were 8% of respondents unwilling to pay any additional costs for any items such as system renewal, system service, general plant and vegetation management. Regardless of the rationale used to support COS increases, there will be a small but important respondent group who will oppose the increase. However, a clear majority support inflationary type increases."]

{"sheet":"App.2-B_Acctg Instructions","index":12,"n_rows":54,"n_cols":7,"rows_kept":54,"cut":false,"hidden":false,"merged":[[107,0,107,10],[107,11,107,18],[108,0,108,10],[108,11,108,18],[109,0,109,10],[109,11,109,18],[104,0,104,10],[104,11,104,18],[105,0,105,10],[105,11,105,18],[106,0,106,10],[106,11,106,18],[101,0,101,10],[101,11,101,18],[102,0,102,10],[102,11,102,18],[103,0,103,10],[103,11,103,18],[98,0,98,10],[98,11,98,18],[99,0,99,10],[99,11,99,18],[100,0,100,10],[100,11,100,18],[95,0,95,10],[95,11,95,18],[96,0,96,10],[96,11,96,18],[97,0,97,10],[97,11,97,18],[92,0,92,10],[92,11,92,18],[93,0,93,10],[93,11,93,18],[94,0,94,10],[94,11,94,18],[89,0,89,10],[89,11,89,18],[90,0,90,10],[90,11,90,18],[91,0,91,10],[91,11,91,18],[86,0,86,10],[86,11,86,18],[87,0,87,10],[87,11,87,18],[88,0,88,10],[88,11,88,18],[83,0,83,10],[83,11,83,18],[84,0,84,10],[84,11,84,18],[85,0,85,10],[85,11,85,18],[80,0,80,10],[80,11,80,18],[81,0,81,10],[81,11,81,18],[82,0,82,10],[82,11,82,18],[76,11,76,18],[77,0,77,10],[77,11,77,18],[78,0,78,10],[78,11,78,18],[79,0,79,10],[79,11,79,18],[73,0,73,10],[73,11,73,18],[74,0,74,10],[74,11,74,18],[75,0,75,10],[75,11,75,18],[70,0,70,10],[70,11,70,18],[71,0,71,10],[71,11,71,18],[72,0,72,10],[72,11,72,18],[67,0,67,10],[67,11,67,18],[68,0,68,10],[68,11,68,18],[69,0,69,10],[69,11,69,18],[64,0,64,10],[64,11,64,18],[65,0,65,10],[65,11,65,18],[66,0,66,10],[66,11,66,18],[61,0,61,10],[61,11,61,18],[62,0,62,10],[62,11,62,18],[63,0,63,10],[63,11,63,18],[57,0,57,10],[57,11,57,18],[58,0,58,10],[58,11,58,18],[59,11,59,18],[60,0,60,10],[60,11,60,18],[42,1,42,12],[43,1,43,12],[46,1,46,11],[47,0,48,12],[53,0,53,12],[56,0,56,10],[56,11,56,18],[19,0,19,8],[20,0,20,8],[26,0,28,10],[30,0,30,9],[36,0,36,10],[37,0,37,11],[0,0,0,10],[1,0,1,10],[5,0,5,10],[8,4,8,5],[10,0,16,0],[18,0,18,9]]}
["General Instructions to MIFRS Appendices"]
["Types of Schedules to File"]
[]
["The purpose of this tab is to provide general instructions.  The specific instructions to each appendix are listed in footnotes of each appendix."]
[]
["The typical applicant is expected to have made capitalization and depreciation policy changes under CGAAP as permitted by the Board on January 1, 2012 or mandated by the Board by January 1, 2013, and adopted IFRS for reporting purposes on January 1, 2015 (transition date January 1, 2014).  Some distributors filing for 2018 rates have rebased with these accounting changes reflected in a prior rebasing application.  If that is the case, information relating to pre-accounting policy changes is not generally required.  The information to be provided by applicants will depend on when the accounting policy changes were made and when they last rebased.  In general, applicants should provide the following information in the appendices: "]
[]
[]
[null,null,null,null,"Reflecting Accounting Policy Changes in Current Application",null,"Reflected Accounting Policy Changes in Prior Application3"]
[null,null,null,null,"Accounting Policy Changes in 2012 and Adopted IFRS in 2015","Accounting Policy Changes in 2013 and Adopted IFRS in 2015","Adopted IFRS in 2015"]
["Information to be filed in 2019 CoS Application",2019,"Test",null,"MIFRS","MIFRS","MIFRS"]
[null,2018,"Bridge",null,"MIFRS","MIFRS","MIFRS"]
[null,2017,"Historical",null,"MIFRS","MIFRS","MIFRS"]
[null,2016,"Historical",null,"MIFRS","MIFRS","MIFRS"]
[null,2015,"Historical",null," MIFRS and Revised CGAAP1"," MIFRS and Revised CGAAP1"," MIFRS and Revised CGAAP1"]
[null,2014,"Historical",null,"Revised CGAAP","CGAAP and Revised CGAAP2","N/A"]
[null,2013,"Historical",null,"CGAAP and Revised CGAAP2","N/A","N/A"]
[]
["1)  For the transition year (2014), the applicant may file two appendices, one under Revised CGAAP and one under MIFRS, depending on the materiality of impacts.  See the specific instructions under each appendix below for further details."]
["2) For applicants that are reflecting accounting policy changes for the first time in a rebasing application, the applicant must file two appendices in the year that the applicant implemented changes to its capitalization and depreciation policies (2012 or 2013), one before and one after the policy changes."]
["3) Applicants should provide CGAAP and Revised CGAAP schedules (i.e. as indicated in the first two columns of the above table) to support balances in Account 1576 if the account has yet to be disposed of."]
[]
[]
["Appendix 2-BA - Fixed Asset Schedule "]
[]
["Applicants are to provide Appendix 2-BA in accordance with the years and corresponding accounting standards noted in the above table to provide a year over year continuity in fixed assets."]
["For the transition year (2014), the applicant should file two appendices, one under Revised CGAAP and one under MIFRS if the change between Revised CGAAP and MIFRS is material.  If the change from the accounting standards is not material, the applicant may choose to only provide one appendix under MIFRS.  However, the applicant must also indicate the fixed asset net book value balance under Revised CGAAP, the total dollar value of the change and explain why it is not material."]
[]
[]
[]
["The applicant must establish the continuity of historic cost for gross assets and accumulated depreciation by asset class by ensuring that the opening balance in the year agrees to the closing balance in the prior year."]
[]
[]
["Appendix 2-Cx - Depreciation and Amortization "]
[]
["Applicants are to provide Appendix 2-C in accordance with the years and corresponding accounting standards listed in the above table.  "]
["Appendix 2-C is to be used under all three of the scenarios presented in the table above. In the appendix, the applicant will need to indicate which scenario applies. The appendix is to be duplicated for each year and accounting standard required under the scenario."]
["Depreciation accounting policy changes were mandated by the Board by January 1, 2013. In general, no further changes to an applicant's depreciation policy (i.e.  assets' service lives) are expected after the Board mandated changes by January 1, 2013.    If the applicant has made any changes to its depreciation policy subsequent to the Board mandated changes, for the year of the change, applicants must complete Appendix 2-C before and after the change. Applicants must also  explain the nature of the change, the reason for the change, quantify the impact of the change, and quantify the depreciation expense before and after the change."]
[]
["Appendix 2-E - Account 1575, IFRS-CGAAP Transitional PP&E Amounts (2-EA), Account 1576, Accounting Changes Under CGAAP (2-EB, 2-EC) CONTACT OEB STAFF IF TAB REQUIRED"]
[]
["1) For an applicant that has a balance in Account 1576 to dispose:"]
["·       ","If an applicant changed capitalization and depreciation policies effective January 1, 2012, the applicant must complete Appendix 2-EB "]
["·       ","If an applicant changed capitalization and depreciation policies effective January 1, 2013, the applicant must complete Appendix 2-EC"]
[]
["2) For an applicant that has a balance in Account 1575 to dispose:"]
["·       ","The applicant must complete 2-EA"]
[" If the applicant did not make any further PP&E accounting policy changes beyond the capitalization and depreciation policy changes as mandated by the Board by January 1, 2013 (i.e. no further changes made on transition to IFRS), the applicant must indicate this and does not need to complete Appendix 2-EA."]
[]
[]
[]
["Appendix 2-Y - Summary of Impacts to Revenue Requirement from Transition to MIFRS CONTACT OEB STAFF IF TAB REQUIRED"]
[]
["An applicant must provide a summary of the dollar impacts of MIFRS to each component of the revenue requirement (e.g. rate base, operating costs, etc.), including the overall impact on the proposed revenue requirement.  Accordingly,  the applicant must identify financial differences and resulting revenue requirement impacts arising from the adoption of  MIFRS as compared to CGAAP.  If the applicant is reflecting the changes in capitalization and depreciation policies for the first time in a rebasing application, then a comparison between MIFRS and CGAAP before the change in accounting policies should be completed.  If the applicant changed capitalization and depreciation policies and  reflected these changes in a prior rebasing application, then a comparison between MIFRS and CGAAP after the change in accounting policies should be completed.  "]

{"sheet":"App.2-BA_Fixed Asset Cont","index":13,"n_rows":84,"n_cols":13,"rows_kept":84,"cut":false,"hidden":false,"merged":[[87,1,88,12],[83,1,85,12],[74,1,75,12],[77,1,77,12],[8,0,8,12],[9,0,9,12],[14,3,14,6],[61,2,61,8],[62,2,62,8],[71,1,72,12]]}
[null,"See separate workbook",null,null,null,null,null,null,null,null,null,"File Number:",{"$f":"EBNUMBER","v":"EB-2019-0019"}]
[null,null,null,null,null,null,null,null,null,null,null,"Exhibit:"]
[null,null,null,null,null,null,null,null,null,null,null,"Tab:"]
[null,null,null,null,null,null,null,null,null,null,null,"Schedule:"]
[null,null,null,null,null,null,null,null,null,null,null,"Page:"]
[]
[null,null,null,null,null,null,null,null,null,null,null,"Date:"]
[]
["Appendix 2-BA"]
["Fixed Asset Continuity Schedule 1 "]
[]
[null,null,null,null,"Accounting Standard","MIFRS"]
[null,null,null,null,"Year "]
[]
[null,null,null,"Cost",null,null,null,null,null,"Accumulated Depreciation"]
["CCA Class 2","OEB Account 3","Description 3","Opening Balance","Additions 4","Disposals 6","Closing Balance",null,"Opening Balance","Additions","Disposals 6","Closing Balance","Net Book Value"]
[null,1609,"Capital Contributions Paid",null,null,null,{"$f":"D17+E17+F17","v":0},null,null,null,null,{"$f":"I17+J17+K17","v":0},{"$f":"G17+L17","v":0}]
[12,1611,"Computer Software (Formally known as Account 1925)",null,null,null,{"$f":"D18+E18+F18","v":0},null,null,null,null,{"$f":"I18+J18+K18","v":0},{"$f":"G18+L18","v":0}]
["CEC",1612,"Land Rights (Formally known as Account 1906)",null,null,null,{"$f":"D19+E19+F19","v":0},null,null,null,null,{"$f":"I19+J19+K19","v":0},{"$f":"G19+L19","v":0}]
["N/A",1805,"Land",null,null,null,{"$f":"D20+E20+F20","v":0},null,null,null,null,{"$f":"I20+J20+K20","v":0},{"$f":"G20+L20","v":0}]
[47,1808,"Buildings",null,null,null,{"$f":"D21+E21+F21","v":0},null,null,null,null,{"$f":"I21+J21+K21","v":0},{"$f":"G21+L21","v":0}]
[13,1810,"Leasehold Improvements",null,null,null,0,null,null,null,null,0,0]
[47,1815,"Transformer Station Equipment >50 kV",null,null,null,0,null,null,null,null,0,0]
[47,1820,"Distribution Station Equipment <50 kV",null,null,null,0,null,null,null,null,0,0]
[47,1825,"Storage Battery Equipment",null,null,null,0,null,null,null,null,0,0]
[47,1830,"Poles, Towers & Fixtures",null,null,null,0,null,null,null,null,0,0]
[47,1835,"Overhead Conductors & Devices",null,null,null,0,null,null,null,null,0,0]
[47,1840,"Underground Conduit",null,null,null,0,null,null,null,null,0,0]
[47,1845,"Underground Conductors & Devices",null,null,null,0,null,null,null,null,0,0]
[47,1850,"Line Transformers",null,null,null,0,null,null,null,null,0,0]
[47,1855,"Services (Overhead & Underground)",null,null,null,0,null,null,null,null,0,0]
[47,1860,"Meters",null,null,null,0,null,null,null,null,0,0]
[47,1860,"Meters (Smart Meters)",null,null,null,0,null,null,null,null,0,0]
["N/A",1905,"Land",null,null,null,0,null,null,null,null,0,0]
[47,1908,"Buildings & Fixtures",null,null,null,0,null,null,null,null,0,0]
[13,1910,"Leasehold Improvements",null,null,null,0,null,null,null,null,0,0]
[8,1915,"Office Furniture & Equipment (10 years)",null,null,null,0,null,null,null,null,0,0]
[8,1915,"Office Furniture & Equipment (5 years)",null,null,null,0,null,null,null,null,0,0]
[10,1920,"Computer Equipment - Hardware",null,null,null,0,null,null,null,null,0,0]
[45,1920,"Computer Equip.-Hardware(Post Mar. 22/04)",null,null,null,0,null,null,null,null,0,0]
[45.1,1920,"Computer Equip.-Hardware(Post Mar. 19/07)",null,null,null,0,null,null,null,null,0,0]
[10,1930,"Transportation Equipment",null,null,null,0,null,null,null,null,0,0]
[8,1935,"Stores Equipment",null,null,null,0,null,null,null,null,0,0]
[8,1940,"Tools, Shop & Garage Equipment",null,null,null,0,null,null,null,null,0,0]
[8,1945,"Measurement & Testing Equipment",null,null,null,0,null,null,null,null,0,0]
[8,1950,"Power Operated Equipment",null,null,null,0,null,null,null,null,0,0]
[8,1955,"Communications Equipment",null,null,null,0,null,null,null,null,0,0]
[8,1955,"Communication Equipment (Smart Meters)",null,null,null,0,null,null,null,null,0,0]
[8,1960,"Miscellaneous Equipment ",null,null,null,0,null,null,null,null,0,0]
[47,1970,"Load Management Controls Customer Premises",null,null,null,0,null,null,null,null,0,0]
[47,1975,"Load Management Controls Utility Premises",null,null,null,0,null,null,null,null,0,0]
[47,1980,"System Supervisor Equipment",null,null,null,0,null,null,null,null,0,0]
[47,1985,"Miscellaneous Fixed Assets",null,null,null,0,null,null,null,null,0,0]
[47,1990,"Other Tangible Property",null,null,null,0,null,null,null,null,0,0]
[47,1995,"Contributions & Grants",null,null,null,0,null,null,null,null,0,0]
[47,2440,"Deferred Revenue5"]
[null,null,null,null,null,null,0,null,null,null,null,0,0]
[null,null,"Sub-Total",{"$f":"SUM(D17:D57)","v":0},{"$f":"SUM(E17:E57)","v":0},{"$f":"SUM(F17:F57)","v":0},{"$f":"SUM(G17:G57)","v":0},null,{"$f":"SUM(I17:I57)","v":0},{"$f":"SUM(J17:J57)","v":0},{"$f":"SUM(K17:K57)","v":0},{"$f":"SUM(L17:L57)","v":0},{"$f":"SUM(M17:M57)","v":0}]
[null,null,"Less Socialized Renewable Energy Generation Investments (input as negative)",null,null,null,{"$f":"D59+E59+F59","v":0},null,null,null,null,{"$f":"I59+J59+K59","v":0},{"$f":"G59+L59","v":0}]
[null,null,"Less Other Non Rate-Regulated Utility Assets (input as negative)",null,null,null,0,null,null,null,null,{"$f":"I60+J60+K60","v":0},0]
[null,null,"Total PP&E",{"$f":"SUM(D58:D60)","v":0},{"$f":"SUM(E58:E60)","v":0},{"$f":"SUM(F58:F60)","v":0},{"$f":"SUM(G58:G60)","v":0},null,{"$f":"SUM(I58:I60)","v":0},{"$f":"SUM(J58:J60)","v":0},{"$f":"SUM(K58:K60)","v":0},{"$f":"SUM(L58:L60)","v":0},{"$f":"SUM(M58:M60)","v":0}]
[null,null,"Depreciation Expense adj. from gain or loss on the retirement of assets (pool of like assets), if applicable6"]
[null,null,"Total",null,null,null,null,null,null,{"$f":"J61+J62","v":0}]
[]
[null,null,null,null,null,null,null,null,"Less: Fully Allocated Depreciation"]
[10,null,"Transportation",null,null,null,null,null,"Transportation"]
[8,null,"Stores Equipment",null,null,null,null,null,"Stores Equipment"]
[null,null,null,null,null,null,null,null,"Net Depreciation",null,{"$f":"J63-K66-K67","v":0}]
[]
["Notes:"]
[]
[1,"Tables in the format outlined above covering all fixed asset accounts should be submitted for the Test Year, Bridge Year and all relevant historical years.  At a minimum , the applicant must provide data for the earlier of: 1) all historical years back to its last rebasing; or 2) at least three years of historical actuals, in addition to Bridge Year and Test Year forecasts."]
[]
[]
[2,"The \"CCA Class\" for fixed assets should agree with the CCA Class used for tax purposes in Tax Returns. Fixed Assets sub-components may be used where the underlying asset components are classified under multiple CCA Classes for tax purposes. If an applicant uses any different classes from those shown in the table, an explanation should be provided. (also see note 3)."]
[]
[]
[3,"The table may need to be customized for a utility's asset categories or for any new asset accounts announced or authorized by the Board."]
[]
[4,"The additions in column (E) must not include construction work in progress (CWIP)."]
[]
[5,"Effective on the date of IFRS adoption, customer contributions will no longer be recorded in Account 1995 Contributions & Grants, but will be recorded in Account 2440, Deferred Revenues.  "]
[]
[6,"The applicant must ensure that all asset disposals have been clearly identified in the Chapter 2 Appendices for all historic, bridge and test years.  Where a distributor for general financial reporting purposes under IFRS has accounted for the amount of gain or loss on the retirement of assets in a pool of like assets as a charge or credit to income, for reporting and rate application filings, the distributor shall reclassify such gains and losses as depreciation expense, and disclose the amount separately."]

{"sheet":"Appendix 2-BB Service Life  ","index":14,"n_rows":110,"n_cols":17,"rows_kept":110,"cut":false,"hidden":false,"merged":[[83,1,87,1],[83,2,87,2],[84,5,84,7],[106,0,106,7],[109,1,109,2],[84,15,84,16],[88,1,90,1],[88,2,90,2],[89,5,89,7],[89,15,89,16],[91,1,94,1],[91,2,94,2],[94,3,94,4],[95,1,96,1],[95,2,96,2],[95,3,95,4],[96,3,96,4],[88,3,88,4],[88,6,88,7],[89,3,89,4],[90,3,90,4],[101,2,101,4],[101,6,101,7],[102,2,102,4],[90,6,90,7],[91,3,91,4],[91,6,91,7],[16,0,33,0],[29,1,30,1],[29,2,30,2],[29,3,29,4],[30,3,30,4],[30,5,30,7],[27,2,27,4],[28,2,28,4],[19,1,21,1],[19,2,21,2],[19,3,19,4],[56,2,56,4],[58,3,58,4],[57,2,57,4],[58,1,59,1],[58,2,59,2],[59,3,59,4],[51,2,51,4],[52,2,52,4],[53,2,53,4],[54,2,54,4],[30,15,30,16],[33,2,33,4],[34,0,50,0],[34,1,36,1],[34,2,36,2],[36,3,36,4],[38,2,38,4],[39,1,41,1],[39,2,41,2],[42,1,43,1],[43,3,43,4],[35,3,35,4],[37,2,37,4],[48,2,48,4],[39,3,39,4],[40,3,40,4],[41,3,41,4],[42,3,42,4],[49,2,49,4],[50,2,50,4],[34,3,34,4],[44,2,44,4],[45,2,45,4],[46,2,46,4],[0,15,0,16],[1,15,1,16],[2,15,2,16],[3,15,3,16],[4,15,4,16],[6,15,6,16],[14,11,14,12],[14,13,14,14],[31,2,31,4],[14,2,14,4],[14,5,14,7],[14,9,15,9],[14,10,15,10],[8,0,8,16],[9,0,9,16],[10,0,10,16],[14,15,14,16],[15,2,15,4],[16,1,18,1],[16,2,18,2],[16,3,16,4],[17,3,18,3],[25,2,25,4],[26,2,26,4],[47,2,47,4],[20,3,21,3],[22,1,24,1],[22,2,24,2],[22,3,22,4],[23,3,24,3],[32,2,32,4],[69,2,69,4],[60,2,60,4],[61,2,61,4],[63,3,63,4],[51,0,69,0],[62,2,62,4],[63,1,64,1],[63,2,64,2],[64,3,64,4],[65,2,65,4],[66,2,66,4],[67,2,67,4],[68,2,68,4],[55,2,55,4],[70,2,70,4],[73,0,73,7],[80,6,80,7],[81,2,81,4],[75,2,75,4],[76,2,76,4],[77,6,77,7],[78,3,78,4],[75,5,76,7],[78,1,80,1],[78,2,80,2],[80,3,80,4],[81,6,81,7],[78,6,78,7],[79,3,79,4],[79,6,79,7],[75,9,76,9],[75,10,76,10],[75,11,75,12],[75,13,75,14],[75,15,75,16],[77,2,77,4],[86,3,86,4],[86,6,86,7],[87,3,87,4],[87,6,87,7],[83,3,83,4],[83,6,83,7],[84,3,84,4],[85,3,85,4],[85,6,85,7],[82,2,82,4],[82,5,82,7],[102,6,102,7],[103,2,103,4],[103,6,103,7],[92,3,92,4],[92,6,92,7],[93,3,93,4],[93,6,93,7],[100,2,100,4],[100,6,100,7],[97,2,97,4],[97,6,97,7],[98,2,98,4],[98,6,98,7],[99,2,99,4],[99,6,99,7],[94,6,94,7],[95,6,95,7],[96,6,96,7]]}
[null,null,null,null,null,null,null,null,null,null,null,null,null,"File Number:",null,{"$f":"'LDC Info'!E16","v":"EB-2019-0019"}]
[null,null,null,null,null,null,null,null,null,null,null,null,null,"Exhibit:",null,2]
[null,null,null,null,null,null,null,null,null,null,null,null,null,"Tab:"]
[null,null,null,null,null,null,null,null,null,null,null,null,null,"Schedule:"]
[null,null,null,null,null,null,null,null,null,null,null,null,null,"Page:"]
[]
[null,null,null,null,null,null,null,null,null,null,null,null,null,"Date:",null,"2019-05-17"]
[]
["Appendix 2-BB"]
["Service Life Comparison"]
["Table F-1 from Kinetrics Report1"]
[]
[]
[]
[null,null,"Asset Details",null,null,"Useful Life",null,null,null,"USoA Account Number","USoA Account Description","Current",null,"Proposed",null,"Outside Range of Min, Max TUL?"]
["Parent*","#","Category| Component | Type",null,null,"MIN UL","TUL","MAX UL",null,null,null,"Years","Rate","Years","Rate","Below Min TUL","Above Max TUL"]
["OH",1,"Fully Dressed Wood Poles","Overall",null,35,45,75,null,1830,"Poles, Towers and Fixtures",45,{"$f":"IF(ISERROR(1/L17), \"\", 1/L17)","v":2.2222222222222223E-2},{"$f":"+L17","v":45},{"$f":"IF(ISERROR(1/N17), \"\", 1/N17)","v":2.2222222222222223E-2},{"$f":"IF(ISBLANK(N17),\"\",IF(N17<F17,\"Yes\",\"No\"))","v":"No"},{"$f":"IF(ISBLANK(N17),\"\",IF(N17>H17,\"Yes\",\"No\"))","v":"No"}]
[null,null,null,"Cross Arm","Wood",20,40,55,null,null,null,null,{"$f":"IF(ISERROR(1/L18), \"\", 1/L18)","v":""},null,{"$f":"IF(ISERROR(1/N18), \"\", 1/N18)","v":""},{"$f":"IF(ISBLANK(N18),\"\",IF(N18<F18,\"Yes\",\"No\"))","v":""},{"$f":"IF(ISBLANK(N18),\"\",IF(N18>H18,\"Yes\",\"No\"))","v":""}]
[null,null,null,null,"Steel",30,70,95,null,null,null,null,"",null,"","",""]
[null,2,"Fully Dressed Concrete Poles","Overall",null,50,60,80,null,null,null,null,"",null,"","",""]
[null,null,null,"Cross Arm","Wood",20,40,55,null,null,null,null,"",null,"","",""]
[null,null,null,null,"Steel",30,70,95,null,null,null,null,"",null,"","",""]
[null,3,"Fully Dressed Steel Poles","Overall",null,60,60,80,null,null,null,null,"",null,"","",""]
[null,null,null,"Cross Arm","Wood",20,40,55,null,null,null,null,"",null,"","",""]
[null,null,null,null,"Steel",30,70,95,null,null,null,null,"",null,"","",""]
[null,4,"OH Line Switch",null,null,30,45,55,null,1835,"Overhead Conductors and Devices",45,2.2222222222222223E-2,{"$f":"+L26","v":45},2.2222222222222223E-2,"No","No"]
[null,5,"OH Line Switch Motor",null,null,15,25,25,null,null,null,null,"",null,"","",""]
[null,6,"OH Line Switch RTU",null,null,15,20,20,null,null,null,null,"",null,"","",""]
[null,7,"OH Integral Switches",null,null,35,45,60,null,1835,"Overhead Conductors and Devices",45,2.2222222222222223E-2,{"$f":"+L29","v":45},2.2222222222222223E-2,"No","No"]
[null,8,"OH Conductors","Primary",null,50,60,75,null,1835,"Overhead Conductors and Devices",45,2.2222222222222223E-2,{"$f":"+L30","v":45},2.2222222222222223E-2,"Yes","No"]
[null,null,null,"Service Wire",null,"N/A",null,null,null,1855,"Services",40,2.5000000000000001E-2,40,2.5000000000000001E-2,"N/A"]
[null,9,"OH Transformers & Voltage Regulators",null,null,30,40,60,null,1850,"Line Transformers",40,2.5000000000000001E-2,40,2.5000000000000001E-2,"No","No"]
[null,10,"OH Shunt Capacitor Banks",null,null,25,30,40,null,1835,"Overhead Conductors and Devices",45,2.2222222222222223E-2,45,2.2222222222222223E-2,"No","Yes"]
[null,11,"Reclosers",null,null,25,40,55,null,1835,"Overhead Conductors and Devices",45,2.2222222222222223E-2,45,2.2222222222222223E-2,"No","No"]
["TS & MS",12,"Power Transformers","Overall",null,30,45,60,null,1820,"Station Equipment < 50 kV",50,0.02,50,0.02,"No","No"]
[null,null,null,"Bushing",null,10,20,30,null,null,null,null,"",null,"","",""]
[null,null,null,"Tap Changer",null,20,30,60,null,null,null,null,"",null,"","",""]
[null,13,"Station Service Transformer",null,null,30,45,55,null,null,null,null,"",null,"","",""]
[null,14,"Station Grounding Transformer",null,null,30,40,40,null,null,null,null,"",null,"","",""]
[null,15,"Station DC System","Overall",null,10,20,30,null,"1820A","Station Equipment < 50 kV",40,2.5000000000000001E-2,{"$f":"+L40","v":40},2.5000000000000001E-2,"No","Yes"]
[null,null,null,"Battery Bank",null,10,15,15,null,null,null,null,"",null,"","",""]
[null,null,null,"Charger",null,20,20,30,null,null,null,null,"",null,"","",""]
[null,16,"Station Metal Clad Switchgear","Overall",null,30,40,60,null,"1820A","Station Equipment < 50 kV",40,2.5000000000000001E-2,{"$f":"+L43","v":40},2.5000000000000001E-2,"No","No"]
[null,null,null,"Removable Breaker",null,25,40,60,null,null,null,null,"",null,"","",""]
[null,17,"Station Independent Breakers",null,null,35,45,65,null,"1820A","Station Equipment < 50 kV",40,2.5000000000000001E-2,{"$f":"+L45","v":40},2.5000000000000001E-2,"No","No"]
[null,18,"Station Switch",null,null,30,50,60,null,"1820A","Station Equipment < 50 kV",40,2.5000000000000001E-2,40,2.5000000000000001E-2,"No","No"]
[null,19,"Electromechanical Relays",null,null,25,35,50,null,null,null,null,"",null,"","",""]
[null,20,"Solid State Relays",null,null,10,30,45,null,null,null,null,"",null,"","",""]
[null,21,"Digital & Numeric Relays",null,null,15,20,20,null,null,null,null,"",null,"","",""]
[null,22,"Rigid Busbars",null,null,30,55,60,null,null,null,null,"",null,"","",""]
[null,23,"Steel Structure",null,null,35,50,90,null,null,null,null,"",null,"","",""]
["UG",24,"Primary Paper Insulated Lead Covered (PILC) Cables",null,null,60,65,75,null,null,null,null,"",null,"","",""]
[null,25,"Primary Ethylene-Propylene Rubber (EPR) Cables",null,null,20,25,25,null,null,null,null,"",null,"","",""]
[null,26,"Primary Non-Tree Retardant (TR) Cross Linked \nPolyethylene (XLPE) Cables Direct Buried",null,null,20,25,30,null,1845,"UG Conductor & Devices",40,2.5000000000000001E-2,{"$f":"+L54","v":40},2.5000000000000001E-2,"No","Yes"]
[null,27,"Primary Non-TR XLPE Cables in Duct",null,null,20,25,30,null,null,null,null,"",null,"","",""]
[null,30,"Secondary PILC Cables",null,null,70,75,80,null,null,null,null,"",null,"","",""]
[null,31,"Secondary Cables Direct Buried",null,null,25,35,40,null,1855,"Services",40,2.5000000000000001E-2,{"$f":"+L57","v":40},2.5000000000000001E-2,"No","No"]
[null,32,"Secondary Cables in Duct",null,null,35,40,60,null,null,null,null,"",null,"","",""]
[null,33,"Network Tranformers","Overall",null,20,35,50,null,null,null,null,"",null,"","",""]
[null,null,null,"Protector",null,20,35,40,null,null,null,null,"",null,"","",""]
[null,34,"Pad-Mounted Transformers",null,null,25,40,45,null,1850,"Line Transformers",40,2.5000000000000001E-2,{"$f":"+L61","v":40},2.5000000000000001E-2,"No","No"]
[null,35,"Submersible/Vault Transformers",null,null,25,35,45,null,null,null,null,"",null,"","",""]
[null,36,"UG Foundation",null,null,35,55,70,null,null,null,null,"",null,"","",""]
[null,37,"UG Vaults","Overall",null,40,60,80,null,null,null,null,"",null,"","",""]
[null,null,null,"Roof",null,20,30,45,null,null,null,null,"",null,"","",""]
[null,38,"UG Vault Switches",null,null,20,35,50,null,null,null,null,"",null,"","",""]
[null,39,"Pad-Mounted Switchgear",null,null,20,30,45,null,null,null,null,"",null,"","",""]
[null,40,"Ducts",null,null,30,50,85,null,null,null,null,"",null,"","",""]
[null,41,"Concrete Encased Duct Banks",null,null,35,55,80,null,null,null,null,"",null,"","",""]
[null,42,"Cable Chambers",null,null,50,60,80,null,null,null,null,"",null,"","",""]
["S",43,"Remote SCADA",null,null,15,20,30,null,1980,"System Supervisory Equipment",20,0.05,{"$f":"+L71","v":20},0.05,"No","No"]
[]
[]
["Table F-2 from Kinetrics Report1"]
[]
[null,null,"Asset Details",null,null,"Useful Life Range",null,null,null,"USoA Account Number","USoA Account Description","Current",null,"Proposed",null,"Outside Range of Min, Max TUL?"]
[null,"#","Category| Component | Type",null,null,null,null,null,null,null,null,"Years","Rate","Years","Rate","Below Min Range","Above Max Range"]
[null,1,"Office Equipment",null,null,5,15,null,null,1915,"Office Furniture & Equipment",10,{"$f":"IF(ISERROR(1/L78), \"\", 1/L78)","v":0.1},{"$f":"+L78","v":10},{"$f":"IF(ISERROR(1/N78), \"\", 1/N78)","v":0.1},{"$f":"IF(ISBLANK(N78),\"\",IF(N78<F78,\"Yes\",\"No\"))","v":"No"},{"$f":"IF(ISBLANK(N78),\"\",IF(N78>G78,\"Yes\",\"No\"))","v":"No"}]
[null,2,"Vehicles","Trucks & Buckets",null,5,15,null,null,"1930A","Transportation Equipment",10,{"$f":"IF(ISERROR(1/L79), \"\", 1/L79)","v":0.1},{"$f":"+L79","v":10},{"$f":"IF(ISERROR(1/N79), \"\", 1/N79)","v":0.1},{"$f":"IF(ISBLANK(N79),\"\",IF(N79<F79,\"Yes\",\"No\"))","v":"No"},{"$f":"IF(ISBLANK(N79),\"\",IF(N79>G79,\"Yes\",\"No\"))","v":"No"}]
[null,null,null,"Trailers",null,5,20,null,null,"1930A","Transportation Equipment",10,0.1,10,0.1,"No","No"]
[null,null,null,"Vans",null,5,10,null,null,1930,"Transportation Equipment",5,0.2,5,0.2,"No","No"]
[null,3,"Administrative Buildings",null,null,50,75,null,null,1908,"Buildings & Fixtures",50,0.02,50,0.02,"No","No"]
[null,4,"Leasehold Improvements",null,null,"Lease dependent",null,null,null,1910,"Leasehold Improvements",5,0.2,5,0.2]
[null,5,"Station Buildings","Station Buildings",null,50,75,null,null,1808,"Buildings",50,0.02,50,0.02,"No","No"]
[null,null,null,"Station Buildings - Components",null,"N/A",null,null,null,"1808A","Buildings - Components",25,0.04,25,0.04,"N/A"]
[null,null,null,"Parking",null,25,30,null,null,null,null,null,"",null,"","",""]
[null,null,null,"Fence",null,25,60,null,null,null,null,null,"",null,"","",""]
[null,null,null,"Roof",null,20,30,null,null,null,null,null,"",null,"","",""]
[null,6,"Computer Equipment","Hardware",null,3,5,null,null,1920,"Computer Hardware",5,0.2,{"$f":"+L89","v":5},0.2,"No","No"]
[null,null,null,"Software - SAP",null,"N/A",null,null,null,"1611A","Computer Software",10,0.1,{"$f":"+L90","v":10},0.1,"N/A"]
[null,null,null,"Software - Other",null,2,5,null,null,1611,"Computer Software",5,0.2,5,0.2,"No","No"]
[null,7,"Equipment","Power Operated",null,5,10,null,null,1950,"Power Operated Equipment",10,0.1,10,0.1,"No","No"]
[null,null,null,"Stores",null,5,10,null,null,null,null,null,"",null,"","",""]
[null,null,null,"Tools, Shop, Garage Equipment",null,5,10,null,null,1940,"Tools, Shop & Garage Equipment",10,0.1,10,0.1,"No","No"]
[null,null,null,"Measurement & Testing Equipment",null,5,10,null,null,1945,"Measurement & Test Equipment",10,0.1,10,0.1,"No","No"]
[null,8,"Communication","Towers",null,60,70,null,null,null,null,null,"",null,"","",""]
[null,null,null,"Wireless",null,2,10,null,null,1955,"Communication Equipment",10,0.1,{"$f":"+L97","v":10},0.1,"No","No"]
[null,9,"Residential Energy Meters",null,null,25,35,null,null,1860,"Meters",30,3.3333333333333333E-2,{"$f":"+L98","v":30},3.3333333333333333E-2,"No","No"]
[null,10,"Industrial/Commercial Energy Meters",null,null,25,35,null,null,1860,"Meters",30,3.3333333333333333E-2,30,3.3333333333333333E-2,"No","No"]
[null,11,"Wholesale Energy Meters",null,null,15,30,null,null,1860,"Meters",30,3.3333333333333333E-2,30,3.3333333333333333E-2,"No","No"]
[null,12,"Current & Potential Transformer (CT & PT)",null,null,35,50,null,null,"1860B","Meters",30,3.3333333333333333E-2,30,3.3333333333333333E-2,"Yes","No"]
[null,13,"Smart Meters",null,null,5,15,null,null,"1860A","Meters",15,6.6666666666666666E-2,15,6.6666666666666666E-2,"No","No"]
[null,14,"Repeaters - Smart Metering",null,null,10,15,null,null,null,null,null,"",null,"","",""]
[null,15,"Data Collectors - Smart Metering",null,null,15,20,null,null,null,null,null,"",null,"","",""]
[]
[]
["* TS & MS = Transformer and Municipal Stations UG = Underground Systems S = Monitoring and Control Systems"]
[]
["Note 1:","Tables F-1 and F-2 above are to be used as a reference in order to complete columns J, K, L and N."]
[null,"See pages 17-19 of Kinetrics Report"]

{"sheet":"App.2-C_DepExp","index":15,"n_rows":76,"n_cols":25,"rows_kept":76,"cut":false,"hidden":false,"merged":[[71,1,71,18],[73,1,73,18],[20,0,21,0],[20,1,21,1],[64,1,64,18],[68,1,68,18],[69,1,69,18],[70,1,70,18],[15,0,15,1],[15,2,15,16],[16,0,16,1],[16,2,16,16],[19,2,19,8],[19,9,19,12],[19,13,19,16],[14,0,14,1],[14,2,14,16],[8,0,8,18],[9,0,9,18],[10,0,10,18],[13,0,13,1],[13,2,13,16]]}
[]
[]
[]
[]
[]
[null,null,null,null,null,null,null,"See separate workbook"]
[]
[]
["Appendix 2-C",null,null,null,null,null,null,null,null,null,null,null,null,null,null,null,null,null,null,null,null,null,null,null,"CGAAP"]
["Depreciation and Amortization Expense",null,null,null,null,null,null,null,null,null,null,null,null,null,null,null,null,null,null,null,null,null,null,null,"Revised CGAAP"]
[null,null,null,null,null,null,null,null,null,null,null,null,null,null,null,null,null,null,null,null,null,null,null,null,"MIFRS"]
["This appendix is to be completed in conjunction with the accounting instructions in Appendix 2-B"]
[]
["Scenario that applies",null,"Applicable Years and Accounting Standard",null,null,null,null,null,null,null,null,null,null,null,null,null,null,"Year Reflected in Schedule Below","Accounting Standard Reflected in Schedule Below",null,null,null,null,null,2012]
["Rebasing for the first time with depreciation policy changes made in 2012.",null,"This appendix must be duplicated and completed for the years 2012 to 2018. The appendix for 2012 is to be completed under CGAAP (prior to changes in depreciation policies). The appendix for 2012 to 2014 must be completed under Revised CGAAP (after changes in depreciation policies). The appendix for 2014 to 2018 is to be completed under MIFRS (2014 if changes to MIFRS are material).",null,null,null,null,null,null,null,null,null,null,null,null,null,null,null,null,null,null,null,null,null,2013]
["Rebasing for the first time with depreciation policy changes made in 2013.",null,"This appendix must be duplicated and completed for the years 2013 to 2018. The appendix for 2013 is to be completed under CGAAP (prior to changes in depreciation policies). The appendix for 2013 to 2014 must be completed under Revised CGAAP (after changes in depreciation policies). The appendix for 2014 to 2018 is to be completed under MIFRS (2014 if changes to MIFRS are material).",null,null,null,null,null,null,null,null,null,null,null,null,null,null,null,null,null,null,null,null,null,2014]
["Already rebased with depreciation policy changes in a prior rate application",null,"This appendix must be completed for 2014 to 2018. The appendix for 2014 is to be completed under Revised CGAAP (after changes in depreciation policies). The appendix for 2014 to 2018 is to be completed under MIFRS (2014 if changes to MIFRS are material).",null,null,null,null,null,null,null,null,null,null,null,null,null,null,null,null,null,null,null,null,null,2015]
[null,null,null,null,null,null,null,null,null,null,null,null,null,null,null,null,null,null,null,null,null,null,null,null,2016]
[null,null,null,null,null,null,null,null,null,null,null,null,null,null,null,null,null,null,null,null,null,null,null,null,2017]
[null,null,"Book Values",null,null,null,null,null,null,"Service Lives",null,null,null,"Depreciation Expense",null,null,null,null,null,null,null,null,null,null,2018]
["Account","Description","Opening Net  Book Value of Existing Assets as at Date of Policy Change (Jan. 1) 1","Less Fully Depreciated 7","Net Amount of Existing Assets Before Policy Change to be Depreciated ","Opening Gross Book Value of Assets Acquired After Policy Change 2","Less Fully Depreciated 8","Net Amount of Assets Acquired After Policy Change to be Depreciated ","Current Year Additions","Average Remaining Life of Assets Existing Before Policy Change 3","Depreciation Rate Assets Acquired After Policy Change","Life of Assets Acquired After Policy Change 4","Depreciation Rate on New Additions","Depreciation Expense on Assets Existing Before Policy Change","Depreciation Expense on Assets Acquired After Policy Change","Depreciation Expense on Current Year Additions 5","Total Current Year Depreciation Expense ","Depreciation Expense per Appendix 2-BA Fixed Assets, Column J \n ","Variance 6"]
[null,null,"a","b","c = a-b","d","e","f = d- e","g","h","i = 1/h","j","k = 1/j","l = c/h","m = f/j","n = g*0.5/j","o = l+m+n","p","q = p-o"]
[1611,"Computer Software (Formally known as Account 1925)",null,null,{"$f":"C23-D23","v":0},null,null,{"$f":"F23-G23","v":0},null,null,{"$f":"IF(J23=0,0,1/J23)","v":0},null,{"$f":"IF(L23=0,0,1/L23)","v":0},{"$f":"IF(J23=0,0,+E23/J23)","v":0},{"$f":"IF(L23=0,0,+H23/L23)","v":0},{"$f":"IF(L23=0,0,+(I23*0.5)/L23)","v":0},{"$f":"IF(ISERROR(+N23+O23+P23), 0, +N23+O23+P23)","v":0},null,{"$f":"IF(ISERROR(+R23-122), 0, +R23-Q23)","v":0}]
[1612,"Land Rights (Formally known as Account 1906)",null,null,{"$f":"C24-D24","v":0},null,null,{"$f":"F24-G24","v":0},null,null,{"$f":"IF(J24=0,0,1/J24)","v":0},null,{"$f":"IF(L24=0,0,1/L24)","v":0},{"$f":"IF(J24=0,0,+E24/J24)","v":0},{"$f":"IF(L24=0,0,+H24/L24)","v":0},{"$f":"IF(L24=0,0,+(I24*0.5)/L24)","v":0},{"$f":"IF(ISERROR(+N24+O24+P24), 0, +N24+O24+P24)","v":0},null,{"$f":"IF(ISERROR(+R24-122), 0, +R24-Q24)","v":0}]
[1805,"Land",null,null,0,null,null,0,null,null,0,null,0,0,{"$f":"IF(L25=0,0,+H25/L25)","v":0},0,0,null,0]
[1808,"Buildings",null,null,0,null,null,0,null,null,0,null,0,0,0,0,0,null,0]
[1810,"Leasehold Improvements",null,null,0,null,null,0,null,null,0,null,0,0,0,0,0,null,0]
[1815,"Transformer Station Equipment >50 kV",null,null,0,null,null,0,null,null,0,null,0,0,0,0,0,null,0]
[1820,"Distribution Station Equipment <50 kV",null,null,0,null,null,0,null,null,0,null,0,0,0,0,0,null,0]
[1825,"Storage Battery Equipment",null,null,0,null,null,0,null,null,0,null,0,0,0,0,0,null,0]
[1830,"Poles, Towers & Fixtures",null,null,0,null,null,0,null,null,0,null,0,0,0,0,0,null,0]
[1835,"Overhead Conductors & Devices",null,null,0,null,null,0,null,null,0,null,0,0,0,0,0,null,0]
[1840,"Underground Conduit",null,null,0,null,null,0,null,null,0,null,0,0,0,0,0,null,0]
[1845,"Underground Conductors & Devices",null,null,0,null,null,0,null,null,0,null,0,0,0,0,0,null,0]
[1850,"Line Transformers",null,null,0,null,null,0,null,null,0,null,0,0,0,0,0,null,0]
[1855,"Services (Overhead & Underground)",null,null,0,null,null,0,null,null,0,null,0,0,0,0,0,null,0]
[1860,"Meters",null,null,0,null,null,0,null,null,0,null,0,0,0,0,0,null,0]
[1860,"Meters (Smart Meters)",null,null,0,null,null,0,null,null,0,null,0,0,0,0,0,null,0]
[1905,"Land",null,null,0,null,null,0,null,null,0,null,0,0,0,0,0,null,0]
[1908,"Buildings & Fixtures",null,null,0,null,null,0,null,null,0,null,0,0,0,0,0,null,0]
[1910,"Leasehold Improvements",null,null,0,null,null,0,null,null,0,null,0,0,0,0,0,null,0]
[1915,"Office Furniture & Equipment (10 years)",null,null,0,null,null,0,null,null,0,null,0,0,0,0,0,null,0]
[1915,"Office Furniture & Equipment (5 years)",null,null,0,null,null,0,null,null,0,null,0,0,0,0,0,null,0]
[1920,"Computer Equipment - Hardware",null,null,0,null,null,0,null,null,0,null,0,0,0,0,0,null,0]
[1920,"Computer Equip.-Hardware(Post Mar. 22/04)",null,null,0,null,null,0,null,null,0,null,0,0,0,0,0,null,0]
[1920,"Computer Equip.-Hardware(Post Mar. 19/07)",null,null,0,null,null,0,null,null,0,null,0,0,0,0,0,null,0]
[1930,"Transportation Equipment",null,null,0,null,null,0,null,null,0,null,0,0,0,0,0,null,0]
[1935,"Stores Equipment",null,null,0,null,null,0,null,null,0,null,0,0,0,0,0,null,0]
[1940,"Tools, Shop & Garage Equipment",null,null,0,null,null,0,null,null,0,null,0,0,0,0,0,null,0]
[1945,"Measurement & Testing Equipment",null,null,0,null,null,0,null,null,0,null,0,0,0,0,0,null,0]
[1950,"Power Operated Equipment",null,null,0,null,null,0,null,null,0,null,0,0,0,0,0,null,0]
[1955,"Communications Equipment",null,null,0,null,null,0,null,null,0,null,0,0,0,0,0,null,0]
[1955,"Communication Equipment (Smart Meters)",null,null,0,null,null,0,null,null,0,null,0,0,0,0,0,null,0]
[1960,"Miscellaneous Equipment ",null,null,0,null,null,0,null,null,0,null,0,0,0,0,0,null,0]
[1970,"Load Management Controls Customer Premises",null,null,0,null,null,0,null,null,0,null,0,0,0,0,0,null,0]
[1975,"Load Management Controls Utility Premises",null,null,0,null,null,0,null,null,0,null,0,0,0,0,0,null,0]
[1980,"System Supervisor Equipment",null,null,0,null,null,0,null,null,0,null,0,0,0,0,0,null,0]
[1985,"Miscellaneous Fixed Assets",null,null,0,null,null,0,null,null,0,null,0,0,0,0,0,null,0]
[1990,"Other Tangible Property",null,null,0,null,null,0,null,null,0,null,0,0,0,0,0,null,0]
[1995,"Contributions & Grants",null,null,0,null,null,0,null,null,0,null,0,0,0,0,0,null,0]
[null,"Total",{"$f":"SUM(C23:C60)","v":0},0,0,0,0,0,0,null,null,null,null,{"$f":"SUM(N23:N60)","v":0},0,0,0,0,0]
[]
[]
["General:","Applicants are to complete this appendix to show the reasonability of the depreciation expense that is included in rate base via. Accumulated depreciation and the revenue requirement."]
[null,"Applicants must provide a breakdown of depreciation and amortization expense in the above format for all relevant accounts.  Balances presented in the table should exclude asset retirement obligations (AROs) and the related depreciation and accretion expense. These should be disclosed separately consistent with the Notes of historical Audited Financial Statements."]
[]
[]
["Notes:"]
[1,"This is the net book value of assets that existed as at the date of the utility's change in depreciation policies (i.e. as at Jan. 1, 2012 or Jan. 1, 2013).  These assets are to be depreciated at the average remaining service life. This amount will not change in years subsequent to the date of the utility's change in depreciation policies.  This column is expected to be used until the assets that existed as at the date of the utility's change in depreciation policies are fully depreciated."]
[2,"This is the opening gross book value of assets that have been acquired after the date of the utilities change in depreciation policies (i.e. additions starting in 2012/2013 for those who changed policies Jan. 1, 2012/2013). These assets are to be depreciated at the revised service life. The amount is expected to be equal to the gross book value of the prior year plus the prior year's additions."]
[3,"A recalculation should be performed to determine the average remaining life of opening balance of assets (i.e. excluding current year's additions) under the change in policies under CGAAP.  For example, Asset A had a useful life of 20 years under CGAAP without the change in policies.  On January 1 of the year of policy changes, Asset A was 3 years depreciated. As a result, Asset A would have a remaining service life of 17 years (20 years less 3 years) as at January 1 of the year of policy changes.  Due to making the change in policies under CGAAP, management re-assessed the asset useful lives and concluded that the revised useful life of Asset A is now 30 years. Therefore, the average remaining useful life of the opening balance of Asset A is determined to be 27 years (30 years less 3 years) under the revised CGAAP as at January 1 of the year of policy changes."]
[4,"The useful life used should be consistent with the OEB's regulatory accounting policies as set out in the  Accounting Procedures Handbook for Electricity Distributors, effective Jan. 1, 2012 and also with the Report of the Board, Transition to International Financial Reporting Standards, EB-2008-0408, and the Kinectrics Report."]
[5,"Board policy of the \"half-year\" rule - the applicant must ensure that additions in the year attract a half-year depreciation expense in the first year.  Deviations from this standard practice must be supported in the application."]
[6,"The applicant must provide an explanation of material variances in evidence."]
[7,"This should include assets in column a (excel column C) that become fully depreciated since the date of the policy change.  The amount input in b (excel column D) should equal the net book value of the asset as at the date of depreciation policy change"]
[8,"This should include assets in column d (excel column f) that have become fully depreciated.  The amount input in e (excel column G) should equal the gross book value of the asset"]

{"sheet":"App.2-D_Overhead","index":16,"n_rows":58,"n_cols":9,"rows_kept":58,"cut":false,"hidden":false,"merged":[[72,0,73,0],[58,0,59,0],[58,2,59,2],[61,0,62,0],[64,0,65,0],[67,0,70,0],[8,0,8,8],[9,0,9,8],[13,0,15,0],[30,0,32,0],[30,8,32,8],[11,0,11,6],[28,0,28,6]]}
[null,null,null,null,null,null,"File Number:",{"$f":"EBNUMBER","v":"EB-2019-0019"}]
[null,null,null,null,null,null,"Exhibit:",2]
[null,null,null,null,null,null,"Tab:"]
[null,null,null,null,null,null,"Schedule:"]
[null,null,null,null,null,null,"Page:"]
[]
[null,null,null,null,null,null,"Date:","2019-05-17"]
[]
["Appendix 2-D"]
["Overhead Expense"]
[]
["Applicants are to provide a breakdown of OM&A before capitalization in the below table.  OM&A before capitalization may be broken down by cost center, program, drivers or another format best suited to focus on capitalized vs. uncapitalized OM&A."]
[]
[" OM&A Before Capitalization"]
[null,{"$f":"F15-4","v":2015},{"$f":"G15-4","v":2016},{"$f":"G15-3","v":2017},{"$f":"G15-2","v":2018},{"$f":"G15-1","v":2019},{"$f":"TestYear","v":2020}]
[null,"Historical Year","Historical Year","Historical Year","Historical Year","Bridge Year","Test Year"]
["Operations and Maintenance",7746765.0900000017,7665357.580000001,7852512.0099999998,8270224.9000000004,8341726.4299999997,8335081.1800000016]
["Billing and Collecting",983003.47999999986,896274.71,888391.33000000007,939526.89,1013630.8400000001,1030997.1100000001]
["Community Relations",24429.71,32308.39,47552.270000000004,141890.12,94552.320000000007,96558]
["Administrative and General",4530640.74,4536039,4495876.5999999996,4373361.4399999995,4846021.04,5507487]
[]
[]
[]
[]
[]
[]
["Total OM&A Before Capitalization (B)",{"$f":"SUM(B17:B26)","v":13284839.020000003},13129979.680000002,13284332.209999999,13725003.35,14295930.629999999,14970123.290000001]
[]
["Applicants are to provide a breakdown of capitalized OM&A in the below table.  Capitalized OM&A may be broken down using the categories listed in the table below if possible.  Otherwise, applicants are to provide its own break down of capitalized OM&A."]
[]
["Capitalized OM&A",null,null,null,null,null,null,"Directly","Explanation for Change in Overhead Capitalized"]
[null,{"$f":"F32-4","v":2015},{"$f":"G32-4","v":2016},{"$f":"G32-3","v":2017},{"$f":"G32-2","v":2018},{"$f":"G32-1","v":2019},{"$f":"TestYear","v":2020},"Attributable?"]
[null,"Historical Year","Historical Year","Historical Year","Historical Year","Bridge Year","Test Year","(Yes/No)"]
["employee benefits"]
["costs of site preparation"]
["initial delivery and handling costs"]
["costs of testing whether the asset is functioning properly"]
["professional fees"]
[]
["costs of opening a new facility"]
["costs of introducing a new product or service (including costs of advertising and promotional activities)"]
["costs of conducting business in a new location or with a new class of customer (including costs of staff training)"]
["administration and other general overhead costs"]
[]
["Operational Departments",1450337,1303871,1137129,1558585,1325426,1254834,"Yes","No change since last CoS, costs are directly attributable to labour costs charged to capital and are included in burden rate.  Balance includes all directly attributable costs except for direct wages.  Pension and OPEB amounts capitalized are reported above."]
["Customer Service Department",18167,20673,13987,19592,43244,35583,"Yes","No change since last CoS, costs are directly attributable to labour costs charged to capital and are included in burden rate.  Balance includes all directly attributable costs except for direct wages."]
["Administrative and General Departments",776,1532,1495,12230,2806,2519,"Yes","No change since last CoS, costs are directly attributable to labour costs charged to capital and are included in burden rate.  Balance includes all directly attributable costs except for direct wages."]
[]
[]
[]
[]
[]
[]
[]
[]
["Total Capitalized OM&A (A)",{"$f":"SUM(B34:B55)","v":1469280},1326076,1152611,1590407,1371476,1292936]
[]
["% of Capitalized OM&A (=A/B)",{"$f":"IF(ISERROR(B56/B27),\"0%\",B56/B27)","v":0.11059825397869215},0.10099604358260514,8.676469255506522E-2,0.11587662016854809,9.5934712856115767E-2,8.6367758965864863E-2]

{"sheet":"App.2-EA_Account 1575 (2015)","index":17,"n_rows":47,"n_cols":9,"rows_kept":47,"cut":false,"hidden":true,"merged":[[47,0,47,9],[52,0,53,8],[25,1,26,5],[31,1,31,5],[37,6,38,7],[37,8,38,8],[20,1,20,5],[8,0,8,8],[9,0,9,8],[10,0,10,8],[12,0,12,8],[14,0,14,8]]}
[null,null,null,null,null,null,null,"File Number:",{"$f":"EBNUMBER","v":"EB-2019-0019"}]
[null,null,null,null,null,null,null,"Exhibit:"]
[null,null,null,null,null,null,null,"Tab:"]
[null,null,null,null,null,null,null,"Schedule:"]
[null,null,null,null,null,null,null,"Page:"]
[]
[null,null,null,null,null,null,null,"Date:"]
[]
["Appendix 2-EA"]
["Account 1575 - IFRS-CGAAP Transitional PP&E Amounts"]
["2015 Adopters of IFRS for Financial Reporting Purposes"]
[]
["For applicants that adopted IFRS on January 1, 2015 for financial reporting purposes"]
[]
[]
[]
[null,2014,{"$f":"TestYear-3","v":2017},{"$f":"TestYear-2","v":2018},{"$f":"CONCATENATE(TestYear-1,\" Bridge Year\")","v":"2019 Bridge Year"},{"$f":"CONCATENATE(TestYear,\" Rebasing Year\")","v":"2020 Rebasing Year"}]
["Reporting Basis","CGAAP","CGAAP","CGAAP","MIFRS","MIFRS"]
[null,"Actual","Actual","Actual","Forecast","Forecast"]
[null,null,null,"$","$"]
["PP&E Values under CGAAP"]
["            Opening net PP&E - Note 1",null,{"$f":"+B25","v":0},{"$f":"+C25","v":0},{"$f":"+D25","v":0}]
["            Net Additions - Note 4"]
["            Net Depreciation (amounts should be negative) - Note 4"]
["            Closing net PP&E (1)",{"$f":"SUM(B22:B24)","v":0},{"$f":"SUM(C22:C24)","v":0},{"$f":"SUM(D22:D24)","v":0},{"$f":"SUM(E22:E24)","v":0}]
[]
["PP&E Values under MIFRS (Starts from 2014, the transition year)"]
["            Opening net PP&E  - Note 1",null,{"$f":"+B31","v":0},{"$f":"+C31","v":0},{"$f":"+D31","v":0}]
["            Net Additions - Note 4"]
["            Net Depreciation (amounts should be negative) - Note 4"]
["            Closing net PP&E (2)",{"$f":"SUM(B28:B30)","v":0},{"$f":"SUM(C28:C30)","v":0},{"$f":"SUM(D28:D30)","v":0},{"$f":"SUM(E28:E30)","v":0}]
[]
["Difference in Closing net PP&E, former CGAAP vs. revised CGAAP ",{"$f":"B25-B31","v":0},{"$f":"C25-C31","v":0},{"$f":"D25-D31","v":0},{"$f":"E25-E31","v":0}]
[]
[]
["Effect on Deferral and Variance Account Rate Riders"]
["Closing balance in Account 1575",null,null,null,null,{"$f":"IF(ISERROR(E33), 0, E33)","v":0},null,"WACC"]
["Return on Rate Base Associated with Account 1575 balance at WACC  - Note 2",null,null,null,null,{"$f":"E33*I37*I38","v":0},"# of years of rate rider disposition period"]
["     Amount included in Deferral and Variance Account Rate Rider Calculation",null,null,null,null,{"$f":"F37+F38","v":0}]
[]
["Notes:"]
["1  For an applicant that adopted IFRS on January 1, 2015, the PP&E values as of January 1, 2014 under both CGAAP and MIFRS should be the same. "]
["2 Return on rate base associated with deferred balance is calculated as:"]
["     the deferral account closing balance as of 2017 x WACC X # of years of rate rider disposition period"]
["     * Please note that the calculation should be adjusted once WACC is updated and finalized in the rate application."]
["3  The  PP&E deferral account is cleared by including the total balance in the deferral and variance account rate rider calculation."]
["4  Net additions are additions net of disposals; Net depreciation is additions to depreciation net of disposals."]

{"sheet":"App.2-EB_Account 1576 (2012)","index":18,"n_rows":48,"n_cols":12,"rows_kept":48,"cut":false,"hidden":true,"merged":[[41,0,41,12],[45,0,45,10],[8,0,8,11],[9,0,9,11],[10,0,10,11],[12,0,13,11],[14,0,14,11],[20,1,20,8],[25,1,26,8],[31,1,31,8],[37,9,38,10],[37,11,38,11]]}
[null,null,null,null,null,null,null,null,null,null,"File Number:",{"$f":"EBNUMBER","v":"EB-2019-0019"}]
[null,null,null,null,null,null,null,null,null,null,"Exhibit:"]
[null,null,null,null,null,null,null,null,null,null,"Tab:"]
[null,null,null,null,null,null,null,null,null,null,"Schedule:"]
[null,null,null,null,null,null,null,null,null,null,"Page:"]
[]
[null,null,null,null,null,null,null,null,null,null,"Date:"]
[]
["Appendix 2-EB"]
["Account 1576 - Accounting Changes under CGAAP"]
["2012 Changes in Accounting Policies under CGAAP"]
[]
["For applicants with a balance in Account 1576 and made capitalization and depreciation expense accounting policy changes under CGAAP effective January 1, 2012.  This is the first time the applicant is rebasing with changes in these accounting policies."]
[]
[]
[]
[null,"Prior Years Rebasing",2012,2013,2014,2015,2016,2017,"2018 Rebasing Year"]
["Reporting Basis","CGAAP","CGAAP","CGAAP","CGAAP","MIFRS - Note 5","MIFRS","MIFRS","MIFRS"]
[null,"Forecast","Actual","Actual","Actual","Actual","Actual","Forecast","Forecast"]
[null,null,"$","$","$","$","$","$"]
["PP&E Values under former CGAAP"]
["            Opening net PP&E - Note 1",null,null,{"$f":"+C25","v":0},{"$f":"+D25","v":0},{"$f":"+E25","v":0},{"$f":"+F25","v":0},{"$f":"+G25","v":0}]
["            Net Additions - Note 4"]
["            Net Depreciation (amounts should be negative) - Note 4"]
["            Closing net PP&E (1)",null,{"$f":"C22+C23+C24","v":0},0,0,0,0,0]
[]
["PP&E Values under revised CGAAP (Starts from 2012)"]
["            Opening net PP&E  - Note 1",null,null,{"$f":"+C31","v":0},{"$f":"+D31","v":0},{"$f":"+E31","v":0},{"$f":"+F31","v":0},{"$f":"+G31","v":0}]
["            Net Additions - Note 4"]
["            Net Depreciation (amounts should be negative) - Note 4"]
["            Closing net PP&E (2)",null,{"$f":"SUM(C28:C30)","v":0},0,0,0,0,0]
[]
["Difference in Closing net PP&E, former CGAAP vs. revised CGAAP ",null,{"$f":"C25-C31","v":0},0,0,0,0,0]
[]
[]
["Effect on Deferral and Variance Account Rate Riders"]
["Closing balance in Account 1576",null,null,null,null,null,null,null,{"$f":"IF(ISERROR(H33), 0, H33)","v":0},null,"WACC"]
["Return on Rate Base Associated with Account 1576 balance at WACC  - Note 2",null,null,null,null,null,null,null,{"$f":"H33*L37*L38","v":0},"# of years of rate rider disposition period"]
["     Amount included in Deferral and Variance Account Rate Rider Calculation",null,null,null,null,null,null,null,{"$f":"I37+I38","v":0}]
[]
["Notes:"]
["1  For an applicant that made the capitalization and depreciation expense accounting policy changes on January 1, 2012, the PP&E values as of January 1, 2012 under both former CGAAP and revised CGAAP should be the same. "]
["2 Return on rate base associated with Account 1576 balance is calculated as:"]
["     the variance account ending balance as of 2017 x WACC X # of years of rate rider disposition period"]
["     * Please note that the calculation should be adjusted once WACC is updated and finalized in the rate application."]
["3  Account 1576 is cleared by including the total balance in the deferral and variance account rate rider calculation."]
["4  Net additions are additions net of disposals; Net depreciation is additions to depreciation net of disposals."]
["5 Differences due to the adoption of MIFRS are to be shown separately in Account 1575 in Appendix 2-EA as Accounts 1575 and 1576 cannot be used interchangably."]

{"sheet":"App.2-EC_Account 1576 (2013)","index":19,"n_rows":48,"n_cols":11,"rows_kept":48,"cut":false,"hidden":true,"merged":[[45,0,45,9],[8,0,8,10],[9,0,9,10],[10,0,10,10],[12,0,12,10],[14,0,14,10],[37,10,38,10],[20,1,20,7],[25,1,26,7],[31,1,31,7],[37,8,38,9],[41,0,41,11]]}
[null,null,null,null,null,null,null,null,null,"File Number:",{"$f":"EBNUMBER","v":"EB-2019-0019"}]
[null,null,null,null,null,null,null,null,null,"Exhibit:"]
[null,null,null,null,null,null,null,null,null,"Tab:"]
[null,null,null,null,null,null,null,null,null,"Schedule:"]
[null,null,null,null,null,null,null,null,null,"Page:"]
[]
[null,null,null,null,null,null,null,null,null,"Date:"]
[]
["Appendix 2-EC"]
["Account 1576 - Accounting Changes under CGAAP"]
["2013 Changes in Accounting Policies under CGAAP"]
[]
["For applicants with a balance in Account 1576 and made capitalization and depreciation expense accounting policy changes under CGAAP effective January 1, 2013.  This is the first time the applicant is rebasing with changes in these accounting policies."]
[]
[]
[]
[null,"Prior Years Rebasing",2013,2014,2015,2016,2017,"2018 Rebasing Year"]
["Reporting Basis","CGAAP","CGAAP","CGAAP","MIFRS - Note 5","MIFRS","MIFRS","MIFRS"]
[null,"Actual","Actual","Actual","Actual","Actual","Forecast","Forecast"]
[null,null,"$","$",null,"$"]
["PP&E Values under former CGAAP"]
["            Opening net PP&E - Note 1",null,null,{"$f":"+C25","v":0},{"$f":"+D25","v":0},{"$f":"+E25","v":0},{"$f":"+F25","v":0}]
["            Net Additions - Note 4"]
["            Net Depreciation (amounts should be negative) - Note 4"]
["            Closing net PP&E (1)",null,{"$f":"C22+C23+C24","v":0},{"$f":"D22+D23+D24","v":0},{"$f":"E22+E23+E24","v":0},{"$f":"F22+F23+F24","v":0},{"$f":"G22+G23+G24","v":0}]
[]
["PP&E Values under revised CGAAP (Starts from 2012)"]
["            Opening net PP&E  - Note 1",null,null,{"$f":"+C31","v":0},{"$f":"+D31","v":0},{"$f":"+E31","v":0},{"$f":"+F31","v":0}]
["            Net Additions - Note 4"]
["            Net Depreciation (amounts should be negative) - Note 4"]
["            Closing net PP&E (2)",null,{"$f":"SUM(C28:C30)","v":0},{"$f":"SUM(D28:D30)","v":0},{"$f":"SUM(E28:E30)","v":0},{"$f":"SUM(F28:F30)","v":0},{"$f":"SUM(G28:G30)","v":0}]
[]
["Difference in Closing net PP&E, former CGAAP vs. revised CGAAP ",null,{"$f":"C25-C31","v":0},{"$f":"D25-D31","v":0},{"$f":"E25-E31","v":0},{"$f":"F25-F31","v":0},{"$f":"G25-G31","v":0}]
[]
[]
["Effect on Deferral and Variance Account Rate Riders"]
["Closing balance in Account 1576",null,null,null,null,null,null,{"$f":"IF(ISERROR(G33), 0, G33)","v":0},null,"WACC"]
["Return on Rate Base Associated with Account 1576 balance at WACC  - Note 2",null,null,null,null,null,null,{"$f":"G33*K37*K38","v":0},"# of years of rate rider disposition period"]
["     Amount included in Deferral and Variance Account Rate Rider Calculation",null,null,null,null,null,null,{"$f":"H37+H38","v":0}]
[]
["Notes:"]
["1  For an applicant that made the capitalization and depreciation expense accounting policy changes on January 1, 2013, the PP&E values as of January 1, 2013 under both former CGAAP and revised CGAAP should be the same. "]
["2 Return on rate base associated with Account 1576 balance is calculated as:"]
["     the variance account ending balance as of 2017 x WACC X # of years of rate rider disposition period"]
["     * Please note that the calculation should be adjusted once WACC is updated and finalized in the rate application."]
["3  Account 1576 is cleared by including the total balance in the deferral and variance account rate rider calculation."]
["4  Net additions are additions net of disposals; Net depreciation is additions to depreciation net of disposals."]
["5 Differences due to the adoption of MIFRS are to be shown separately in Account 1575 in Appendix 2-EA as Accounts 1575 and 1576 cannot be used interchangably."]

{"sheet":"App.2-FA Proposed REG Invest.","index":20,"n_rows":101,"n_cols":12,"rows_kept":101,"cut":false,"hidden":false,"merged":[[8,0,8,11],[17,0,17,9],[16,0,16,10],[12,0,12,7],[13,0,13,6],[14,0,14,6],[11,0,11,7],[9,0,9,11],[10,0,10,11]]}
[null,null,null,null,null,null,null,null,null,null,"File Number:",{"$f":"EBNUMBER","v":"EB-2019-0019"}]
[null,null,null,null,null,null,null,null,null,null,"Exhibit:"]
[null,null,null,null,null,null,null,null,null,null,"Tab:"]
["TO BE UPDATED AT DRAFT RATE ORDER STAGE",null,null,null,null,null,null,null,null,null,"Schedule:"]
[null,null,null,null,null,null,null,null,null,null,"Page:"]
[]
[null,null,null,null,null,null,null,null,null,null,"Date:"]
[]
["Appendix 2-FA"]
["Renewable Generation Connection Investment Summary (past investments or over the future rate setting period)"]
["**N/A for this Application**"]
["Enter the details of the Renewable Generation Connection projects as described in the appropriate section of the Filing Requirements."]
["All costs entered on this page will be transferred to the appropriate cells in the appendices that follow."]
["For Part A, Renewable Enabling Improvements (REI), these amounts will be transferred to Appendix 2 - FB"]
["For Part B, Expansions, these amounts will be transferred to Appendix 2 - FC"]
[]
["If there are more than five projects proposed to be in-service in a certain year, please amend the tables below and ensure that the formulae for the Total Amounts in any given rate year are updated."]
["Based on the current methodology and allocation, amounts allocated represent 6% for REI Connection Investments and 17% for Expansion Investments. (EB-2009-0349, 6-10-2010, p. 15, note 9)"]
[]
["There are two scenarios described below.  Separate sets of spreadsheets (2-FA, 2-FB, 2-FC) should be submited for each scenario as required."]
["Scenario 1:  Past Investments with No Recovery.  The distributor has made investments in the past (during the IRM Years), but has not received approval for these projects and therefore did not receive"]
["revenue from the IESO under Regulation 330/09 and did not receive ratepayer revenue for the direct benefit portion of the investment."]
["The WCA percentage, debt percentages, interest rates, kWh, tax rates, amortization period, CCA Class and percentage should correspond to the distributor's last Cost of Service approval. "]
["The Direct Benefit portion of the calculated Revenue Requirement for each year should be summed and can be applied for recovery from the distributor's ratepayers through a rate rider."]
["The Provincial Recovery portion of the calculated Revenue Requirement for each year should be summed and can be applied for recovery from the IESO through a separate order."]
[]
["Scenario 2:  Investments in the Test Year and Beyond.  Distributor plans to make investments in 2017 and/or beyond.  These investments should be added to 2-FA in the appropriate year."]
["The WCA percentage, debt percentages, interest rates, kWh, tax rates, amortization period, CCA Class and percentage should correspond to the distributor's current application. "]
[]
["Part A",null,null,null,null,null,null,"Test Year"]
["REI Investments (Direct Benefit at 6%)",null,{"$f":"D31-1","v":2015},{"$f":"E31-1","v":2016},{"$f":"F31-1","v":2017},{"$f":"G31-1","v":2018},{"$f":"H31-1","v":2019},{"$f":"TestYear","v":2020},{"$f":"H31+1","v":2021},{"$f":"I31+1","v":2022},{"$f":"J31+1","v":2023},{"$f":"K31+1","v":2024}]
["Project 1"]
["Name: REI Connection Project"]
["Capital Costs",null,0,0,0,0,0,0,0,0,0,0]
["OM&A (Start-Up)",null,0,0,0,0,0,0,0,0,0,0]
["OM&A (Ongoing)",null,0,0,0,0,0,0,0,0,0,0]
[]
["Project 2"]
["Name: REI Connection Project"]
["Capital Costs",null,0,0,0,0,0,0,0,0,0,0]
["OM&A (Start-Up)",null,0,0,0,0,0,0,0,0,0,0]
["OM&A (Ongoing)",null,0,0,0,0,0,0,0,0,0,0]
[]
["Project 3"]
["Name: REI Connection Project"]
["Capital Costs",null,0,0,0,0,0,0,0,0,0,0]
["OM&A (Start-Up)",null,0,0,0,0,0,0,0,0,0,0]
["OM&A (Ongoing)",null,0,0,0,0,0,0,0,0,0,0]
[]
["Project 4"]
["Name: REI Connection Project"]
["Capital Costs",null,0,0,0,0,0,0,0,0,0,0]
["OM&A (Start-Up)",null,0,0,0,0,0,0,0,0,0,0]
["OM&A (Ongoing)",null,0,0,0,0,0,0,0,0,0,0]
[]
["Project 5"]
["Name: REI Connection Project"]
["Capital Costs",null,0,0,0,0,0,0,0,0,0,0]
["OM&A (Start-Up)",null,0,0,0,0,0,0,0,0,0,0]
["OM&A (Ongoing)",null,0,0,0,0,0,0,0,0,0,0]
[]
["Total Capital Costs",null,{"$f":"SUM(C58,C52,C46,C40,C34)","v":0},{"$f":"SUM(D58,D52,D46,D40,D34)","v":0},0,0,0,{"$f":"SUM(H58,H52,H46,H40,H34)","v":0},{"$f":"SUM(I58,I52,I46,I40,I34)","v":0},0,0,0]
["Total OM&A (Start-Up)",null,{"$f":"SUM(C59,C53,C47,C41,C35)","v":0},0,0,0,0,{"$f":"SUM(H59,H53,H47,H41,H35)","v":0},0,0,0,0]
["Total OM&A (Ongoing)",null,{"$f":"SUM(C60,C54,C48,C42,C36)","v":0},0,0,0,0,{"$f":"SUM(H60,H54,H48,H42,H36)","v":0},0,0,0,0]
[]
[]
["Part B",null,null,null,null,null,null,"Test Year"]
["Expansion Investments (Direct Benefit at 17%)",null,{"$f":"D68-1","v":2015},{"$f":"E68-1","v":2016},{"$f":"F68-1","v":2017},{"$f":"G68-1","v":2018},{"$f":"H68-1","v":2019},{"$f":"TestYear","v":2020},{"$f":"H68+1","v":2021},{"$f":"I68+1","v":2022},{"$f":"J68+1","v":2023},{"$f":"K68+1","v":2024}]
["Project 1"]
["Name: Expansion Connection Project"]
["Capital Costs",null,0,0,0,0,0,0,0,0,0,0]
["OM&A (Start-Up)",null,0,0,0,0,0,0,0,0,0,0]
["OM&A (Ongoing)",null,0,0,0,0,0,0,0,0,0,0]
[]
["Project 2"]
["Name: Expansion Connection Project"]
["Capital Costs",null,0,0,0,0,0,0,0,0,0,0]
["OM&A (Start-Up)",null,0,0,0,0,0,0,0,0,0,0]
["OM&A (Ongoing)",null,0,0,0,0,0,0,0,0,0,0]
[]
["Project 3"]
["Name: Expansion Connection Project"]
["Capital Costs",null,0,0,0,0,0,0,0,0,0,0]
["OM&A (Start-Up)",null,0,0,0,0,0,0,0,0,0,0]
["OM&A (Ongoing)",null,0,0,0,0,0,0,0,0,0,0]
[]
["Project 4"]
["Name: Expansion Connection Project"]
["Capital Costs",null,0,0,0,0,0,0,0,0,0,0]
["OM&A (Start-Up)",null,0,0,0,0,0,0,0,0,0,0]
["OM&A (Ongoing)",null,0,0,0,0,0,0,0,0,0,0]
[]
["Project 5"]
["Name: Expansion Connection Project"]
["Capital Costs",null,0,0,0,0,0,0,0,0,0,0]
["OM&A (Start-Up)",null,0,0,0,0,0,0,0,0,0,0]
["OM&A (Ongoing)",null,0,0,0,0,0,0,0,0,0,0]
[]
["Total Capital Costs",null,{"$f":"SUM(C95,C89,C83,C77,C71)","v":0},{"$f":"SUM(D95,D89,D83,D77,D71)","v":0},0,0,0,{"$f":"SUM(H95,H89,H83,H77,H71)","v":0},{"$f":"SUM(I95,I89,I83,I77,I71)","v":0},0,0,0]
["Total OM&A (Start-Up)",null,{"$f":"SUM(C96,C90,C84,C78,C72)","v":0},0,0,0,0,{"$f":"SUM(H96,H90,H84,H78,H72)","v":0},0,0,0,0]
["Total OM&A (Ongoing)",null,{"$f":"SUM(C97,C91,C85,C79,C73)","v":0},0,0,0,0,{"$f":"SUM(H97,H91,H85,H79,H73)","v":0},0,0,0,0]

{"sheet":"Hidden_REG Invest.","index":21,"n_rows":61,"n_cols":8,"rows_kept":61,"cut":false,"hidden":true,"merged":[]}
["Utility Name","EB Number","Test Year","Bridge Year","Last Rebasing Year","Renewable Generation Connection Investment Summary","Year","Amount"]
[{"$f":"'LDC Info'!$E$14","v":"Algoma Power Inc."},{"$f":"EBNUMBER","v":"EB-2019-0019"},{"$f":"TestYear","v":2020},{"$f":"BridgeYear","v":2019},{"$f":"RebaseYear","v":2015},"REI Investments_A_Total Capital Costs",2014,{"$f":"'App.2-FA Proposed REG Invest.'!C62","v":0}]
[{"$f":"'LDC Info'!$E$14","v":"Algoma Power Inc."},"EB-2019-0019",2020,2019,2015,"REI Investments_A_Total OM&A Start-Up",2014,{"$f":"'App.2-FA Proposed REG Invest.'!C63","v":0}]
[{"$f":"'LDC Info'!$E$14","v":"Algoma Power Inc."},"EB-2019-0019",2020,2019,2015,"REI Investments_A_Total OM&A Ongoing",2014,{"$f":"'App.2-FA Proposed REG Invest.'!C64","v":0}]
[{"$f":"'LDC Info'!$E$14","v":"Algoma Power Inc."},"EB-2019-0019",2020,2019,2015,"REI Investments_A_Total Capital Costs",2015,{"$f":"'App.2-FA Proposed REG Invest.'!D62","v":0}]
[{"$f":"'LDC Info'!$E$14","v":"Algoma Power Inc."},"EB-2019-0019",2020,2019,2015,"REI Investments_A_Total OM&A Start-Up",2015,{"$f":"'App.2-FA Proposed REG Invest.'!D63","v":0}]
[{"$f":"'LDC Info'!$E$14","v":"Algoma Power Inc."},"EB-2019-0019",2020,2019,2015,"REI Investments_A_Total OM&A Ongoing",2015,{"$f":"'App.2-FA Proposed REG Invest.'!D64","v":0}]
[{"$f":"'LDC Info'!$E$14","v":"Algoma Power Inc."},"EB-2019-0019",2020,2019,2015,"REI Investments_A_Total Capital Costs",2016,{"$f":"'App.2-FA Proposed REG Invest.'!E62","v":0}]
[{"$f":"'LDC Info'!$E$14","v":"Algoma Power Inc."},"EB-2019-0019",2020,2019,2015,"REI Investments_A_Total OM&A Start-Up",2016,{"$f":"'App.2-FA Proposed REG Invest.'!E63","v":0}]
[{"$f":"'LDC Info'!$E$14","v":"Algoma Power Inc."},"EB-2019-0019",2020,2019,2015,"REI Investments_A_Total OM&A Ongoing",2016,{"$f":"'App.2-FA Proposed REG Invest.'!E64","v":0}]
[{"$f":"'LDC Info'!$E$14","v":"Algoma Power Inc."},"EB-2019-0019",2020,2019,2015,"REI Investments_A_Total Capital Costs",2017,{"$f":"'App.2-FA Proposed REG Invest.'!F62","v":0}]
[{"$f":"'LDC Info'!$E$14","v":"Algoma Power Inc."},"EB-2019-0019",2020,2019,2015,"REI Investments_A_Total OM&A Start-Up",2017,{"$f":"'App.2-FA Proposed REG Invest.'!F63","v":0}]
[{"$f":"'LDC Info'!$E$14","v":"Algoma Power Inc."},"EB-2019-0019",2020,2019,2015,"REI Investments_A_Total OM&A Ongoing",2017,{"$f":"'App.2-FA Proposed REG Invest.'!F64","v":0}]
[{"$f":"'LDC Info'!$E$14","v":"Algoma Power Inc."},"EB-2019-0019",2020,2019,2015,"REI Investments_A_Total Capital Costs",2018,{"$f":"'App.2-FA Proposed REG Invest.'!G62","v":0}]
[{"$f":"'LDC Info'!$E$14","v":"Algoma Power Inc."},"EB-2019-0019",2020,2019,2015,"REI Investments_A_Total OM&A Start-Up",2018,{"$f":"'App.2-FA Proposed REG Invest.'!G63","v":0}]
[{"$f":"'LDC Info'!$E$14","v":"Algoma Power Inc."},"EB-2019-0019",2020,2019,2015,"REI Investments_A_Total OM&A Ongoing",2018,{"$f":"'App.2-FA Proposed REG Invest.'!G64","v":0}]
[{"$f":"'LDC Info'!$E$14","v":"Algoma Power Inc."},"EB-2019-0019",2020,2019,2015,"REI Investments_A_Total Capital Costs",2019,{"$f":"'App.2-FA Proposed REG Invest.'!H62","v":0}]
[{"$f":"'LDC Info'!$E$14","v":"Algoma Power Inc."},"EB-2019-0019",2020,2019,2015,"REI Investments_A_Total OM&A Start-Up",2019,{"$f":"'App.2-FA Proposed REG Invest.'!H63","v":0}]
[{"$f":"'LDC Info'!$E$14","v":"Algoma Power Inc."},"EB-2019-0019",2020,2019,2015,"REI Investments_A_Total OM&A Ongoing",2019,{"$f":"'App.2-FA Proposed REG Invest.'!H64","v":0}]
[{"$f":"'LDC Info'!$E$14","v":"Algoma Power Inc."},"EB-2019-0019",2020,2019,2015,"REI Investments_A_Total Capital Costs",2020,{"$f":"'App.2-FA Proposed REG Invest.'!I62","v":0}]
[{"$f":"'LDC Info'!$E$14","v":"Algoma Power Inc."},"EB-2019-0019",2020,2019,2015,"REI Investments_A_Total OM&A Start-Up",2020,{"$f":"'App.2-FA Proposed REG Invest.'!I63","v":0}]
[{"$f":"'LDC Info'!$E$14","v":"Algoma Power Inc."},"EB-2019-0019",2020,2019,2015,"REI Investments_A_Total OM&A Ongoing",2020,{"$f":"'App.2-FA Proposed REG Invest.'!I64","v":0}]
[{"$f":"'LDC Info'!$E$14","v":"Algoma Power Inc."},"EB-2019-0019",2020,2019,2015,"REI Investments_A_Total Capital Costs",2021,{"$f":"'App.2-FA Proposed REG Invest.'!J62","v":0}]
[{"$f":"'LDC Info'!$E$14","v":"Algoma Power Inc."},"EB-2019-0019",2020,2019,2015,"REI Investments_A_Total OM&A Start-Up",2021,{"$f":"'App.2-FA Proposed REG Invest.'!J63","v":0}]
[{"$f":"'LDC Info'!$E$14","v":"Algoma Power Inc."},"EB-2019-0019",2020,2019,2015,"REI Investments_A_Total OM&A Ongoing",2021,{"$f":"'App.2-FA Proposed REG Invest.'!J64","v":0}]
[{"$f":"'LDC Info'!$E$14","v":"Algoma Power Inc."},"EB-2019-0019",2020,2019,2015,"REI Investments_A_Total Capital Costs",2022,{"$f":"'App.2-FA Proposed REG Invest.'!K62","v":0}]
[{"$f":"'LDC Info'!$E$14","v":"Algoma Power Inc."},"EB-2019-0019",2020,2019,2015,"REI Investments_A_Total OM&A Start-Up",2022,{"$f":"'App.2-FA Proposed REG Invest.'!K63","v":0}]
[{"$f":"'LDC Info'!$E$14","v":"Algoma Power Inc."},"EB-2019-0019",2020,2019,2015,"REI Investments_A_Total OM&A Ongoing",2022,{"$f":"'App.2-FA Proposed REG Invest.'!K64","v":0}]
[{"$f":"'LDC Info'!$E$14","v":"Algoma Power Inc."},"EB-2019-0019",2020,2019,2015,"REI Investments_A_Total Capital Costs",2023,{"$f":"'App.2-FA Proposed REG Invest.'!L62","v":0}]
[{"$f":"'LDC Info'!$E$14","v":"Algoma Power Inc."},"EB-2019-0019",2020,2019,2015,"REI Investments_A_Total OM&A Start-Up",2023,{"$f":"'App.2-FA Proposed REG Invest.'!L63","v":0}]
[{"$f":"'LDC Info'!$E$14","v":"Algoma Power Inc."},"EB-2019-0019",2020,2019,2015,"REI Investments_A_Total OM&A Ongoing",2023,{"$f":"'App.2-FA Proposed REG Invest.'!L64","v":0}]
[{"$f":"'LDC Info'!$E$14","v":"Algoma Power Inc."},"EB-2019-0019",2020,2019,2015,"Expansion Investments_B_Total Capital Costs",2014,{"$f":"'App.2-FA Proposed REG Invest.'!C99","v":0}]
[{"$f":"'LDC Info'!$E$14","v":"Algoma Power Inc."},"EB-2019-0019",2020,2019,2015,"Expansion Investments_B_Total OM&A Start-Up",2014,{"$f":"'App.2-FA Proposed REG Invest.'!C100","v":0}]
[{"$f":"'LDC Info'!$E$14","v":"Algoma Power Inc."},"EB-2019-0019",2020,2019,2015,"Expansion Investments_B_Total OM&A Ongoing",2014,{"$f":"'App.2-FA Proposed REG Invest.'!C101","v":0}]
[{"$f":"'LDC Info'!$E$14","v":"Algoma Power Inc."},"EB-2019-0019",2020,2019,2015,"Expansion Investments_B_Total Capital Costs",2015,{"$f":"'App.2-FA Proposed REG Invest.'!D99","v":0}]
[{"$f":"'LDC Info'!$E$14","v":"Algoma Power Inc."},"EB-2019-0019",2020,2019,2015,"Expansion Investments_B_Total OM&A Start-Up",2015,{"$f":"'App.2-FA Proposed REG Invest.'!D100","v":0}]
[{"$f":"'LDC Info'!$E$14","v":"Algoma Power Inc."},"EB-2019-0019",2020,2019,2015,"Expansion Investments_B_Total OM&A Ongoing",2015,{"$f":"'App.2-FA Proposed REG Invest.'!D101","v":0}]
[{"$f":"'LDC Info'!$E$14","v":"Algoma Power Inc."},"EB-2019-0019",2020,2019,2015,"Expansion Investments_B_Total Capital Costs",2016,{"$f":"'App.2-FA Proposed REG Invest.'!E99","v":0}]
[{"$f":"'LDC Info'!$E$14","v":"Algoma Power Inc."},"EB-2019-0019",2020,2019,2015,"Expansion Investments_B_Total OM&A Start-Up",2016,{"$f":"'App.2-FA Proposed REG Invest.'!E100","v":0}]
[{"$f":"'LDC Info'!$E$14","v":"Algoma Power Inc."},"EB-2019-0019",2020,2019,2015,"Expansion Investments_B_Total OM&A Ongoing",2016,{"$f":"'App.2-FA Proposed REG Invest.'!E101","v":0}]
[{"$f":"'LDC Info'!$E$14","v":"Algoma Power Inc."},"EB-2019-0019",2020,2019,2015,"Expansion Investments_B_Total Capital Costs",2017,{"$f":"'App.2-FA Proposed REG Invest.'!F99","v":0}]
[{"$f":"'LDC Info'!$E$14","v":"Algoma Power Inc."},"EB-2019-0019",2020,2019,2015,"Expansion Investments_B_Total OM&A Start-Up",2017,{"$f":"'App.2-FA Proposed REG Invest.'!F100","v":0}]
[{"$f":"'LDC Info'!$E$14","v":"Algoma Power Inc."},"EB-2019-0019",2020,2019,2015,"Expansion Investments_B_Total OM&A Ongoing",2017,{"$f":"'App.2-FA Proposed REG Invest.'!F101","v":0}]
[{"$f":"'LDC Info'!$E$14","v":"Algoma Power Inc."},"EB-2019-0019",2020,2019,2015,"Expansion Investments_B_Total Capital Costs",2018,{"$f":"'App.2-FA Proposed REG Invest.'!G99","v":0}]
[{"$f":"'LDC Info'!$E$14","v":"Algoma Power Inc."},"EB-2019-0019",2020,2019,2015,"Expansion Investments_B_Total OM&A Start-Up",2018,{"$f":"'App.2-FA Proposed REG Invest.'!G100","v":0}]
[{"$f":"'LDC Info'!$E$14","v":"Algoma Power Inc."},"EB-2019-0019",2020,2019,2015,"Expansion Investments_B_Total OM&A Ongoing",2018,{"$f":"'App.2-FA Proposed REG Invest.'!G101","v":0}]
[{"$f":"'LDC Info'!$E$14","v":"Algoma Power Inc."},"EB-2019-0019",2020,2019,2015,"Expansion Investments_B_Total Capital Costs",2019,{"$f":"'App.2-FA Proposed REG Invest.'!H99","v":0}]
[{"$f":"'LDC Info'!$E$14","v":"Algoma Power Inc."},"EB-2019-0019",2020,2019,2015,"Expansion Investments_B_Total OM&A Start-Up",2019,{"$f":"'App.2-FA Proposed REG Invest.'!H100","v":0}]
[{"$f":"'LDC Info'!$E$14","v":"Algoma Power Inc."},"EB-2019-0019",2020,2019,2015,"Expansion Investments_B_Total OM&A Ongoing",2019,{"$f":"'App.2-FA Proposed REG Invest.'!H101","v":0}]
[{"$f":"'LDC Info'!$E$14","v":"Algoma Power Inc."},"EB-2019-0019",2020,2019,2015,"Expansion Investments_B_Total Capital Costs",2020,{"$f":"'App.2-FA Proposed REG Invest.'!I99","v":0}]
[{"$f":"'LDC Info'!$E$14","v":"Algoma Power Inc."},"EB-2019-0019",2020,2019,2015,"Expansion Investments_B_Total OM&A Start-Up",2020,{"$f":"'App.2-FA Proposed REG Invest.'!I100","v":0}]
[{"$f":"'LDC Info'!$E$14","v":"Algoma Power Inc."},"EB-2019-0019",2020,2019,2015,"Expansion Investments_B_Total OM&A Ongoing",2020,{"$f":"'App.2-FA Proposed REG Invest.'!I101","v":0}]
[{"$f":"'LDC Info'!$E$14","v":"Algoma Power Inc."},"EB-2019-0019",2020,2019,2015,"Expansion Investments_B_Total Capital Costs",2021,{"$f":"'App.2-FA Proposed REG Invest.'!J99","v":0}]
[{"$f":"'LDC Info'!$E$14","v":"Algoma Power Inc."},"EB-2019-0019",2020,2019,2015,"Expansion Investments_B_Total OM&A Start-Up",2021,{"$f":"'App.2-FA Proposed REG Invest.'!J100","v":0}]
[{"$f":"'LDC Info'!$E$14","v":"Algoma Power Inc."},"EB-2019-0019",2020,2019,2015,"Expansion Investments_B_Total OM&A Ongoing",2021,{"$f":"'App.2-FA Proposed REG Invest.'!J101","v":0}]
[{"$f":"'LDC Info'!$E$14","v":"Algoma Power Inc."},"EB-2019-0019",2020,2019,2015,"Expansion Investments_B_Total Capital Costs",2022,{"$f":"'App.2-FA Proposed REG Invest.'!K99","v":0}]
[{"$f":"'LDC Info'!$E$14","v":"Algoma Power Inc."},"EB-2019-0019",2020,2019,2015,"Expansion Investments_B_Total OM&A Start-Up",2022,{"$f":"'App.2-FA Proposed REG Invest.'!K100","v":0}]
[{"$f":"'LDC Info'!$E$14","v":"Algoma Power Inc."},"EB-2019-0019",2020,2019,2015,"Expansion Investments_B_Total OM&A Ongoing",2022,{"$f":"'App.2-FA Proposed REG Invest.'!K101","v":0}]
[{"$f":"'LDC Info'!$E$14","v":"Algoma Power Inc."},"EB-2019-0019",2020,2019,2015,"Expansion Investments_B_Total Capital Costs",2023,{"$f":"'App.2-FA Proposed REG Invest.'!L99","v":0}]
[{"$f":"'LDC Info'!$E$14","v":"Algoma Power Inc."},"EB-2019-0019",2020,2019,2015,"Expansion Investments_B_Total OM&A Start-Up",2023,{"$f":"'App.2-FA Proposed REG Invest.'!L100","v":0}]
[{"$f":"'LDC Info'!$E$14","v":"Algoma Power Inc."},"EB-2019-0019",2020,2019,2015,"Expansion Investments_B_Total OM&A Ongoing",2023,{"$f":"'App.2-FA Proposed REG Invest.'!L101","v":0}]

{"sheet":"App.2-FB Calc of REG Improvemnt","index":22,"n_rows":95,"n_cols":32,"rows_kept":95,"cut":false,"hidden":false,"merged":[[16,29,16,31],[8,0,8,20],[9,0,9,20],[11,0,11,20],[12,0,12,20],[14,0,14,20],[10,0,10,20],[46,0,46,25],[16,17,16,19],[16,20,16,22],[16,23,16,25],[16,26,16,28],[16,14,16,16],[16,11,16,13],[16,8,16,10],[16,5,16,7],[16,2,16,4],[51,27,51,28],[51,30,51,31],[48,0,48,25],[49,0,49,1],[51,18,51,19],[51,21,51,22],[51,24,51,25],[51,15,51,16],[51,12,51,13],[51,9,51,10],[51,6,51,7],[51,3,51,4]]}
[null,null,null,null,null,null,null,null,null,null,null,null,null,null,null,null,"File Number:",{"$f":"EBNUMBER","v":"EB-2019-0019"}]
[null,null,null,null,null,null,null,null,null,null,null,null,null,null,null,null,"Exhibit:"]
[null,null,null,null,null,null,null,null,null,null,null,null,null,null,null,null,"Tab:"]
["TO BE UPDATED AT DRAFT RATE ORDER STAGE",null,null,null,null,null,null,null,null,null,null,null,null,null,null,null,"Schedule:"]
[null,null,null,null,null,null,null,null,null,null,null,null,null,null,null,null,"Page:"]
[]
[null,null,null,null,null,null,null,null,null,null,null,null,null,null,null,null,"Date:"]
[]
["Appendix 2-FB"]
["Calculation of Renewable Generation Connection Direct Benefits/Provincial Amount: Renewable Enabling Improvement Investments"]
["**N/A for this Application**"]
["This table will calculate the distributor/provincial shares of the investments entered in Part A of Appendix 2-FA."]
["Enter values in green shaded cells: WCA percentage, debt percentages, interest rates, kWh, tax rates, amortization period, CCA Class and percentage."]
["For historical investments, enter these variables for your last cost of service test year.  For 2017 and beyond, enter variables as in the application."]
["Rate Riders are not calculated for the Test Year as these assets and costs are already in the distributor's rate base/revenue requirement."]
[]
[null,null,{"$f":"F17-1","v":2015},null,null,{"$f":"I17-1","v":2016},null,null,{"$f":"L17-1","v":2017},null,null,{"$f":"O17-1","v":2018},null,null,{"$f":"BridgeYear","v":2019},null,null,{"$f":"CONCATENATE(TestYear,\" Test Year\")","v":"2020 Test Year"},null,null,{"$f":"TestYear+1","v":2021},null,null,{"$f":"U17+1","v":2022},2016,null,{"$f":"X17+1","v":2023},null,null,{"$f":"AA17+1","v":2024}]
[null,null,null,"Direct Benefit","Provincial",null,"Direct Benefit","Provincial",null,"Direct Benefit","Provincial",null,"Direct Benefit","Provincial",null,"Direct Benefit","Provincial",null,"Direct Benefit","Provincial",null,"Direct Benefit","Provincial",null,"Direct Benefit","Provincial",null,"Direct Benefit","Provincial",null,"Direct Benefit","Provincial"]
[null,null,"Total",0.06,0.94,"Total",0.06,0.94,"Total",0.06,0.94,"Total",0.06,0.94,"Total",0.06,0.94,"Total",0.06,0.94,"Total",0.06,0.94,"Total",0.06,0.94,"Total",0.06,0.94,"Total",0.06,0.94]
["Net Fixed Assets (average)",null,{"$f":"F82","v":0},{"$f":"C20*D19","v":0},{"$f":"C20*E19","v":0},{"$f":"G82","v":0},{"$f":"F20*G19","v":0},{"$f":"F20*H19","v":0},{"$f":"H82","v":0},{"$f":"I20*J19","v":0},{"$f":"I20*K19","v":0},{"$f":"I82","v":0},{"$f":"L20*M19","v":0},{"$f":"L20*N19","v":0},{"$f":"J82","v":0},{"$f":"O20*P19","v":0},{"$f":"O20*Q19","v":0},{"$f":"K82","v":0},{"$f":"R20*S19","v":0},{"$f":"R20*T19","v":0},{"$f":"L82","v":0},{"$f":"U20*V19","v":0},{"$f":"U20*W19","v":0},{"$f":"M82","v":0},{"$f":"X20*Y19","v":0},{"$f":"X20*Z19","v":0},{"$f":"N82","v":0},{"$f":"AA20*AB19","v":0},{"$f":"AA20*AC19","v":0},{"$f":"O82","v":0},{"$f":"AD20*AE19","v":0},{"$f":"AD20*AF19","v":0}]
["Incremental OM&A (on-going, N/A for Provincial Recovery)",null,{"$f":"'App.2-FA Proposed REG Invest.'!C64","v":0},{"$f":"C21","v":0},null,{"$f":"'App.2-FA Proposed REG Invest.'!D64","v":0},{"$f":"F21","v":0},null,{"$f":"'App.2-FA Proposed REG Invest.'!E64","v":0},{"$f":"I21","v":0},null,{"$f":"'App.2-FA Proposed REG Invest.'!F64","v":0},{"$f":"L21","v":0},null,{"$f":"'App.2-FA Proposed REG Invest.'!G64","v":0},{"$f":"O21","v":0},null,{"$f":"'App.2-FA Proposed REG Invest.'!H64","v":0},{"$f":"R21","v":0},null,{"$f":"'App.2-FA Proposed REG Invest.'!I64","v":0},{"$f":"U21","v":0},null,{"$f":"'App.2-FA Proposed REG Invest.'!J64","v":0},{"$f":"X21","v":0},null,{"$f":"'App.2-FA Proposed REG Invest.'!K64","v":0},{"$f":"AA21","v":0},null,{"$f":"'App.2-FA Proposed REG Invest.'!L64","v":0},{"$f":"AD21","v":0}]
["Incremental OM&A (start-up, applicable for Provincial Recovery)",null,{"$f":"'App.2-FA Proposed REG Invest.'!C63","v":0},{"$f":"C22*D19","v":0},{"$f":"C22*E19","v":0},{"$f":"'App.2-FA Proposed REG Invest.'!D63","v":0},{"$f":"F22*G19","v":0},{"$f":"F22*H19","v":0},{"$f":"'App.2-FA Proposed REG Invest.'!E63","v":0},{"$f":"I22*J19","v":0},{"$f":"I22*K19","v":0},{"$f":"'App.2-FA Proposed REG Invest.'!F63","v":0},{"$f":"L22*M19","v":0},{"$f":"L22*N19","v":0},{"$f":"'App.2-FA Proposed REG Invest.'!G63","v":0},{"$f":"O22*P19","v":0},{"$f":"O22*Q19","v":0},{"$f":"'App.2-FA Proposed REG Invest.'!H63","v":0},{"$f":"R22*S19","v":0},{"$f":"R22*T19","v":0},{"$f":"'App.2-FA Proposed REG Invest.'!I63","v":0},{"$f":"U22*V19","v":0},{"$f":"U22*W19","v":0},{"$f":"'App.2-FA Proposed REG Invest.'!J63","v":0},{"$f":"X22*Y19","v":0},{"$f":"X22*Z19","v":0},{"$f":"'App.2-FA Proposed REG Invest.'!K63","v":0},{"$f":"AA22*AB19","v":0},{"$f":"AA22*AC19","v":0},{"$f":"'App.2-FA Proposed REG Invest.'!L63","v":0},{"$f":"AD22*AE19","v":0},{"$f":"AD22*AF19","v":0}]
["WCA",null,null,{"$f":"(D21+D22)*$B$23","v":0},{"$f":"E22*$B$23","v":0},null,{"$f":"(G21+G22)*$B$23","v":0},{"$f":"H22*$B$23","v":0},null,{"$f":"(J21+J22)*$B$23","v":0},{"$f":"K22*$B$23","v":0},null,{"$f":"(M21+M22)*$B$23","v":0},{"$f":"N22*$B$23","v":0},null,{"$f":"(P21+P22)*$B$23","v":0},{"$f":"Q22*$B$23","v":0},null,{"$f":"(S21+S22)*$B$23","v":0},{"$f":"T22*$B$23","v":0},null,{"$f":"(V21+V22)*$B$23","v":0},{"$f":"W22*$B$23","v":0},null,{"$f":"(Y21+Y22)*$B$23","v":0},{"$f":"Z22*$B$23","v":0},null,{"$f":"(AB21+AB22)*$B$23","v":0},{"$f":"AC22*$B$23","v":0},null,{"$f":"(AE21+AE22)*$B$23","v":0},{"$f":"AF22*$B$23","v":0}]
["Rate Base",null,null,{"$f":"SUM(D20+D23)","v":0},{"$f":"SUM(E20+E23)","v":0},null,{"$f":"SUM(G20+G23)","v":0},{"$f":"SUM(H20+H23)","v":0},null,{"$f":"SUM(J20+J23)","v":0},{"$f":"SUM(K20+K23)","v":0},null,{"$f":"SUM(M20+M23)","v":0},{"$f":"SUM(N20+N23)","v":0},null,{"$f":"SUM(P20+P23)","v":0},{"$f":"SUM(Q20+Q23)","v":0},null,{"$f":"SUM(S20+S23)","v":0},{"$f":"SUM(T20+T23)","v":0},null,{"$f":"SUM(V20+V23)","v":0},{"$f":"SUM(W20+W23)","v":0},null,{"$f":"SUM(Y20+Y23)","v":0},{"$f":"SUM(Z20+Z23)","v":0},null,{"$f":"SUM(AB20+AB23)","v":0},{"$f":"SUM(AC20+AC23)","v":0},null,{"$f":"SUM(AE20+AE23)","v":0},{"$f":"SUM(AF20+AF23)","v":0}]
[]
[]
["Deemed ST Debt",null,null,{"$f":"D24*$B$27","v":0},{"$f":"E24*$B$27","v":0},null,{"$f":"G24*$B$27","v":0},{"$f":"H24*$B$27","v":0},null,{"$f":"J24*$B$27","v":0},{"$f":"K24*$B$27","v":0},null,{"$f":"M24*$B$27","v":0},{"$f":"N24*$B$27","v":0},null,{"$f":"P24*$B$27","v":0},{"$f":"Q24*$B$27","v":0},null,{"$f":"S24*$B$27","v":0},{"$f":"T24*$B$27","v":0},null,{"$f":"V24*$B$27","v":0},{"$f":"W24*$B$27","v":0},null,{"$f":"Y24*$B$27","v":0},{"$f":"Z24*$B$27","v":0},null,{"$f":"AB24*$B$27","v":0},{"$f":"AC24*$B$27","v":0},null,{"$f":"AE24*$B$27","v":0},{"$f":"AF24*$B$27","v":0}]
["Deemed LT Debt",null,null,{"$f":"D24*$B$28","v":0},{"$f":"E24*$B$28","v":0},null,{"$f":"G24*$B$28","v":0},{"$f":"H24*$B$28","v":0},null,{"$f":"J24*$B$28","v":0},{"$f":"K24*$B$28","v":0},null,{"$f":"M24*$B$28","v":0},{"$f":"N24*$B$28","v":0},null,{"$f":"P24*$B$28","v":0},{"$f":"Q24*$B$28","v":0},null,{"$f":"S24*$B$28","v":0},{"$f":"T24*$B$28","v":0},null,{"$f":"V24*$B$28","v":0},{"$f":"W24*$B$28","v":0},null,{"$f":"Y24*$B$28","v":0},{"$f":"Z24*$B$28","v":0},null,{"$f":"AB24*$B$28","v":0},{"$f":"AC24*$B$28","v":0},null,{"$f":"AE24*$B$28","v":0},{"$f":"AF24*$B$28","v":0}]
["Deemed Equity",null,null,{"$f":"D24*$B$29","v":0},{"$f":"E24*$B$29","v":0},null,{"$f":"G24*$B$29","v":0},{"$f":"H24*$B$29","v":0},null,{"$f":"J24*$B$29","v":0},{"$f":"K24*$B$29","v":0},null,{"$f":"M24*$B$29","v":0},{"$f":"N24*$B$29","v":0},null,{"$f":"P24*$B$29","v":0},{"$f":"Q24*$B$29","v":0},null,{"$f":"S24*$B$29","v":0},{"$f":"T24*$B$29","v":0},null,{"$f":"V24*$B$29","v":0},{"$f":"W24*$B$29","v":0},null,{"$f":"Y24*$B$29","v":0},{"$f":"Z24*$B$29","v":0},null,{"$f":"AB24*$B$29","v":0},{"$f":"AC24*$B$29","v":0},null,{"$f":"AE24*$B$29","v":0},{"$f":"AF24*$B$29","v":0}]
[]
["ST Interest",null,null,{"$f":"D27*$B31","v":0},0,null,{"$f":"G27*$B31","v":0},0,null,{"$f":"J27*$B31","v":0},0,null,{"$f":"M27*$B31","v":0},0,null,{"$f":"P27*$B31","v":0},0,null,{"$f":"S27*$B31","v":0},0,null,{"$f":"V27*$B31","v":0},0,null,{"$f":"Y27*$B31","v":0},0,null,{"$f":"AB27*$B31","v":0},0,null,{"$f":"AE27*$B31","v":0},0]
["LT Interest",null,null,{"$f":"D28*$B32","v":0},0,null,0,0,null,0,0,null,0,0,null,0,0,null,0,0,null,0,0,null,0,0,null,0,0,null,0,0]
["ROE",null,null,{"$f":"D29*$B33","v":0},0,null,0,0,null,0,0,null,0,0,null,0,0,null,0,0,null,0,0,null,0,0,null,0,0,null,0,0]
["Cost of Capital Total",null,null,{"$f":"SUM(D31:D33)","v":0},{"$f":"SUM(E31:E33)","v":0},null,{"$f":"SUM(G31:G33)","v":0},{"$f":"SUM(H31:H33)","v":0},null,{"$f":"SUM(J31:J33)","v":0},{"$f":"SUM(K31:K33)","v":0},null,{"$f":"SUM(M31:M33)","v":0},{"$f":"SUM(N31:N33)","v":0},null,{"$f":"SUM(P31:P33)","v":0},{"$f":"SUM(Q31:Q33)","v":0},null,{"$f":"SUM(S31:S33)","v":0},{"$f":"SUM(T31:T33)","v":0},null,{"$f":"SUM(V31:V33)","v":0},{"$f":"SUM(W31:W33)","v":0},null,{"$f":"SUM(Y31:Y33)","v":0},{"$f":"SUM(Z31:Z33)","v":0},null,{"$f":"SUM(AB31:AB33)","v":0},{"$f":"SUM(AC31:AC33)","v":0},null,{"$f":"SUM(AE31:AE33)","v":0},{"$f":"SUM(AF31:AF33)","v":0}]
[]
["OM&A",null,null,{"$f":"D21+D22","v":0},{"$f":"E22","v":0},null,{"$f":"G21+G22","v":0},{"$f":"H22","v":0},null,{"$f":"J21+J22","v":0},{"$f":"K22","v":0},null,{"$f":"M21+M22","v":0},{"$f":"N22","v":0},null,{"$f":"P21+P22","v":0},{"$f":"Q22","v":0},null,{"$f":"S21+S22","v":0},{"$f":"T22","v":0},null,{"$f":"V21+V22","v":0},{"$f":"W22","v":0},null,{"$f":"Y21+Y22","v":0},{"$f":"Z22","v":0},null,{"$f":"AB21+AB22","v":0},{"$f":"AC22","v":0},null,{"$f":"AE21+AE22","v":0},{"$f":"AF22","v":0}]
["Amortization",null,{"$f":"D77","v":0},{"$f":"C37*D$19","v":0},{"$f":"C37*E$19","v":0},{"$f":"G77","v":0},{"$f":"F37*G$19","v":0},{"$f":"F37*H$19","v":0},{"$f":"H77","v":0},{"$f":"I37*J$19","v":0},{"$f":"I37*K$19","v":0},{"$f":"I77","v":0},{"$f":"L37*M$19","v":0},{"$f":"L37*N$19","v":0},{"$f":"J77","v":0},{"$f":"O37*P$19","v":0},{"$f":"O37*Q$19","v":0},{"$f":"K77","v":0},{"$f":"R37*S$19","v":0},{"$f":"R37*T$19","v":0},{"$f":"L76+L77","v":0},{"$f":"U37*V$19","v":0},{"$f":"U37*W$19","v":0},{"$f":"M76+M77","v":0},{"$f":"X37*Y$19","v":0},{"$f":"X37*Z$19","v":0},{"$f":"N76+N77","v":0},{"$f":"AA37*AB$19","v":0},{"$f":"AA37*AC$19","v":0},{"$f":"O76+O77","v":0},{"$f":"AD37*AE$19","v":0},{"$f":"AD37*AF$19","v":0}]
["Grossed-up PILs",null,null,{"$f":"D65","v":0},{"$f":"E65","v":0},null,{"$f":"G65","v":0},{"$f":"H65","v":0},null,{"$f":"J65","v":0},{"$f":"K65","v":0},null,{"$f":"M65","v":0},{"$f":"N65","v":0},null,{"$f":"P65","v":0},{"$f":"Q65","v":0},null,{"$f":"S65","v":0},{"$f":"T65","v":0},null,{"$f":"V65","v":0},{"$f":"W65","v":0},null,{"$f":"Y65","v":0},{"$f":"Z65","v":0},null,{"$f":"AB65","v":0},{"$f":"AC65","v":0},null,{"$f":"AE65","v":0},{"$f":"AF65","v":0}]
[]
["Revenue Requirement",null,null,{"$f":"SUM(D34:D38)","v":0},{"$f":"SUM(E34:E38)","v":0},null,{"$f":"SUM(G34:G38)","v":0},{"$f":"SUM(H34:H38)","v":0},null,{"$f":"SUM(J34:J38)","v":0},{"$f":"SUM(K34:K38)","v":0},null,{"$f":"SUM(M34:M38)","v":0},{"$f":"SUM(N34:N38)","v":0},null,{"$f":"SUM(P34:P38)","v":0},{"$f":"SUM(Q34:Q38)","v":0},null,{"$f":"SUM(S34:S38)","v":0},{"$f":"SUM(T34:T38)","v":0},null,{"$f":"SUM(V34:V38)","v":0},{"$f":"SUM(W34:W38)","v":0},null,{"$f":"SUM(Y34:Y38)","v":0},{"$f":"SUM(Z34:Z38)","v":0},null,{"$f":"SUM(AB34:AB38)","v":0},{"$f":"SUM(AC34:AC38)","v":0},null,{"$f":"SUM(AE34:AE38)","v":0},{"$f":"SUM(AF34:AF38)","v":0}]
[]
[]
["Provincial Rate Protection",null,null,null,{"$f":"E40","v":0},null,null,{"$f":"H40","v":0},null,null,{"$f":"K40","v":0},null,null,{"$f":"N40","v":0},null,null,{"$f":"Q40","v":0},null,null,{"$f":"T40","v":0},null,null,{"$f":"W40","v":0},null,null,{"$f":"Z40","v":0},null,null,{"$f":"AC40","v":0},null,null,{"$f":"AF40","v":0}]
[]
["Monthly Amount Paid by IESO",null,null,null,{"$f":"E43/12","v":0},null,null,{"$f":"H43/12","v":0},null,null,{"$f":"K43/12","v":0},null,null,{"$f":"N43/12","v":0},null,null,{"$f":"Q43/12","v":0},null,null,{"$f":"T43/12","v":0},null,null,{"$f":"W43/12","v":0},null,null,{"$f":"Z43/12","v":0},null,null,{"$f":"AC43/12","v":0},null,null,{"$f":"AF43/12","v":0}]
[]
["Note 1: The difference between the actual costs of approved eligible investments and revenue received from the IESO should be recorded in a variance account.  The Board may provide "]
["regulatory accounting guidance regarding a variance account either in an individual proceeding or on a generic basis."]
["Note 2: For the 2016 Test Year, Costs and Revenues of the Direct Benefit are to be included in the test year applicant Rate Base and Revenues.  "]
[]
["PILs Calculation"]
[null,null,null,{"$f":"F17-1","v":2015},null,null,{"$f":"F17","v":2016},null,null,{"$f":"I17","v":2017},null,null,{"$f":"L17","v":2018},null,null,{"$f":"O17","v":2019},null,null,{"$f":"R17","v":"2020 Test Year"},null,null,{"$f":"U17","v":2021},null,null,{"$f":"X17","v":2022},null,null,{"$f":"AA17","v":2023},null,null,{"$f":"AD17","v":2024}]
["Income Tax",null,null,"Direct Benefit","Provincial",null,"Direct Benefit","Provincial",null,"Direct Benefit","Provincial",null,"Direct Benefit","Provincial",null,"Direct Benefit","Provincial",null,"Direct Benefit","Provincial",null,"Direct Benefit","Provincial",null,"Direct Benefit","Provincial",null,"Direct Benefit","Provincial",null,"Direct Benefit","Provincial"]
[null,null,null,null,null,null,null,null,null,null,null,null,null,null,null,null,null,null,null,null,null,null,null,null,null,null,"Total",null,null,"Total"]
["Net Income - ROE on Rate Base",null,null,{"$f":"D33","v":0},{"$f":"E33","v":0},null,{"$f":"G33","v":0},{"$f":"H33","v":0},null,{"$f":"J33","v":0},{"$f":"K33","v":0},null,{"$f":"M33","v":0},{"$f":"N33","v":0},null,{"$f":"P33","v":0},{"$f":"Q33","v":0},null,{"$f":"S33","v":0},{"$f":"T33","v":0},null,{"$f":"V33","v":0},{"$f":"W33","v":0},null,{"$f":"Y33","v":0},{"$f":"Z33","v":0},null,{"$f":"AB33","v":0},{"$f":"AC33","v":0},null,{"$f":"AE33","v":0},{"$f":"AF33","v":0}]
["Amortization (6% DB and 94% P)",null,null,{"$f":"D37","v":0},{"$f":"E37","v":0},null,{"$f":"G37","v":0},{"$f":"H37","v":0},null,{"$f":"J37","v":0},{"$f":"K37","v":0},null,{"$f":"M37","v":0},{"$f":"N37","v":0},null,{"$f":"P37","v":0},{"$f":"Q37","v":0},null,{"$f":"S37","v":0},{"$f":"T37","v":0},null,{"$f":"V37","v":0},{"$f":"W37","v":0},null,{"$f":"Y37","v":0},{"$f":"Z37","v":0},null,{"$f":"AB37","v":0},{"$f":"AC37","v":0},null,{"$f":"AE37","v":0},{"$f":"AF37","v":0}]
["CCA (6% DB and 94% P)",null,null,{"$f":"-D94*D$19","v":0},{"$f":"-D94*E$19","v":0},null,{"$f":"-G94*G$19","v":0},{"$f":"-G94*H$19","v":0},null,{"$f":"-H94*J19","v":0},{"$f":"-H94*K$19","v":0},null,{"$f":"-I94*M$19","v":0},{"$f":"-I94*N$19","v":0},null,{"$f":"-J94*P$19","v":0},{"$f":"-J94*Q$19","v":0},null,{"$f":"-K94*S$19","v":0},{"$f":"-K94*T$19","v":0},null,{"$f":"-L94*V$19","v":0},{"$f":"-L94*W$19","v":0},null,{"$f":"-M94*Y$19","v":0},{"$f":"-M94*Z$19","v":0},null,{"$f":"-N94*AB$19","v":0},{"$f":"-N94*AC$19","v":0},null,{"$f":"-O94*AE$19","v":0},{"$f":"-O94*AF$19","v":0}]
["Taxable income",null,null,{"$f":"SUM(D55:D57)","v":0},{"$f":"SUM(E55:E57)","v":0},null,{"$f":"SUM(G55:G57)","v":0},{"$f":"SUM(H55:H57)","v":0},null,{"$f":"SUM(J55:J57)","v":0},{"$f":"SUM(K55:K57)","v":0},null,{"$f":"SUM(M55:M57)","v":0},{"$f":"SUM(N55:N57)","v":0},null,{"$f":"SUM(P55:P57)","v":0},{"$f":"SUM(Q55:Q57)","v":0},null,{"$f":"SUM(S55:S57)","v":0},{"$f":"SUM(T55:T57)","v":0},null,{"$f":"SUM(V55:V57)","v":0},{"$f":"SUM(W55:W57)","v":0},null,{"$f":"SUM(Y55:Y57)","v":0},{"$f":"SUM(Z55:Z57)","v":0},null,{"$f":"SUM(AB55:AB57)","v":0},{"$f":"SUM(AC55:AC57)","v":0},null,{"$f":"SUM(AE55:AE57)","v":0},{"$f":"SUM(AF55:AF57)","v":0}]
[]
["Tax Rate  (to be entered)"]
[]
["Income Taxes Payable",null,null,{"$f":"D58*D60","v":0},{"$f":"E58*E60","v":0},null,{"$f":"G58*G60","v":0},{"$f":"H58*H60","v":0},null,{"$f":"J58*J60","v":0},{"$f":"K58*K60","v":0},null,{"$f":"M58*M60","v":0},{"$f":"N58*N60","v":0},null,{"$f":"P58*P60","v":0},{"$f":"Q58*Q60","v":0},null,{"$f":"S58*S60","v":0},{"$f":"T58*T60","v":0},null,{"$f":"V58*V60","v":0},{"$f":"W58*W60","v":0},null,{"$f":"Y58*Y60","v":0},{"$f":"Z58*Z60","v":0},null,{"$f":"AB58*AB60","v":0},{"$f":"AC58*AC60","v":0},null,{"$f":"AE58*AE60","v":0},{"$f":"AF58*AF60","v":0}]
["Gross Up"]
["Income Taxes Payable",null,null,{"$f":"D62/(1-D60)","v":0},{"$f":"E62/(1-E60)","v":0},null,{"$f":"G62/(1-G60)","v":0},{"$f":"H62/(1-H60)","v":0},null,{"$f":"J62/(1-J60)","v":0},{"$f":"K62/(1-K60)","v":0},null,{"$f":"M62/(1-M60)","v":0},{"$f":"N62/(1-N60)","v":0},null,{"$f":"P62/(1-P60)","v":0},{"$f":"Q62/(1-Q60)","v":0},null,{"$f":"S62/(1-S60)","v":0},{"$f":"T62/(1-T60)","v":0},null,{"$f":"V62/(1-V60)","v":0},{"$f":"W62/(1-W60)","v":0},null,{"$f":"Y62/(1-Y60)","v":0},{"$f":"Z62/(1-Z60)","v":0},null,{"$f":"AB62/(1-AB60)","v":0},{"$f":"AC62/(1-AC60)","v":0},null,{"$f":"AE62/(1-AE60)","v":0},{"$f":"AF62/(1-AF60)","v":0}]
["Grossed Up PILs",null,null,{"$f":"SUM(D64:D64)","v":0},{"$f":"SUM(E64:E64)","v":0},null,{"$f":"SUM(G64:G64)","v":0},{"$f":"SUM(H64:H64)","v":0},null,{"$f":"SUM(J64:J64)","v":0},{"$f":"SUM(K64:K64)","v":0},null,{"$f":"SUM(M64:M64)","v":0},{"$f":"SUM(N64:N64)","v":0},null,{"$f":"SUM(P64:P64)","v":0},{"$f":"SUM(Q64:Q64)","v":0},null,{"$f":"SUM(S64:S64)","v":0},{"$f":"SUM(T64:T64)","v":0},null,{"$f":"SUM(V64:V64)","v":0},{"$f":"SUM(W64:W64)","v":0},null,{"$f":"SUM(Y64:Y64)","v":0},{"$f":"SUM(Z64:Z64)","v":0},null,{"$f":"SUM(AB64:AB64)","v":0},{"$f":"SUM(AC64:AC64)","v":0},null,{"$f":"SUM(AE64:AE64)","v":0},{"$f":"SUM(AF64:AF64)","v":0}]
[]
[]
[null,null,null,null,null,{"$f":"G68-1","v":2015},{"$f":"H68-1","v":2016},{"$f":"I68-1","v":2017},{"$f":"J68-1","v":2018},{"$f":"K68-1","v":2019},{"$f":"TestYear","v":2020},{"$f":"K68+1","v":2021},{"$f":"L68+1","v":2022},{"$f":"M68+1","v":2023},{"$f":"N68+1","v":2024}]
["Net Fixed Assets"]
[null,"Enter applicable amortization in years:",25]
["Opening Gross Fixed Assets",null,null,null,null,null,{"$f":"F73","v":0},{"$f":"G73","v":0},0,0,0,0,0,0,0]
["Gross Capital Additions",null,null,null,null,{"$f":"'App.2-FA Proposed REG Invest.'!C62","v":0},{"$f":"'App.2-FA Proposed REG Invest.'!D62","v":0},{"$f":"'App.2-FA Proposed REG Invest.'!E62","v":0},{"$f":"'App.2-FA Proposed REG Invest.'!F62","v":0},{"$f":"'App.2-FA Proposed REG Invest.'!G62","v":0},{"$f":"'App.2-FA Proposed REG Invest.'!H62","v":0},{"$f":"'App.2-FA Proposed REG Invest.'!I62","v":0},{"$f":"'App.2-FA Proposed REG Invest.'!J62","v":0},{"$f":"'App.2-FA Proposed REG Invest.'!K62","v":0},{"$f":"'App.2-FA Proposed REG Invest.'!L62","v":0}]
["Closing Gross Fixed Assets",null,null,null,null,{"$f":"SUM(F71:F72)","v":0},{"$f":"SUM(G71:G72)","v":0},0,0,0,0,0,0,0,0]
[]
["Opening Accumulated Amortization",null,null,null,null,null,null,{"$f":"+G78","v":0},{"$f":"H78","v":0},0,0,0,0,0,0]
["Current Year Amortization (before additions)",null,null,null,null,{"$f":"IF(ISERROR(F71/$C$70), 0, F71/$C$70)","v":0},0,0,0,0,0,0,0,0,0]
["Additions (half year)",null,null,null,null,{"$f":"F72/$C$70/2","v":0},0,0,0,0,0,{"$f":"L72/C70/2","v":0},{"$f":"M72/C70/2","v":0},{"$f":"N72/C70/2","v":0},{"$f":"O72/C70/2","v":0}]
["Closing Accumulated Amortization",null,null,null,null,{"$f":"SUM(F75+F76+F77)","v":0},0,0,0,0,0,{"$f":"SUM(L75:L77)","v":0},{"$f":"SUM(M75:M77)","v":0},{"$f":"SUM(N75:N77)","v":0},{"$f":"SUM(O75:O77)","v":0}]
[]
["Opening Net Fixed Assets",null,null,null,null,{"$f":"F71-F75","v":0},0,0,0,0,0,{"$f":"K81","v":0},{"$f":"L81","v":0},{"$f":"M81","v":0},{"$f":"N81","v":0}]
["Closing Net Fixed Assets",null,null,null,null,{"$f":"F73-F78","v":0},{"$f":"G73-G78","v":0},0,0,0,0,0,0,0,0]
["Average Net Fixed Assets",null,null,null,null,{"$f":"SUM(F80:F81)/2","v":0},{"$f":"SUM(G80:G81)/2","v":0},0,0,0,0,0,0,0,0]
[]
["UCC for PILs Calculation"]
[null,null,null,null,null,{"$f":"F68","v":2015},{"$f":"G68","v":2016},{"$f":"H68","v":2017},2018,2019,2020,2021,2022,2023,2024]
[]
["Opening UCC",null,null,null,null,null,{"$f":"F95","v":0},{"$f":"G95","v":0},0,0,0,0,0,0,0]
["Capital Additions (from Appendix 2-FA)",null,null,null,null,{"$f":"F72","v":0},{"$f":"G72","v":0},0,0,0,0,0,0,0,0]
["UCC Before Half Year Rule",null,null,null,null,{"$f":"SUM(F87:F88)","v":0},{"$f":"SUM(G87:G88)","v":0},0,0,0,0,0,0,0,0]
["Half Year Rule (1/2 Additions - Disposals)",null,null,null,null,{"$f":"F88/2","v":0},{"$f":"G88/2","v":0},0,0,0,0,0,0,0,0]
["Reduced UCC",null,null,null,null,{"$f":"F89-F90","v":0},{"$f":"G89-G90","v":0},0,0,0,0,0,0,0,0]
["CCA Rate Class (to be entered)",null,47,null,null,{"$f":"C92","v":47},{"$f":"C92","v":47},{"$f":"G92","v":47},47,47,47,47,47,47,47]
["CCA Rate  (to be entered)",null,0.08,null,null,{"$f":"C93","v":0.08},{"$f":"C93","v":0.08},0.08,0.08,0.08,0.08,0.08,0.08,0.08,0.08]
["CCA",null,null,null,null,{"$f":"F91*F93","v":0},{"$f":"G91*G93","v":0},0,0,0,0,0,0,0,0]
["Closing UCC",null,null,null,null,{"$f":"F89-F94","v":0},{"$f":"G89-G94","v":0},0,0,0,0,0,0,0,0]

{"sheet":"Hidden_REG Improvement","index":23,"n_rows":11,"n_cols":8,"rows_kept":11,"cut":false,"hidden":true,"merged":[]}
["Utility Name","EB Number","Test Year","Bridge Year","Last Rebasing Year","Renewable Generation Connection Direct Benefits/Provincial Amount Renewable Enabling Improvement Investments","Year","Amount"]
[{"$f":"'LDC Info'!$E$14","v":"Algoma Power Inc."},{"$f":"EBNUMBER","v":"EB-2019-0019"},{"$f":"TestYear","v":2020},{"$f":"BridgeYear","v":2019},{"$f":"RebaseYear","v":2015},"Provincial Rate Protection",2014,{"$f":"'App.2-FB Calc of REG Improvemnt'!E43","v":0}]
[{"$f":"'LDC Info'!$E$14","v":"Algoma Power Inc."},"EB-2019-0019",2020,2019,2015,"Provincial Rate Protection",2015,{"$f":"'App.2-FB Calc of REG Improvemnt'!H43","v":0}]
[{"$f":"'LDC Info'!$E$14","v":"Algoma Power Inc."},"EB-2019-0019",2020,2019,2015,"Provincial Rate Protection",2016,{"$f":"'App.2-FB Calc of REG Improvemnt'!K43","v":0}]
[{"$f":"'LDC Info'!$E$14","v":"Algoma Power Inc."},"EB-2019-0019",2020,2019,2015,"Provincial Rate Protection",2017,{"$f":"'App.2-FB Calc of REG Improvemnt'!N43","v":0}]
[{"$f":"'LDC Info'!$E$14","v":"Algoma Power Inc."},"EB-2019-0019",2020,2019,2015,"Provincial Rate Protection",2018,{"$f":"'App.2-FB Calc of REG Improvemnt'!Q43","v":0}]
[{"$f":"'LDC Info'!$E$14","v":"Algoma Power Inc."},"EB-2019-0019",2020,2019,2015,"Provincial Rate Protection",2019,{"$f":"'App.2-FB Calc of REG Improvemnt'!T43","v":0}]
[{"$f":"'LDC Info'!$E$14","v":"Algoma Power Inc."},"EB-2019-0019",2020,2019,2015,"Provincial Rate Protection",2020,{"$f":"'App.2-FB Calc of REG Improvemnt'!W43","v":0}]
[{"$f":"'LDC Info'!$E$14","v":"Algoma Power Inc."},"EB-2019-0019",2020,2019,2015,"Provincial Rate Protection",2021,{"$f":"'App.2-FB Calc of REG Improvemnt'!Z43","v":0}]
[{"$f":"'LDC Info'!$E$14","v":"Algoma Power Inc."},"EB-2019-0019",2020,2019,2015,"Provincial Rate Protection",2022,{"$f":"'App.2-FB Calc of REG Improvemnt'!AC43","v":0}]
[{"$f":"'LDC Info'!$E$14","v":"Algoma Power Inc."},"EB-2019-0019",2020,2019,2015,"Provincial Rate Protection",2023,{"$f":"'App.2-FB Calc of REG Improvemnt'!AF43","v":0}]

{"sheet":"App.2-FC Calc of REG Expansion","index":24,"n_rows":95,"n_cols":33,"rows_kept":95,"cut":false,"hidden":false,"merged":[[8,0,8,17],[9,0,9,17],[11,0,11,17],[12,0,12,17],[14,0,14,17],[10,0,10,17],[17,30,17,32],[52,25,52,26],[52,28,52,29],[52,31,52,32],[47,0,47,23],[49,0,49,24],[50,0,50,1],[52,7,52,8],[52,10,52,11],[52,13,52,14],[52,16,52,17],[52,19,52,20],[52,22,52,23],[17,6,17,8],[17,9,17,11],[17,12,17,14],[17,3,17,5],[52,4,52,5],[17,21,17,23],[17,24,17,26],[17,27,17,29],[17,15,17,17],[17,18,17,20]]}
[null,null,null,null,null,null,null,null,null,null,null,null,null,null,null,null,"File Number:",{"$f":"EBNUMBER","v":"EB-2019-0019"}]
[null,null,null,null,null,null,null,null,null,null,null,null,null,null,null,null,"Exhibit:"]
[null,null,null,null,null,null,null,null,null,null,null,null,null,null,null,null,"Tab:"]
["TO BE UPDATED AT THE DRAFT RATE ORDER STAGE",null,null,null,null,null,null,null,null,null,null,null,null,null,null,null,"Schedule:"]
[null,null,null,null,null,null,null,null,null,null,null,null,null,null,null,null,"Page:"]
[]
[null,null,null,null,null,null,null,null,null,null,null,null,null,null,null,null,"Date:"]
[]
["Appendix 2-FC"]
["Calculation of Renewable Generation Connection Direct Benefits/Provincial Amount: Renewable Expansion Investments"]
["**N/A for this Application**"]
["This table will calculate the distributor/provincial shares of the investments entered in Part B of Appendix 2-FA."]
["Enter values in green shaded cells: WCA percentage, debt percentages, interest rates, kWh, tax rates, amortization period, CCA Class and percentage."]
["For historical investments, enter these variables for your last cost of service test year.  For 2016 and beyond, enter variables as in the application."]
["Rate Riders are not calculated for the Test Year as these assets and costs are already in the distributor's rate base."]
[]
[]
[null,null,null,{"$f":"G18-1","v":2015},null,null,{"$f":"J18-1","v":2016},null,null,{"$f":"M18-1","v":2017},null,null,{"$f":"P18-1","v":2018},null,null,{"$f":"BridgeYear","v":2019},null,null,{"$f":"CONCATENATE(TestYear,\" Test Year\")","v":"2020 Test Year"},null,null,{"$f":"TestYear+1","v":2021},2016,null,{"$f":"V18+1","v":2022},null,null,{"$f":"Y18+1","v":2023},null,null,{"$f":"AB18+1","v":2024}]
[null,null,null,null,"Direct Benefit","Provincial",null,"Direct Benefit","Provincial",null,"Direct Benefit","Provincial",null,"Direct Benefit","Provincial",null,"Direct Benefit","Provincial",null,"Direct Benefit","Provincial",null,"Direct Benefit","Provincial",null,"Direct Benefit","Provincial",null,"Direct Benefit","Provincial",null,"Direct Benefit","Provincial"]
[null,null,null,"Total",0.17,0.83,"Total",0.17,0.83,"Total",0.17,0.83,"Total",0.17,0.83,"Total",0.17,0.83,"Total",0.17,0.83,"Total",0.17,0.83,"Total",0.17,0.83,"Total",0.17,0.83,"Total",0.17,0.83]
["Net Fixed Assets (average)",null,null,{"$f":"J82","v":0},{"$f":"D21*E20","v":0},{"$f":"D21*F20","v":0},{"$f":"G82","v":0},{"$f":"G21*H20","v":0},{"$f":"G21*I20","v":0},{"$f":"H82","v":0},{"$f":"J21*K20","v":0},{"$f":"J21*L20","v":0},{"$f":"I82","v":0},{"$f":"M21*N20","v":0},{"$f":"M21*O20","v":0},{"$f":"J82","v":0},{"$f":"P21*Q20","v":0},{"$f":"P21*R20","v":0},{"$f":"K82","v":0},{"$f":"S21*T20","v":0},{"$f":"S21*U20","v":0},{"$f":"L82","v":0},{"$f":"V21*W20","v":0},{"$f":"V21*X20","v":0},{"$f":"M82","v":0},{"$f":"Y21*Z20","v":0},{"$f":"Y21*AA20","v":0},{"$f":"N82","v":0},{"$f":"AB21*AC20","v":0},{"$f":"AB21*AD20","v":0},{"$f":"O82","v":0},{"$f":"AE21*AF20","v":0},{"$f":"AE21*AG20","v":0}]
["Incremental OM&A (on-going, N/A for Provincial Recovery)",null,null,{"$f":"'App.2-FA Proposed REG Invest.'!C$101","v":0},{"$f":"D22","v":0},null,{"$f":"'App.2-FA Proposed REG Invest.'!D$101","v":0},{"$f":"G22","v":0},null,{"$f":"'App.2-FA Proposed REG Invest.'!E$101","v":0},{"$f":"J22","v":0},null,{"$f":"'App.2-FA Proposed REG Invest.'!F$101","v":0},{"$f":"M22","v":0},null,{"$f":"'App.2-FA Proposed REG Invest.'!G$101","v":0},{"$f":"P22","v":0},null,{"$f":"'App.2-FA Proposed REG Invest.'!H$101","v":0},{"$f":"S22","v":0},null,{"$f":"'App.2-FA Proposed REG Invest.'!I$101","v":0},{"$f":"V22","v":0},null,{"$f":"'App.2-FA Proposed REG Invest.'!J$101","v":0},{"$f":"Y22","v":0},null,{"$f":"'App.2-FA Proposed REG Invest.'!K$101","v":0},{"$f":"AB22","v":0},null,{"$f":"'App.2-FA Proposed REG Invest.'!L$101","v":0},{"$f":"AE22","v":0}]
["Incremental OM&A (start-up, applicable for Provincial Recovery)",null,null,{"$f":"'App.2-FA Proposed REG Invest.'!C$100","v":0},{"$f":"D23*E20","v":0},{"$f":"D23*F20","v":0},{"$f":"'App.2-FA Proposed REG Invest.'!D$100","v":0},{"$f":"G23*H20","v":0},{"$f":"G23*I20","v":0},{"$f":"'App.2-FA Proposed REG Invest.'!E$100","v":0},{"$f":"J23*K20","v":0},{"$f":"J23*L20","v":0},{"$f":"'App.2-FA Proposed REG Invest.'!F$100","v":0},{"$f":"M23*N20","v":0},{"$f":"M23*O20","v":0},{"$f":"'App.2-FA Proposed REG Invest.'!G$100","v":0},{"$f":"P23*Q20","v":0},{"$f":"P23*R20","v":0},{"$f":"'App.2-FA Proposed REG Invest.'!H$100","v":0},{"$f":"S23*T20","v":0},{"$f":"S23*U20","v":0},{"$f":"'App.2-FA Proposed REG Invest.'!I$100","v":0},{"$f":"V23*W20","v":0},{"$f":"V23*X20","v":0},{"$f":"'App.2-FA Proposed REG Invest.'!J$100","v":0},{"$f":"Y23*Z20","v":0},{"$f":"Y23*AA20","v":0},{"$f":"'App.2-FA Proposed REG Invest.'!K$100","v":0},{"$f":"AB23*AC20","v":0},{"$f":"AB23*AD20","v":0},{"$f":"'App.2-FA Proposed REG Invest.'!L$100","v":0},{"$f":"AE23*AF20","v":0},{"$f":"AE23*AG20","v":0}]
["WCA",null,null,null,{"$f":"(E22+E23)*$B$24","v":0},{"$f":"F23*$B$24","v":0},null,{"$f":"(H22+H23)*$B$24","v":0},{"$f":"I23*$B$24","v":0},null,{"$f":"(K22+K23)*$B$24","v":0},{"$f":"L23*$B$24","v":0},null,{"$f":"(N22+N23)*$B$24","v":0},{"$f":"O23*$B$24","v":0},null,{"$f":"(Q22+Q23)*$B$24","v":0},{"$f":"R23*$B$24","v":0},null,{"$f":"(T22+T23)*$B$24","v":0},{"$f":"U23*$B$24","v":0},null,{"$f":"(W22+W23)*$B$24","v":0},{"$f":"X23*$B$24","v":0},null,{"$f":"(Z22+Z23)*$B$24","v":0},{"$f":"AA23*$B$24","v":0},null,{"$f":"(AC22+AC23)*$B$24","v":0},{"$f":"AD23*$B$24","v":0},null,{"$f":"(AF22+AF23)*$B$24","v":0},{"$f":"AG23*$B$24","v":0}]
["Rate Base",null,null,null,{"$f":"SUM(E21+E24)","v":0},{"$f":"SUM(F21+F24)","v":0},null,{"$f":"SUM(H21+H24)","v":0},{"$f":"SUM(I21+I24)","v":0},null,{"$f":"SUM(K21+K24)","v":0},{"$f":"SUM(L21+L24)","v":0},null,{"$f":"SUM(N21+N24)","v":0},{"$f":"SUM(O21+O24)","v":0},null,{"$f":"SUM(Q21+Q24)","v":0},{"$f":"SUM(R21+R24)","v":0},null,{"$f":"SUM(T21+T24)","v":0},{"$f":"SUM(U21+U24)","v":0},null,{"$f":"SUM(W21+W24)","v":0},{"$f":"SUM(X21+X24)","v":0},null,{"$f":"SUM(Z21+Z24)","v":0},{"$f":"SUM(AA21+AA24)","v":0},null,{"$f":"SUM(AC21+AC24)","v":0},{"$f":"SUM(AD21+AD24)","v":0},null,{"$f":"SUM(AF21+AF24)","v":0},{"$f":"SUM(AG21+AG24)","v":0}]
[]
[]
["Deemed ST Debt",null,null,null,{"$f":"E25*$B$28","v":0},{"$f":"F25*$B$28","v":0},null,{"$f":"H25*$B$28","v":0},{"$f":"I25*$B$28","v":0},null,{"$f":"K25*$B$28","v":0},{"$f":"L25*$B$28","v":0},null,{"$f":"N25*$B$28","v":0},{"$f":"O25*$B$28","v":0},null,{"$f":"Q25*$B$28","v":0},{"$f":"R25*$B$28","v":0},null,{"$f":"T25*$B$28","v":0},{"$f":"U25*$B$28","v":0},null,{"$f":"W25*$B$28","v":0},{"$f":"X25*$B$28","v":0},null,{"$f":"Z25*$B$28","v":0},{"$f":"AA25*$B$28","v":0},null,{"$f":"AC25*$B$28","v":0},{"$f":"AD25*$B$28","v":0},null,{"$f":"AF25*$B$28","v":0},{"$f":"AG25*$B$28","v":0}]
["Deemed LT Debt",null,null,null,{"$f":"E25*$B$29","v":0},{"$f":"F25*$B$29","v":0},null,{"$f":"H25*$B$29","v":0},{"$f":"I25*$B$29","v":0},null,{"$f":"K25*$B$29","v":0},{"$f":"L25*$B$29","v":0},null,{"$f":"N25*$B$29","v":0},{"$f":"O25*$B$29","v":0},null,{"$f":"Q25*$B$29","v":0},{"$f":"R25*$B$29","v":0},null,{"$f":"T25*$B$29","v":0},{"$f":"U25*$B$29","v":0},null,{"$f":"W25*$B$29","v":0},{"$f":"X25*$B$29","v":0},null,{"$f":"Z25*$B$29","v":0},{"$f":"AA25*$B$29","v":0},null,{"$f":"AC25*$B$29","v":0},{"$f":"AD25*$B$29","v":0},null,{"$f":"AF25*$B$29","v":0},{"$f":"AG25*$B$29","v":0}]
["Deemed Equity",null,null,null,{"$f":"E25*$B$30","v":0},{"$f":"F25*$B$30","v":0},null,{"$f":"H25*$B$30","v":0},{"$f":"I25*$B$30","v":0},null,{"$f":"K25*$B$30","v":0},{"$f":"L25*$B$30","v":0},null,{"$f":"N25*$B$30","v":0},{"$f":"O25*$B$30","v":0},null,{"$f":"Q25*$B$30","v":0},{"$f":"R25*$B$30","v":0},null,{"$f":"T25*$B$30","v":0},{"$f":"U25*$B$30","v":0},null,{"$f":"W25*$B$30","v":0},{"$f":"X25*$B$30","v":0},null,{"$f":"Z25*$B$30","v":0},{"$f":"AA25*$B$30","v":0},null,{"$f":"AC25*$B$30","v":0},{"$f":"AD25*$B$30","v":0},null,{"$f":"AF25*$B$30","v":0},{"$f":"AG25*$B$30","v":0}]
[]
["ST Interest",null,null,null,{"$f":"E28*$B$32","v":0},{"$f":"F28*$B$32","v":0},null,{"$f":"H28*$B$32","v":0},{"$f":"I28*$B$32","v":0},null,{"$f":"K28*$B$32","v":0},{"$f":"L28*$B$32","v":0},null,{"$f":"N28*$B$32","v":0},{"$f":"O28*$B$32","v":0},null,{"$f":"Q28*$B$32","v":0},{"$f":"R28*$B$32","v":0},null,{"$f":"T28*$B$32","v":0},{"$f":"U28*$B$32","v":0},null,{"$f":"W28*$B$32","v":0},{"$f":"X28*$B$32","v":0},null,{"$f":"Z28*$B$32","v":0},{"$f":"AA28*$B$32","v":0},null,{"$f":"AC28*$B$32","v":0},{"$f":"AD28*$B$32","v":0},null,{"$f":"AF28*$B$32","v":0},{"$f":"AG28*$B$32","v":0}]
["LT Interest",null,null,null,{"$f":"E29*$B$33","v":0},{"$f":"F29*$B$33","v":0},null,{"$f":"H29*$B$33","v":0},{"$f":"I29*$B$33","v":0},null,{"$f":"K29*$B$33","v":0},{"$f":"L29*$B$33","v":0},null,{"$f":"N29*$B$33","v":0},{"$f":"O29*$B$33","v":0},null,{"$f":"Q29*$B$33","v":0},{"$f":"R29*$B$33","v":0},null,{"$f":"T29*$B$33","v":0},{"$f":"U29*$B$33","v":0},null,{"$f":"W29*$B$33","v":0},{"$f":"X29*$B$33","v":0},null,{"$f":"Z29*$B$33","v":0},{"$f":"AA29*$B$33","v":0},null,{"$f":"AC29*$B$33","v":0},{"$f":"AD29*$B$33","v":0},null,{"$f":"AF29*$B$33","v":0},{"$f":"AG29*$B$33","v":0}]
["ROE",null,null,null,{"$f":"E30*$B$34","v":0},{"$f":"F30*$B$34","v":0},null,{"$f":"H30*$B$34","v":0},{"$f":"I30*$B$34","v":0},null,{"$f":"K30*$B$34","v":0},{"$f":"L30*$B$34","v":0},null,{"$f":"N30*$B$34","v":0},{"$f":"O30*$B$34","v":0},null,{"$f":"Q30*$B$34","v":0},{"$f":"R30*$B$34","v":0},null,{"$f":"T30*$B$34","v":0},{"$f":"U30*$B$34","v":0},null,{"$f":"W30*$B$34","v":0},{"$f":"X30*$B$34","v":0},null,{"$f":"Z30*$B$34","v":0},{"$f":"AA30*$B$34","v":0},null,{"$f":"AC30*$B$34","v":0},{"$f":"AD30*$B$34","v":0},null,{"$f":"AF30*$B$34","v":0},{"$f":"AG30*$B$34","v":0}]
["Cost of Capital Total",null,null,null,{"$f":"SUM(E32:E34)","v":0},{"$f":"SUM(F32:F34)","v":0},null,{"$f":"SUM(H32:H34)","v":0},{"$f":"SUM(I32:I34)","v":0},null,{"$f":"SUM(K32:K34)","v":0},{"$f":"SUM(L32:L34)","v":0},null,{"$f":"SUM(N32:N34)","v":0},{"$f":"SUM(O32:O34)","v":0},null,{"$f":"SUM(Q32:Q34)","v":0},{"$f":"SUM(R32:R34)","v":0},null,{"$f":"SUM(T32:T34)","v":0},{"$f":"SUM(U32:U34)","v":0},null,{"$f":"SUM(W32:W34)","v":0},{"$f":"SUM(X32:X34)","v":0},null,{"$f":"SUM(Z32:Z34)","v":0},{"$f":"SUM(AA32:AA34)","v":0},null,{"$f":"SUM(AC32:AC34)","v":0},{"$f":"SUM(AD32:AD34)","v":0},null,{"$f":"SUM(AF32:AF34)","v":0},{"$f":"SUM(AG32:AG34)","v":0}]
[]
["OM&A",null,null,null,{"$f":"E22+E23","v":0},{"$f":"F23","v":0},null,{"$f":"H22+H23","v":0},{"$f":"I23","v":0},null,{"$f":"K22+K23","v":0},{"$f":"L23","v":0},null,{"$f":"N22+N23","v":0},{"$f":"O23","v":0},null,{"$f":"Q22+Q23","v":0},{"$f":"R23","v":0},null,{"$f":"T22+T23","v":0},{"$f":"U23","v":0},null,{"$f":"W22+W23","v":0},{"$f":"X23","v":0},null,{"$f":"Z22+Z23","v":0},{"$f":"AA23","v":0},null,{"$f":"AC22+AC23","v":0},{"$f":"AD23","v":0},null,{"$f":"AF22+AF23","v":0},{"$f":"AG23","v":0}]
["Amortization",null,null,{"$f":"D78","v":0},{"$f":"D38*E$20","v":0},{"$f":"D38*F$20","v":0},{"$f":"G78","v":0},{"$f":"G38*H$20","v":0},{"$f":"G38*I$20","v":0},{"$f":"H78","v":0},{"$f":"J38*K$20","v":0},{"$f":"J38*L$20","v":0},{"$f":"I78","v":0},{"$f":"M38*N$20","v":0},{"$f":"M38*O$20","v":0},{"$f":"J78","v":0},{"$f":"P38*Q$20","v":0},{"$f":"P38*R$20","v":0},{"$f":"K76+K77","v":0},{"$f":"S38*T$20","v":0},{"$f":"S38*U$20","v":0},{"$f":"L76+L77","v":0},{"$f":"V38*W$20","v":0},{"$f":"V38*X$20","v":0},{"$f":"M76+M77","v":0},{"$f":"Y38*Z$20","v":0},{"$f":"Y38*AA$20","v":0},{"$f":"N76+N77","v":0},{"$f":"AB38*AC$20","v":0},{"$f":"AB38*AD$20","v":0},{"$f":"O76+O77","v":0},{"$f":"AE38*AF$20","v":0},{"$f":"AE38*AG$20","v":0}]
["Grossed-up PILs",null,null,null,{"$f":"E66","v":0},{"$f":"F66","v":0},null,{"$f":"H66","v":0},{"$f":"I66","v":0},null,{"$f":"K66","v":0},{"$f":"L66","v":0},null,{"$f":"N66","v":0},{"$f":"O66","v":0},null,{"$f":"Q66","v":0},{"$f":"R66","v":0},null,{"$f":"T66","v":0},{"$f":"U66","v":0},null,{"$f":"W66","v":0},{"$f":"X66","v":0},null,{"$f":"Z66","v":0},{"$f":"AA66","v":0},null,{"$f":"AC66","v":0},{"$f":"AD66","v":0},null,{"$f":"AF66","v":0},{"$f":"AG66","v":0}]
[]
["Revenue Requirement",null,null,null,{"$f":"SUM(E35:E39)","v":0},{"$f":"SUM(F35:F39)","v":0},null,{"$f":"SUM(H35:H39)","v":0},{"$f":"SUM(I35:I39)","v":0},null,{"$f":"SUM(K35:K39)","v":0},{"$f":"SUM(L35:L39)","v":0},null,{"$f":"SUM(N35:N39)","v":0},{"$f":"SUM(O35:O39)","v":0},null,{"$f":"SUM(Q35:Q39)","v":0},{"$f":"SUM(R35:R39)","v":0},null,{"$f":"SUM(T35:T39)","v":0},{"$f":"SUM(U35:U39)","v":0},null,{"$f":"SUM(W35:W39)","v":0},{"$f":"SUM(X35:X39)","v":0},null,{"$f":"SUM(Z35:Z39)","v":0},{"$f":"SUM(AA35:AA39)","v":0},null,{"$f":"SUM(AC35:AC39)","v":0},{"$f":"SUM(AD35:AD39)","v":0},null,{"$f":"SUM(AF35:AF39)","v":0},{"$f":"SUM(AG35:AG39)","v":0}]
[]
[]
["Provincial Rate Protection",null,null,null,null,{"$f":"F41","v":0},null,null,{"$f":"I41","v":0},null,null,{"$f":"L41","v":0},null,null,{"$f":"O41","v":0},null,null,{"$f":"R41","v":0},null,null,{"$f":"U41","v":0},null,null,{"$f":"X41","v":0},null,null,{"$f":"AA41","v":0},null,null,{"$f":"AD41","v":0},null,null,{"$f":"AG41","v":0}]
[]
["Monthly Amount Paid by IESO",null,null,null,null,{"$f":"F44/12","v":0},null,null,{"$f":"I44/12","v":0},null,null,{"$f":"L44/12","v":0},null,null,{"$f":"O44/12","v":0},null,null,{"$f":"R44/12","v":0},null,null,{"$f":"U44/12","v":0},null,null,{"$f":"X44/12","v":0},null,null,{"$f":"AA44/12","v":0},null,null,{"$f":"AD44/12","v":0},null,null,{"$f":"AG44/12","v":0}]
[]
["Note 1: The difference between the actual costs of approved eligible investments and revenue received from the IESO should be recorded in a variance account.  The Board may provide "]
["regulatory accounting guidance regarding a variance account either in an individual proceeding or on a generic basis."]
["Note 2: For the 2016 Test Year, Costs and Revenues of the Direct Benefit are to be included in the test year applicant Rate Base and Revenues."]
[]
["PILs Calculation"]
[null,null,null,null,2014,null,null,{"$f":"G18","v":2016},null,null,{"$f":"J18","v":2017},null,null,{"$f":"M18","v":2018},null,null,{"$f":"P18","v":2019},null,null,{"$f":"S18","v":"2020 Test Year"},null,null,{"$f":"V18","v":2021},null,null,{"$f":"Y18","v":2022},null,null,{"$f":"AB18","v":2023},null,null,{"$f":"AE18","v":2024}]
["Income Tax",null,null,null,"Direct Benefit","Provincial",null,"Direct Benefit","Provincial",null,"Direct Benefit","Provincial",null,"Direct Benefit","Provincial",null,"Direct Benefit","Provincial",null,"Direct Benefit","Provincial",null,"Direct Benefit","Provincial",null,"Direct Benefit","Provincial",null,"Direct Benefit","Provincial",null,"Direct Benefit","Provincial"]
[null,null,null,null,null,null,null,null,null,null,null,null,null,null,null,null,null,null,null,null,null,null,null,null,"Total",null,null,"Total",null,null,"Total"]
["Net Income - ROE on Rate Base",null,null,null,{"$f":"E34","v":0},{"$f":"F34","v":0},null,{"$f":"H34","v":0},{"$f":"I34","v":0},null,{"$f":"K34","v":0},{"$f":"L34","v":0},null,{"$f":"N34","v":0},{"$f":"O34","v":0},null,{"$f":"Q34","v":0},{"$f":"R34","v":0},null,{"$f":"T34","v":0},{"$f":"U34","v":0},null,{"$f":"W34","v":0},{"$f":"X34","v":0},null,{"$f":"Z34","v":0},{"$f":"AA34","v":0},null,{"$f":"AC34","v":0},{"$f":"AD34","v":0},null,{"$f":"AF34","v":0},{"$f":"AG34","v":0}]
["Amortization (17% DB and 83% P)",null,null,null,{"$f":"E38","v":0},{"$f":"F38","v":0},null,{"$f":"H38","v":0},{"$f":"I38","v":0},null,{"$f":"K38","v":0},{"$f":"L38","v":0},null,{"$f":"N38","v":0},{"$f":"O38","v":0},null,{"$f":"Q38","v":0},{"$f":"R38","v":0},null,{"$f":"T38","v":0},{"$f":"U38","v":0},null,{"$f":"W38","v":0},{"$f":"X38","v":0},null,{"$f":"Z38","v":0},{"$f":"AA38","v":0},null,{"$f":"AC38","v":0},{"$f":"AD38","v":0},null,{"$f":"AF38","v":0},{"$f":"AG38","v":0}]
["CCA (17% DB and 83% P)",null,null,null,{"$f":"-D94*E$20","v":0},{"$f":"-D94*F$20","v":0},null,{"$f":"-G94*H$20","v":0},{"$f":"-G94*I$20","v":0},null,{"$f":"-H94*K$20","v":0},{"$f":"-H94*L$20","v":0},null,{"$f":"-I94*N$20","v":0},{"$f":"-I94*O$20","v":0},null,{"$f":"-J94*Q$20","v":0},{"$f":"-J94*R$20","v":0},null,{"$f":"-K94*T$20","v":0},{"$f":"-K94*U$20","v":0},null,{"$f":"-L94*W$20","v":0},{"$f":"-L94*X$20","v":0},null,{"$f":"-M94*Z$20","v":0},{"$f":"-M94*AA$20","v":0},null,{"$f":"-N94*AC$20","v":0},{"$f":"-N94*AD$20","v":0},null,{"$f":"-O94*AF$20","v":0},{"$f":"-O94*AG$20","v":0}]
["Taxable income",null,null,null,{"$f":"SUM(E56:E58)","v":0},{"$f":"SUM(F56:F58)","v":0},null,{"$f":"SUM(H56:H58)","v":0},{"$f":"SUM(I56:I58)","v":0},null,{"$f":"SUM(K56:K58)","v":0},{"$f":"SUM(L56:L58)","v":0},null,{"$f":"SUM(N56:N58)","v":0},{"$f":"SUM(O56:O58)","v":0},null,{"$f":"SUM(Q56:Q58)","v":0},{"$f":"SUM(R56:R58)","v":0},null,{"$f":"SUM(T56:T58)","v":0},{"$f":"SUM(U56:U58)","v":0},null,{"$f":"SUM(W56:W58)","v":0},{"$f":"SUM(X56:X58)","v":0},null,{"$f":"SUM(Z56:Z58)","v":0},{"$f":"SUM(AA56:AA58)","v":0},null,{"$f":"SUM(AC56:AC58)","v":0},{"$f":"SUM(AD56:AD58)","v":0},null,{"$f":"SUM(AF56:AF58)","v":0},{"$f":"SUM(AG56:AG58)","v":0}]
[]
["Tax Rate  (to be entered)"]
[]
["Income Taxes Payable",null,null,null,{"$f":"E59*E61","v":0},{"$f":"F59*F61","v":0},null,{"$f":"H59*H61","v":0},{"$f":"I59*I61","v":0},null,{"$f":"K59*K61","v":0},{"$f":"L59*L61","v":0},null,{"$f":"N59*N61","v":0},{"$f":"O59*O61","v":0},null,{"$f":"Q59*Q61","v":0},{"$f":"R59*R61","v":0},null,{"$f":"T59*T61","v":0},{"$f":"U59*U61","v":0},null,{"$f":"W59*W61","v":0},{"$f":"X59*X61","v":0},null,{"$f":"Z59*Z61","v":0},{"$f":"AA59*AA61","v":0},null,{"$f":"AC59*AC61","v":0},{"$f":"AD59*AD61","v":0},null,{"$f":"AF59*AF61","v":0},{"$f":"AG59*AG61","v":0}]
["Gross Up"]
["Income Taxes Payable",null,null,null,{"$f":"E63/(1-E61)","v":0},{"$f":"F63/(1-F61)","v":0},null,{"$f":"H63/(1-H61)","v":0},{"$f":"I63/(1-I61)","v":0},null,{"$f":"K63/(1-K61)","v":0},{"$f":"L63/(1-L61)","v":0},null,{"$f":"N63/(1-N61)","v":0},{"$f":"O63/(1-O61)","v":0},null,{"$f":"Q63/(1-Q61)","v":0},{"$f":"R63/(1-R61)","v":0},null,{"$f":"T63/(1-T61)","v":0},{"$f":"U63/(1-U61)","v":0},null,{"$f":"W63/(1-W61)","v":0},{"$f":"X63/(1-X61)","v":0},null,{"$f":"Z63/(1-Z61)","v":0},{"$f":"AA63/(1-AA61)","v":0},null,{"$f":"AC63/(1-AC61)","v":0},{"$f":"AD63/(1-AD61)","v":0},null,{"$f":"AF63/(1-AF61)","v":0},{"$f":"AG63/(1-AG61)","v":0}]
["Grossed Up PILs",null,null,null,{"$f":"SUM(E65:E65)","v":0},{"$f":"SUM(F65:F65)","v":0},null,{"$f":"SUM(H65:H65)","v":0},{"$f":"SUM(I65:I65)","v":0},null,{"$f":"SUM(K65:K65)","v":0},{"$f":"SUM(L65:L65)","v":0},null,{"$f":"SUM(N65:N65)","v":0},{"$f":"SUM(O65:O65)","v":0},null,{"$f":"SUM(Q65:Q65)","v":0},{"$f":"SUM(R65:R65)","v":0},null,{"$f":"SUM(T65:T65)","v":0},{"$f":"SUM(U65:U65)","v":0},null,{"$f":"SUM(W65:W65)","v":0},{"$f":"SUM(X65:X65)","v":0},null,{"$f":"SUM(Z65:Z65)","v":0},{"$f":"SUM(AA65:AA65)","v":0},null,{"$f":"SUM(AC65:AC65)","v":0},{"$f":"SUM(AD65:AD65)","v":0},null,{"$f":"SUM(AF65:AF65)","v":0},{"$f":"SUM(AG65:AG65)","v":0}]
[]
[]
["Net Fixed Assets",null,null,null,null,2014,2015,2016,2017,2018,2019,2020,2021,2022,2023]
["Enter applicable amortization in years:",25]
["Opening Gross Fixed Assets",null,null,null,null,null,{"$f":"F73","v":0},{"$f":"G73","v":0},{"$f":"H73","v":0},{"$f":"I73","v":0},0,0,{"$f":"L73","v":0},0,0]
["Gross Capital Additions",null,null,null,null,{"$f":"'App.2-FA Proposed REG Invest.'!C99","v":0},{"$f":"'App.2-FA Proposed REG Invest.'!D99","v":0},{"$f":"'App.2-FA Proposed REG Invest.'!E99","v":0},{"$f":"'App.2-FA Proposed REG Invest.'!F99","v":0},{"$f":"'App.2-FA Proposed REG Invest.'!G99","v":0},{"$f":"'App.2-FA Proposed REG Invest.'!H99","v":0},{"$f":"'App.2-FA Proposed REG Invest.'!I99","v":0},{"$f":"'App.2-FA Proposed REG Invest.'!J99","v":0},{"$f":"'App.2-FA Proposed REG Invest.'!K99","v":0},{"$f":"'App.2-FA Proposed REG Invest.'!L99","v":0}]
["Closing Gross Fixed Assets",null,null,null,null,{"$f":"SUM(F71:F72)","v":0},{"$f":"SUM(G71:G72)","v":0},0,0,0,0,0,0,0,0]
[]
["Opening Accumulated Amortization",null,null,null,null,null,{"$f":"+F78","v":0},{"$f":"+G78","v":0},{"$f":"H78","v":0},{"$f":"I78","v":0},0,0,0,0,0]
["Current Year Amortization (before additions)",null,null,null,null,{"$f":"IF(ISERROR(F71/$B$70), 0, F71/$B$70)","v":0},{"$f":"IF(ISERROR(G71/$B$70), 0, G71/$B$70)","v":0},{"$f":"IF(ISERROR(H71/$B$70), 0, H71/$B$70)","v":0},{"$f":"IF(ISERROR(I71/$B$70), 0, I71/$B$70)","v":0},{"$f":"IF(ISERROR(J71/$B$70), 0, J71/$B$70)","v":0},{"$f":"K71/$B$70","v":0},{"$f":"L71/$B$70","v":0},{"$f":"M71/$B$70","v":0},{"$f":"N71/$B$70","v":0},{"$f":"O71/$B$70","v":0}]
["Additions (half year)",null,null,null,null,{"$f":"F72/B70/2","v":0},{"$f":"G72/B70/2","v":0},{"$f":"H72/B70/2","v":0},{"$f":"I72/B70/2","v":0},{"$f":"J72/B70/2","v":0},{"$f":"K72/B70/2","v":0},{"$f":"L72/B70/2","v":0},{"$f":"M72/B70/2","v":0},{"$f":"N72/B70/2","v":0},{"$f":"O72/B70/2","v":0}]
["Closing Accumulated Amortization",null,null,null,null,{"$f":"SUM(F75+F77)","v":0},{"$f":"SUM(G75+G77)","v":0},{"$f":"SUM(H75:H77)","v":0},0,0,0,0,0,0,0]
[]
["Opening Net Fixed Assets",null,null,null,null,{"$f":"F71-F75","v":0},{"$f":"G71-G75","v":0},{"$f":"H71-H75","v":0},{"$f":"I71-I75","v":0},{"$f":"J71-J75","v":0},{"$f":"J81","v":0},{"$f":"K81","v":0},{"$f":"L81","v":0},{"$f":"M81","v":0},{"$f":"N81","v":0}]
["Closing Net Fixed Assets",null,null,null,null,{"$f":"F73-F78","v":0},{"$f":"G73-G78","v":0},0,0,0,0,0,0,0,0]
["Average Net Fixed Assets",null,null,null,null,{"$f":"SUM(F80:F81)/2","v":0},{"$f":"SUM(G80:G81)/2","v":0},0,0,0,0,0,0,0,0]
[]
["UCC for PILs Calculation"]
[null,null,null,null,null,2014,2015,2016,2017,2018,2019,2020,2021,2022,2023]
[]
["Opening UCC",null,null,null,null,null,{"$f":"F95","v":0},0,0,{"$f":"I95","v":0},0,0,0,0,0]
["Capital Additions (from Appendix 2-FA)",null,null,null,null,{"$f":"F72","v":0},{"$f":"G72","v":0},{"$f":"H72","v":0},0,0,0,0,0,0,0]
["UCC Before Half Year Rule",null,null,null,null,{"$f":"SUM(F87:F88)","v":0},{"$f":"SUM(G87:G88)","v":0},{"$f":"SUM(H87:H88)","v":0},0,0,0,0,0,0,0]
["Half Year Rule (1/2 Additions - Disposals)",null,null,null,null,{"$f":"F88/2","v":0},{"$f":"G88/2","v":0},0,0,0,0,0,0,0,0]
["Reduced UCC",null,null,null,null,{"$f":"F89-F90","v":0},{"$f":"G89-G90","v":0},0,0,0,0,0,0,0,0]
["CCA Rate Class (to be entered)",47,null,null,null,{"$f":"$B$92","v":47},47,47,47,47,47,47,47,47,47]
["CCA Rate  (to be entered)",0.08,null,null,null,{"$f":"$B$93","v":0.08},0.08,0.08,0.08,0.08,0.08,0.08,0.08,0.08,0.08]
["CCA",null,null,null,null,{"$f":"F91*F$93","v":0},{"$f":"G91*G$93","v":0},0,0,0,0,0,0,0,0]
["Closing UCC",null,null,null,null,{"$f":"F89-F94","v":0},{"$f":"G89-G94","v":0},{"$f":"H89-H94","v":0},0,0,0,0,0,0,0]

{"sheet":"Hidden_REG Expansion","index":25,"n_rows":11,"n_cols":8,"rows_kept":11,"cut":false,"hidden":true,"merged":[]}
["Utility Name","EB Number","Test Year","Bridge Year","Last Rebasing Year","Calculation of Renewable Generation Connection Direct Benefits/Provincial Amount Renewable Expansion Investments","Year","Amount"]
[{"$f":"'LDC Info'!$E$14","v":"Algoma Power Inc."},{"$f":"EBNUMBER","v":"EB-2019-0019"},{"$f":"TestYear","v":2020},{"$f":"BridgeYear","v":2019},{"$f":"RebaseYear","v":2015},"Provincial Rate Protection",2014,{"$f":"'App.2-FC Calc of REG Expansion'!F44","v":0}]
[{"$f":"'LDC Info'!$E$14","v":"Algoma Power Inc."},"EB-2019-0019",2020,2019,2015,"Provincial Rate Protection",2015,{"$f":"'App.2-FC Calc of REG Expansion'!I44","v":0}]
[{"$f":"'LDC Info'!$E$14","v":"Algoma Power Inc."},"EB-2019-0019",2020,2019,2015,"Provincial Rate Protection",2016,{"$f":"'App.2-FC Calc of REG Expansion'!L44","v":0}]
[{"$f":"'LDC Info'!$E$14","v":"Algoma Power Inc."},"EB-2019-0019",2020,2019,2015,"Provincial Rate Protection",2017,{"$f":"'App.2-FC Calc of REG Expansion'!O44","v":0}]
[{"$f":"'LDC Info'!$E$14","v":"Algoma Power Inc."},"EB-2019-0019",2020,2019,2015,"Provincial Rate Protection",2018,{"$f":"'App.2-FC Calc of REG Expansion'!R44","v":0}]
[{"$f":"'LDC Info'!$E$14","v":"Algoma Power Inc."},"EB-2019-0019",2020,2019,2015,"Provincial Rate Protection",2019,{"$f":"'App.2-FC Calc of REG Expansion'!U44","v":0}]
[{"$f":"'LDC Info'!$E$14","v":"Algoma Power Inc."},"EB-2019-0019",2020,2019,2015,"Provincial Rate Protection",2020,{"$f":"'App.2-FC Calc of REG Expansion'!X44","v":0}]
[{"$f":"'LDC Info'!$E$14","v":"Algoma Power Inc."},"EB-2019-0019",2020,2019,2015,"Provincial Rate Protection",2021,{"$f":"'App.2-FC Calc of REG Expansion'!AA44","v":0}]
[{"$f":"'LDC Info'!$E$14","v":"Algoma Power Inc."},"EB-2019-0019",2020,2019,2015,"Provincial Rate Protection",2022,{"$f":"'App.2-FC Calc of REG Expansion'!AD44","v":0}]
[{"$f":"'LDC Info'!$E$14","v":"Algoma Power Inc."},"EB-2019-0019",2020,2019,2015,"Provincial Rate Protection",2023,{"$f":"'App.2-FC Calc of REG Expansion'!AG44","v":0}]

{"sheet":"App.2-G SQI","index":26,"n_rows":40,"n_cols":21,"rows_kept":40,"cut":false,"hidden":false,"merged":[[37,4,37,5],[38,4,38,5],[39,4,39,5],[35,4,35,5],[36,4,36,5],[39,0,39,3],[34,0,34,3],[35,0,35,3],[36,0,36,3],[37,0,37,3],[38,0,38,3],[6,14,6,15],[14,11,14,15],[20,11,20,14],[21,11,21,14],[19,0,19,15],[8,0,8,15],[9,0,9,15],[10,0,10,15],[12,0,12,15],[20,1,20,4],[20,6,20,9],[21,1,21,4],[14,0,15,0],[0,14,0,15],[1,14,1,15],[2,14,2,15],[3,14,3,15],[4,14,4,15],[14,16,14,20],[20,16,20,19],[21,16,21,19],[21,6,21,9],[14,1,14,5],[14,6,14,10],[28,0,28,3],[23,0,23,10],[24,0,24,10],[26,0,26,10],[34,4,34,5],[28,4,28,5],[29,4,29,5],[30,4,30,5],[31,4,31,5],[29,0,29,3],[30,0,30,3],[31,0,31,3],[32,0,32,3],[33,0,33,3],[32,4,32,5],[33,4,33,5]]}
[null,null,null,null,null,null,null,null,null,null,null,null,"File Number:",null,{"$f":"EBNUMBER","v":"EB-2019-0019"}]
[null,null,null,null,null,null,null,null,null,null,null,null,"Exhibit:",null,2]
[null,null,null,null,null,null,null,null,null,null,null,null,"Tab:"]
[null,null,null,null,null,null,null,null,null,null,null,null,"Schedule:"]
[null,null,null,null,null,null,null,null,null,null,null,null,"Page:"]
[]
[null,null,null,null,null,null,null,null,null,null,null,null,"Date:",null,"2019-05-17"]
[]
["Appendix 2-G"]
["Service Reliability and Quality Indicators"]
["2014-2018"]
[]
["Service Reliability"]
[]
["Index","Including outages caused by loss of supply",null,null,null,null,"Excluding outages caused by loss of supply",null,null,null,null,"Excluding Major Event Days",null,null,null,null,"Excluding LOS and Major Event Days"]
[null,{"$f":"TestYear-6","v":2014},{"$f":"TestYear-5","v":2015},{"$f":"TestYear-4","v":2016},{"$f":"TestYear-3","v":2017},{"$f":"TestYear-2","v":2018},{"$f":"B16","v":2014},2015,2016,2017,2018,2014,2015,2016,2017,2018,2014,2015,2016,2017,2018]
["SAIDI ",12.31,19.170000000000002,6.22,15.9,13.83,10.119999999999999,16.940000000000001,5.46,11.1,11.96,8.68,11.03,6.22,12.2,9.3800000000000008,7.96,8.8000000000000007,5.46,7.68,7.51]
["SAIFI",6.47,7.12,3.85,5.97,4.26,4.04,4.4000000000000004,2.57,4.26,3.14,4.93,6.39,3.85,5.15,3.31,3.24,3.68,2.57,3.95,2.2000000000000002]
[]
["5 Year Historical Average"]
["SAIDI ",null,null,null,null,{"$f":"IF(ISERROR(AVERAGE(B17:F17)), \"\", AVERAGE(B17:F17))","v":13.486000000000001},null,null,null,null,{"$f":"IF(ISERROR(AVERAGE(G17:K17)), \"\", AVERAGE(G17:K17))","v":11.116000000000001},null,null,null,null,{"$f":"IF(ISERROR(AVERAGE(L17:P17)), \"\", AVERAGE(L17:P17))","v":9.5019999999999989},null,null,null,null,{"$f":"IF(ISERROR(AVERAGE(Q17:U17)), \"\", AVERAGE(Q17:U17))","v":7.4820000000000011}]
["SAIFI",null,null,null,null,{"$f":"IF(ISERROR(AVERAGE(B18:F18)), \"\", AVERAGE(B18:F18))","v":5.5340000000000007},null,null,null,null,{"$f":"IF(ISERROR(AVERAGE(G18:K18)), \"\", AVERAGE(G18:K18))","v":3.6819999999999999},null,null,null,null,{"$f":"IF(ISERROR(AVERAGE(L18:P18)), \"\", AVERAGE(L18:P18))","v":4.726},null,null,null,null,{"$f":"IF(ISERROR(AVERAGE(Q18:U18)), \"\", AVERAGE(Q18:U18))","v":3.1280000000000001}]
[]
["SAIDI = System Average Interruption Duration Index"]
["SAIFI = System Average Interruption Frequency Index "]
[]
["Service Quality"]
[]
["Indicator",null,null,null,"OEB Minimum Standard",null,{"$f":"B16","v":2014},{"$f":"C16","v":2015},{"$f":"D16","v":2016},{"$f":"E16","v":2017},{"$f":"F16","v":2018}]
["Low Voltage Connections",null,null,null,0.9,null,1,1,0.99399999999999999,0.99199999999999999,0.98599999999999999]
["High Voltage Connections",null,null,null,0.9,null,"n/a","n/a","n/a","n/a","n/a"]
["Telephone Accessibility",null,null,null,0.65,null,0.82599999999999996,0.81899999999999995,0.86599999999999999,0.80100000000000005,0.86099999999999999]
["Appointments Met",null,null,null,0.9,null,1,1,1,1,1]
["Written Response to Enquires",null,null,null,0.8,null,1,1,1,0.83299999999999996,0.81200000000000006]
["Emergency Urban Response",null,null,null,0.8,null,"n/a","n/a","n/a","n/a","n/a"]
["Emergency Rural Response",null,null,null,0.8,null,1,1,1,1,0.95699999999999996]
["Telephone Call Abandon Rate",null,null,null,0.1,null,4.8000000000000001E-2,6.2E-2,3.7999999999999999E-2,7.3999999999999996E-2,8.3000000000000004E-2]
["Appointment Scheduling",null,null,null,0.9,null,0.97199999999999998,0.94899999999999995,0.98199999999999998,0.97099999999999997,0.99]
["Rescheduling a Missed Appointment",null,null,null,1,null,"n/a","n/a","n/a","n/a","n/a"]
["Reconnection Performance Standard",null,null,null,0.85,null,1,1,1,1,1]

{"sheet":"App.2-H_Other_Oper_Rev","index":27,"n_rows":137,"n_cols":14,"rows_kept":137,"cut":false,"hidden":false,"merged":[[82,0,82,1],[83,0,83,1],[66,0,66,11],[118,0,118,1],[124,0,124,1],[113,0,113,1],[114,0,114,1],[115,0,115,1],[116,0,116,1],[117,0,117,1],[108,0,108,1],[109,0,109,1],[110,0,110,1],[111,0,111,1],[112,0,112,1],[93,0,93,1],[125,0,125,1],[126,0,126,1],[127,0,127,1],[119,0,119,1],[120,0,120,1],[121,0,121,1],[122,0,122,1],[123,0,123,1],[94,0,94,1],[105,0,105,1],[106,0,106,1],[107,0,107,1],[101,0,101,1],[95,0,95,1],[96,0,96,1],[97,0,97,1],[98,0,98,1],[99,0,99,1],[100,0,100,1],[128,0,128,1],[129,0,129,1],[80,0,80,1],[81,0,81,1],[102,0,102,1],[103,0,103,1],[104,0,104,1],[84,0,84,1],[85,0,85,1],[86,0,86,1],[87,0,87,1],[88,0,88,1],[89,0,89,1],[90,0,90,1],[91,0,91,1],[92,0,92,1],[8,0,8,11],[9,0,9,11],[51,0,51,11],[52,0,52,1],[142,1,142,11],[140,1,140,11],[141,1,141,11],[76,0,76,1],[69,0,70,11],[75,0,75,1],[131,0,131,1],[77,0,77,1],[78,0,78,1],[79,0,79,1],[130,0,130,1],[136,1,136,11],[55,0,55,1],[56,0,56,1],[62,0,62,11],[53,0,53,1],[54,0,54,1],[61,0,61,11],[60,0,60,11],[59,0,59,11],[58,0,58,11]]}
[null,null,null,null,null,null,null,null,null,null,"File Number:",{"$f":"EBNUMBER","v":"EB-2019-0019"}]
[null,null,null,null,null,null,null,null,null,null,"Exhibit:",3]
[null,null,null,null,null,null,null,null,null,null,"Tab:"]
["TO BE UPDATED AT THE DRAFT RATE ORDER STAGE",null,null,null,null,null,null,null,null,null,"Schedule:"]
[null,null,null,null,null,null,null,null,null,null,"Page:"]
[]
[null,null,null,null,null,null,null,null,null,null,"Date:","2019-09-24"]
[]
["Appendix 2-H"]
["Other Operating Revenue"]
[]
["USoA #","USoA Description",{"$f":"D13 - 1 &\" Actual\"&CHAR(178)","v":"2011 Actual²"},"2012 Actual²","2013 Actual²","2014 Actual²",{"$f":"H13 - 1 &\" Actual\"&CHAR(178)","v":"2015 Actual²"},{"$f":"I13 - 1 &\" Actual\"&CHAR(178)","v":"2016 Actual²"},{"$f":"I13 & \" Actual\" & CHAR(178)","v":"2017 Actual²"},"2017 Actual","Bridge Year","Test Year"]
[null,null,{"$f":"D13-1","v":2011},{"$f":"E13-1","v":2012},{"$f":"F13-1","v":2013},{"$f":"G13-1","v":2014},{"$f":"H13-1","v":2015},{"$f":"I13-1","v":2016},{"$f":"J13-1","v":2017},2018,{"$f":"BridgeYear","v":2019},{"$f":"TestYear","v":2020},null,2015]
[null,"Reporting Basis",null,null,null,null,"MIFRS","MIFRS","MIFRS","MIFRS","MIFRS","MIFRS",null,"MIFRS"]
[4235,"Specific Service Charges",null,null,null,null,-70947.710000000006,-87798.36,-73789.67,-63492.24,-77865,-69365.88,null,-70947.710000000006]
[4225,"Late Payment Charges",null,null,null,null,-97158.6,-105293.31,-57095.19,-42165.09,-56597.04,-33000,null,-97158.6]
[4082,"Retail Services Revenues",null,null,null,null,-4960.7,-5060.8,-4710,-4598.8999999999996,-5029.8,-10059.6,null,-4960.7]
["4084","4084-Service Transaction Requests (STR) Revenues\n",null,null,null,null,-106.25,-56.25,-19.25,-33.75,-64.680000000000007,-129.36000000000001,null,-106.25]
["4086","4086-SSS Administration Revenue\n",null,null,null,null,-34755.25,-34805.56,-34958.19,-35033,-34785,-35000,null,-34755.25]
["4205","4205-Interdepartmental Rents\n",null,null,null,null,0,0,0,0,0,0,null,0]
["4210","4210-Rent from Electric Property\n",null,null,null,null,-238754.31,-238620.21,-238620.21,-239514.21,-238700.04,-431689,null,-238754.31]
["4215","4215-Other Utility Operating Income\n",null,null,null,null,0,0,0,0,0,0,null,0]
["4220","4220-Other Electric Revenues\n",null,null,null,null,-17182.54,-13298.71,-5719.77,-77845.59,-12099.96,-8100,null,-17182.54]
["4240","4240-Provision for Rate Refunds\n",null,null,null,null,0,0,0,0,0,0,null,0]
["4245","4245-Government Assistance Directly Credited to Income\n",null,null,null,null,0,0,0,0,0,0,null,0]
["4305","4305-Regulatory Debits\n",null,null,null,null,92978.64,92978.64,92978.64,92978.64,93000,123553,null,92978.64]
["4310","4310-Regulatory Credits\n",null,null,null,null,0,0,0,0,0,0,null,0]
["4315","4315-Revenues from Electric Plant Leased to Others\n",null,null,null,null,0,0,0,0,0,0,null,0]
["4320","4320-Expenses of Electric Plant Leased to Others\n",null,null,null,null,0,0,0,0,0,0,null,0]
["4324","4324-Special Purpose Charge Recovery\n",null,null,null,null,0,0,0,0,0,0,null,0]
["4325","4325-Revenues from Merchandise Jobbing, Etc.\n",null,null,null,null,-85953.73,-35533.550000000003,-55106.63,-104784.31,-70344.554999999993,-70344.554999999993,null,-85953.73]
["4330","4330-Costs and Expenses of Merchandising Jobbing, Etc.\n",null,null,null,null,100947.3,71693.5,72271.539999999994,99063.15,70344.554999999993,70344.554999999993,null,100947.3]
["4335","4335-Profits and Losses from Financial Instrument Hedges\n",null,null,null,null,0,0,0,0,0,0,null,0]
["4340","4340-Profits and Losses from Financial Instrument Investments\n",null,null,null,null,0,0,0,0,0,0,null,0]
["4345","4345-Gains from Disposition of Future Use Utility Plant\n",null,null,null,null,0,0,0,0,0,0,null,0]
["4350","4350-Losses from Disposition of Future Use Utility Plant\n",null,null,null,null,0,0,0,0,0,0,null,0]
["4355","4355-Gain on Disposition of Utility and Other Property\n",null,null,null,null,-12244.540000000008,-59563.3,0,0,0,0,null,-12244.540000000008]
["4360","4360-Loss on Disposition of Utility and Other Property\n",null,null,null,null,0,0,200066.77,22190.22,0,0,null,0]
["4365","4365-Gains from Disposition of Allowances for Emission\n",null,null,null,null,0,0,0,0,0,0,null,0]
["4370","4370-Losses from Disposition of Allowances for Emission\n",null,null,null,null,0,0,0,0,0,0,null,0]
["4375","4375-Revenues from Non-Utility Operations\n",null,null,null,null,0,0,0,0,0,0,null,0]
["4375","4375-Sub-account Generation Facility Revenues\n",null,null,null,null,0,0,0,0,0,0,null,0]
["4380","4380-Expenses of Non-Utility Operations\n",null,null,null,null,525645,584953.80000000005,571402.07999999996,572282.04,546529.31999999995,0,null,525645]
["4380","4380-Sub-account Generation Facility Expenses\n",null,null,null,null,0,0,0,0,null,null,null,0]
["4385","4385-Non-Utility Rental Income\n",null,null,null,null,0,0,0,0,null,null,null,0]
["4390","4390-Miscellaneous Non-Operating Income\n",null,null,null,null,-37925,0,0,0,null,null,null,-37925]
["4395","4395-Rate-Payer Benefit Including Interest\n",null,null,null,null,0,0,0,0,null,null,null,0]
["4398","4398-Foreign Exchange Gains and Losses, Including Amortization\n",null,null,null,null,3220.12,-93.72,-365.59,-465.08,null,null,null,3220.12]
["4405","4405-Interest and Dividend Income\n",null,null,null,null,-54054.77,-24662.3,-31953.8,-54424.75,-25000,-25000,null,-54054.77]
["4415","4415-Equity in Earnings of Subsidiary Companies\n",null,null,null,null,null,0]
[null,"Total",null,null,null,null,{"$f":"SUM(G15:G50)","v":68747.660000000062},{"$f":"SUM(H15:H50)","v":144839.87000000008},434380.72999999986,164157.13000000009,189387.79999999993,{"$f":"SUM(L15:L50)","v":-488790.84},null,{"$f":"SUM(N15:N50)","v":68747.660000000062}]
[]
["Specific Service Charges",null,{"$f":"C15","v":0},0,0,0,-70947.710000000006,-87798.36,-73789.67,-63492.24,-77865,-69365.88,null,{"$f":"N15","v":-70947.710000000006}]
["Late Payment Charges",null,{"$f":"C16","v":0},0,0,0,-97158.6,-105293.31,-57095.19,-42165.09,-56597.04,-33000,null,{"$f":"N16","v":-97158.6}]
["Other Operating Revenues",null,null,null,null,null,{"$f":"SUM(G17:G25)","v":-295759.05},{"$f":"SUM(H17:H25)","v":-291841.53000000003},-284027.42000000004,-357025.44999999995,-290679.48000000004,-484977.96,null,{"$f":"SUM(N17:N25)","v":-295759.05}]
["Other Income or Deductions",null,null,null,null,null,{"$f":"SUM(G26:G49)","v":532613.02},{"$f":"SUM(H26:H49)","v":629773.07000000007},849293.00999999989,626839.91,614529.31999999995,98553,null,{"$f":"SUM(N26:N49)","v":532613.02}]
["Total",null,{"$f":"SUM(C53:C56)","v":0},{"$f":"SUM(D53:D56)","v":0},{"$f":"SUM(E53:E56)","v":0},{"$f":"SUM(F53:F56)","v":0},{"$f":"SUM(G53:G56)","v":68747.660000000033},144839.87000000005,434380.72999999986,164157.13000000012,189387.79999999993,-488790.84000000008,null,{"$f":"SUM(N53:N56)","v":68747.660000000033}]
[]
["Description                          Account(s)"]
["Specific Service Charges:       4235"]
["Late Payment Charges:          4225"]
["Other Distribution Revenues:   4082, 4084, 4090, 4205, 4210, 4215, 4220, 4230, 4240, 4245"]
["Other Income and Expenses:  4305, 4310, 4315, 4320, 4325, 4330, 4335, 4340, 4345, 4350, 4355, 4357, 4360, 4362, 4365, 4370, 4375, 4380, 4385, 4390, 4395, 4398, 4405, 4410, 4415, 4420"]
[]
[]
["Note: Add all applicable accounts listed above to the table and include all relevant information."]
[]
["Account Breakdown Details"]
[]
["For each \"Other Operating Revenue\" and \"Other Income or Deductions\" Account, a detailed breakdown of the account components is required.  See the example below for Account 4405, Interest and Dividend Income."]
[]
[]
[]
[null,null,{"$f":"C12","v":"2011 Actual²"},"2012 Actual²","2013 Actual²","2014 Actual²","2015 Actual²","2016 Actual²","2017 Actual²","2017 Actual","Bridge Year","Test Year",null,{"$f":"N12","v":0}]
[null,null,{"$f":"C13","v":2011},2012,2013,2014,2015,2016,2017,{"$f":"J13","v":2018},{"$f":"K13","v":2019},{"$f":"L13","v":2020},null,{"$f":"N13","v":2015}]
["Reporting Basis",null,{"$f":"IF(C14=0, \"\", C14)","v":""},"","","","MIFRS","MIFRS","MIFRS","MIFRS","MIFRS","MIFRS",null,{"$f":"IF(N14=0, \"\", N14)","v":"MIFRS"}]
[]
["4082-Retail Services Revenues"]
["Monthly fixed retail charge",null,null,null,null,null,-3140,-3020,-2840,-2880,-3015,-6030]
["Monthly variable service charge",null,null,null,null,null,-1159.5,-1281.5,-1169.5,-1079,-1267.92,-2535.84]
["Bill-ready charge",null,null,null,null,null,-661.2,-759.3,-700.5,-639.9,-746.88,-1493.76]
[]
["4084-Service Transaction Requests (STR) Revenues\n"]
["STR request fee",null,null,null,null,null,-43.25,-23.25,-6.25,-14.75,-24.84,-49.68]
["STR processing fee",null,null,null,null,null,-63,-33,-13,-19,-39.840000000000003,-79.680000000000007]
[]
["4086-SSS Administration Revenue\n"]
["Administrative charge",null,null,null,null,null,-34755.25,-34805.56,-34958.19,-35033,-34785,-35000]
[]
["4210-Rent from Electric Property\n"]
["Pole rentals",null,null,null,null,null,-238754.31,-238620.21,-238620.21,-239514.21,-238700.04,-431689]
[]
["4220-Other Electric Revenues\n"]
["Returned cheque",null,null,null,null,null,-1618.05,-2062.1999999999998,-2655,-2445,-2100,-2100]
["CDM mid-term incentive revenue",null,null,null,null,null,0,0,0,-71060.73,0,0]
["Other",null,null,null,null,null,-15564.490000000002,-11236.509999999998,-3064.7700000000004,-4339.8600000000006,-9999.9599999999991,-6000]
[]
["4305-Regulatory Debits\n"]
["Return on rate base for OEB 1576",null,null,null,null,null,92978.64,92978.64,92978.64,92978.64,93000,0]
[]
["4325-Revenues from Merchandise Jobbing, Etc.\n"]
["Job order and other billable revenue",null,null,null,null,null,-85953.73,-35533.550000000003,-55106.63,-104784.31,-70344.554999999993,-70344.554999999993]
[]
["4330-Costs and Expenses of Merchandising Jobbing, Etc.\n"]
["Job order and other billable costs",null,null,null,null,null,100947.3,71693.5,72271.539999999994,99063.15,70344.554999999993,70344.554999999993]
[]
["4355-Gain on Disposition of Utility and Other Property\n"]
["Gains on disposals/retirements",null,null,null,null,null,-12244.540000000008,-59563.3,0,0,0,0]
[]
["4360-Loss on Disposition of Utility and Other Property\n"]
["Loss on disposal of Wawa workcenter",null,null,null,null,null,0,0,191000,0,0,0]
["Other",null,null,null,null,null,0,0,9066.7699999999895,22190.22,0,0]
[]
["4380-Expenses of Non-Utility Operations\n"]
["Shared IT asset charge from affiliate",null,null,null,null,null,525645,584953.80000000005,571402.07999999996,572282.04,546529.31999999995,560454.6]
[]
["4390-Miscellaneous Non-Operating Income\n"]
["Billable (should have posted to 4325)",null,null,null,null,null,-37925,0,0,0,0,0]
[]
["4398-Foreign Exchange Gains and Losses, Including Amortization\n"]
["Gain/loss on foreign exchange",null,null,null,null,null,3220.12,-93.72,-365.59,-465.08,0,0]
[]
["4405-Interest and Dividend Income\n"]
["Interest income on regulatory accounts with debit balances",null,null,null,null,null,-23369.23,-13630.48,-9843,-16581.25,0,0]
["Other",null,null,null,null,null,-30685.539999999997,-11031.82,-22110.799999999999,-37843.5,-24999.96,-25000]
[]
[]
[]
[]
[]
[]
["Total",null,{"$f":"SUM(C77:C131)","v":0},{"$f":"SUM(D77:D131)","v":0},{"$f":"SUM(E77:E131)","v":0},{"$f":"SUM(F77:F131)","v":0},{"$f":"SUM(G77:G131)","v":236853.97},337931.5400000001,565265.58999999985,269814.46000000002,323849.87999999989,50476.639999999956,null,{"$f":"SUM(N77:N131)","v":0}]
[]
[]
["Notes:"]
[1,"List and specify any other interest revenue."]
[2,"In the transition year to IFRS, the applicant is to present information in both MIFRS and CGAAP. In column N, present CGAAP transition year information. For the typical applicant that adopted IFRS on January 1, 2015, 2014 must be presented in both a CGAAP and MIFRS basis."]

{"sheet":"Hidden_Other Revenue","index":28,"n_rows":41,"n_cols":8,"rows_kept":41,"cut":false,"hidden":true,"merged":[]}
["Utility Name","EB Number","Test Year","Bridge Year","Last Rebasing Year","Heading ","Year","Amount "]
[{"$f":"'LDC Info'!$E$14","v":"Algoma Power Inc."},{"$f":"EBNUMBER","v":"EB-2019-0019"},{"$f":"TestYear","v":2020},{"$f":"BridgeYear","v":2019},{"$f":"RebaseYear","v":2015},"Specific Service Charges",2010,{"$f":"'App.2-H_Other_Oper_Rev'!C53","v":0}]
[{"$f":"'LDC Info'!$E$14","v":"Algoma Power Inc."},"EB-2019-0019",2020,2019,2015,"Late Payment Charges",2010,{"$f":"'App.2-H_Other_Oper_Rev'!C54","v":0}]
[{"$f":"'LDC Info'!$E$14","v":"Algoma Power Inc."},"EB-2019-0019",2020,2019,2015,"Other Operating Revenues",2010,{"$f":"'App.2-H_Other_Oper_Rev'!C55","v":0}]
[{"$f":"'LDC Info'!$E$14","v":"Algoma Power Inc."},"EB-2019-0019",2020,2019,2015,"Other Income or Deductions",2010,{"$f":"'App.2-H_Other_Oper_Rev'!C56","v":0}]
[{"$f":"'LDC Info'!$E$14","v":"Algoma Power Inc."},"EB-2019-0019",2020,2019,2015,"Specific Service Charges",2011,{"$f":"'App.2-H_Other_Oper_Rev'!D53","v":0}]
[{"$f":"'LDC Info'!$E$14","v":"Algoma Power Inc."},"EB-2019-0019",2020,2019,2015,"Late Payment Charges",2011,{"$f":"'App.2-H_Other_Oper_Rev'!D54","v":0}]
[{"$f":"'LDC Info'!$E$14","v":"Algoma Power Inc."},"EB-2019-0019",2020,2019,2015,"Other Operating Revenues",2011,{"$f":"'App.2-H_Other_Oper_Rev'!D55","v":0}]
[{"$f":"'LDC Info'!$E$14","v":"Algoma Power Inc."},"EB-2019-0019",2020,2019,2015,"Other Income or Deductions",2011,{"$f":"'App.2-H_Other_Oper_Rev'!D56","v":0}]
[{"$f":"'LDC Info'!$E$14","v":"Algoma Power Inc."},"EB-2019-0019",2020,2019,2015,"Specific Service Charges",2012,{"$f":"'App.2-H_Other_Oper_Rev'!E53","v":0}]
[{"$f":"'LDC Info'!$E$14","v":"Algoma Power Inc."},"EB-2019-0019",2020,2019,2015,"Late Payment Charges",2012,{"$f":"'App.2-H_Other_Oper_Rev'!E54","v":0}]
[{"$f":"'LDC Info'!$E$14","v":"Algoma Power Inc."},"EB-2019-0019",2020,2019,2015,"Other Operating Revenues",2012,{"$f":"'App.2-H_Other_Oper_Rev'!E55","v":0}]
[{"$f":"'LDC Info'!$E$14","v":"Algoma Power Inc."},"EB-2019-0019",2020,2019,2015,"Other Income or Deductions",2012,{"$f":"'App.2-H_Other_Oper_Rev'!E56","v":0}]
[{"$f":"'LDC Info'!$E$14","v":"Algoma Power Inc."},"EB-2019-0019",2020,2019,2015,"Specific Service Charges",2013,{"$f":"'App.2-H_Other_Oper_Rev'!F53","v":0}]
[{"$f":"'LDC Info'!$E$14","v":"Algoma Power Inc."},"EB-2019-0019",2020,2019,2015,"Late Payment Charges",2013,{"$f":"'App.2-H_Other_Oper_Rev'!F54","v":0}]
[{"$f":"'LDC Info'!$E$14","v":"Algoma Power Inc."},"EB-2019-0019",2020,2019,2015,"Other Operating Revenues",2013,{"$f":"'App.2-H_Other_Oper_Rev'!F55","v":0}]
[{"$f":"'LDC Info'!$E$14","v":"Algoma Power Inc."},"EB-2019-0019",2020,2019,2015,"Other Income or Deductions",2013,{"$f":"'App.2-H_Other_Oper_Rev'!F56","v":0}]
[{"$f":"'LDC Info'!$E$14","v":"Algoma Power Inc."},"EB-2019-0019",2020,2019,2015,"Specific Service Charges",2014,{"$f":"'App.2-H_Other_Oper_Rev'!G53","v":-70947.710000000006}]
[{"$f":"'LDC Info'!$E$14","v":"Algoma Power Inc."},"EB-2019-0019",2020,2019,2015,"Late Payment Charges",2014,{"$f":"'App.2-H_Other_Oper_Rev'!G54","v":-97158.6}]
[{"$f":"'LDC Info'!$E$14","v":"Algoma Power Inc."},"EB-2019-0019",2020,2019,2015,"Other Operating Revenues",2014,{"$f":"'App.2-H_Other_Oper_Rev'!G55","v":-295759.05}]
[{"$f":"'LDC Info'!$E$14","v":"Algoma Power Inc."},"EB-2019-0019",2020,2019,2015,"Other Income or Deductions",2014,{"$f":"'App.2-H_Other_Oper_Rev'!G56","v":532613.02}]
[{"$f":"'LDC Info'!$E$14","v":"Algoma Power Inc."},"EB-2019-0019",2020,2019,2015,"Specific Service Charges",2015,{"$f":"'App.2-H_Other_Oper_Rev'!H53","v":-87798.36}]
[{"$f":"'LDC Info'!$E$14","v":"Algoma Power Inc."},"EB-2019-0019",2020,2019,2015,"Late Payment Charges",2015,{"$f":"'App.2-H_Other_Oper_Rev'!H54","v":-105293.31}]
[{"$f":"'LDC Info'!$E$14","v":"Algoma Power Inc."},"EB-2019-0019",2020,2019,2015,"Other Operating Revenues",2015,{"$f":"'App.2-H_Other_Oper_Rev'!H55","v":-291841.53000000003}]
[{"$f":"'LDC Info'!$E$14","v":"Algoma Power Inc."},"EB-2019-0019",2020,2019,2015,"Other Income or Deductions",2015,{"$f":"'App.2-H_Other_Oper_Rev'!H56","v":629773.07000000007}]
[{"$f":"'LDC Info'!$E$14","v":"Algoma Power Inc."},"EB-2019-0019",2020,2019,2015,"Specific Service Charges",2016,{"$f":"'App.2-H_Other_Oper_Rev'!I53","v":-73789.67}]
[{"$f":"'LDC Info'!$E$14","v":"Algoma Power Inc."},"EB-2019-0019",2020,2019,2015,"Late Payment Charges",2016,{"$f":"'App.2-H_Other_Oper_Rev'!I54","v":-57095.19}]
[{"$f":"'LDC Info'!$E$14","v":"Algoma Power Inc."},"EB-2019-0019",2020,2019,2015,"Other Operating Revenues",2016,{"$f":"'App.2-H_Other_Oper_Rev'!I55","v":-284027.42000000004}]
[{"$f":"'LDC Info'!$E$14","v":"Algoma Power Inc."},"EB-2019-0019",2020,2019,2015,"Other Income or Deductions",2016,{"$f":"'App.2-H_Other_Oper_Rev'!I56","v":849293.00999999989}]
[{"$f":"'LDC Info'!$E$14","v":"Algoma Power Inc."},"EB-2019-0019",2020,2019,2015,"Specific Service Charges",2017,{"$f":"'App.2-H_Other_Oper_Rev'!J53","v":-63492.24}]
[{"$f":"'LDC Info'!$E$14","v":"Algoma Power Inc."},"EB-2019-0019",2020,2019,2015,"Late Payment Charges",2017,{"$f":"'App.2-H_Other_Oper_Rev'!J54","v":-42165.09}]
[{"$f":"'LDC Info'!$E$14","v":"Algoma Power Inc."},"EB-2019-0019",2020,2019,2015,"Other Operating Revenues",2017,{"$f":"'App.2-H_Other_Oper_Rev'!J55","v":-357025.44999999995}]
[{"$f":"'LDC Info'!$E$14","v":"Algoma Power Inc."},"EB-2019-0019",2020,2019,2015,"Other Income or Deductions",2017,{"$f":"'App.2-H_Other_Oper_Rev'!J56","v":626839.91}]
[{"$f":"'LDC Info'!$E$14","v":"Algoma Power Inc."},"EB-2019-0019",2020,2019,2015,"Specific Service Charges",2018,{"$f":"'App.2-H_Other_Oper_Rev'!K53","v":-77865}]
[{"$f":"'LDC Info'!$E$14","v":"Algoma Power Inc."},"EB-2019-0019",2020,2019,2015,"Late Payment Charges",2018,{"$f":"'App.2-H_Other_Oper_Rev'!K54","v":-56597.04}]
[{"$f":"'LDC Info'!$E$14","v":"Algoma Power Inc."},"EB-2019-0019",2020,2019,2015,"Other Operating Revenues",2018,{"$f":"'App.2-H_Other_Oper_Rev'!K55","v":-290679.48000000004}]
[{"$f":"'LDC Info'!$E$14","v":"Algoma Power Inc."},"EB-2019-0019",2020,2019,2015,"Other Income or Deductions",2018,{"$f":"'App.2-H_Other_Oper_Rev'!K56","v":614529.31999999995}]
[{"$f":"'LDC Info'!$E$14","v":"Algoma Power Inc."},"EB-2019-0019",2020,2019,2015,"Specific Service Charges",2019,{"$f":"'App.2-H_Other_Oper_Rev'!L53","v":-69365.88}]
[{"$f":"'LDC Info'!$E$14","v":"Algoma Power Inc."},"EB-2019-0019",2020,2019,2015,"Late Payment Charges",2019,{"$f":"'App.2-H_Other_Oper_Rev'!L54","v":-33000}]
[{"$f":"'LDC Info'!$E$14","v":"Algoma Power Inc."},"EB-2019-0019",2020,2019,2015,"Other Operating Revenues",2019,{"$f":"'App.2-H_Other_Oper_Rev'!L55","v":-484977.96}]
[{"$f":"'LDC Info'!$E$14","v":"Algoma Power Inc."},"EB-2019-0019",2020,2019,2015,"Other Income or Deductions",2019,{"$f":"'App.2-H_Other_Oper_Rev'!L56","v":98553}]

{"sheet":"App_2-I LF_CDM","index":29,"n_rows":98,"n_cols":14,"rows_kept":98,"cut":false,"hidden":false,"merged":[[97,0,97,7],[50,0,50,5],[52,0,52,4],[55,0,55,1],[63,0,63,1],[67,0,67,7],[19,0,19,7],[21,0,21,7],[22,0,22,7],[17,0,17,5],[8,0,8,7],[9,0,9,7],[11,0,11,7],[13,0,13,7],[15,0,15,7],[24,0,24,7],[32,0,32,7],[84,0,84,7],[65,0,65,7],[74,0,74,7],[76,0,76,7],[78,0,78,7],[80,0,80,7],[82,0,82,7],[40,6,40,7],[42,0,42,7],[44,0,44,7],[46,0,46,7],[48,0,48,7],[69,0,69,5]]}
[null,null,null,null,null,null,"File Number:",{"$f":"EBNUMBER","v":"EB-2019-0019"}]
[null,null,null,null,null,null,"Exhibit:",3]
[null,null,null,null,null,null,"Tab:"]
[null,null,null,null,null,null,"Schedule:"]
[null,null,null,null,null,null,"Page:"]
[]
[null,null,null,null,null,null,"Date:","2019-09-24"]
[]
["Appendix 2-I"]
["Load Forecast CDM Adjustment Work Form (2018)"]
[]
["Appendix 2-I was initially developed to help determine what would be the amount of CDM savings needed in each year to cumulatively achieve the four year 2011-2014 CDM target.  This then determined the amount of kWh (and with translation, kW of demand) savings that were converted into dollar balances for the LRAMVA, and also to determine the related adjustment to the load forecast to account for OPA-reported savings.  Beginning in the 2015 year, it has been adjusted because the persistence of 2011-2014 CDM programs will be an adjustment to the load forecast in addition to the estimated savings for the first year (2015) for the new 2015-2020 CDM plan."]
[]
["2018 is the fourth year of the six-year (2015-2020) Conservation First program. Final results for the 2011-14 program were issued in the fall of 2015, and the program is completed, although in some instances disposition of the amounts has been deferred. For the purposes of the 2015-2020 LRAMVA, and the impact of CDM on the load forecast, CDM programs in 2014 and earlier are implicit in the historical data on which the base load forecast is developed. Only actual and forecasted impacts of 2015 to 2018 CDM programs need to be reflected in the manual load forecast adjustment and for the LRAMVA threshold amount in 2018 and carrying forward, although the full year impact of 2015 CDM programs and half-year impact of 2016 CDM programs on 2016 historical data is also assumed to be reflected in the base load forecast. "]
[]
["The new six year (2015-2020) CDM program works in a slightly different manner to the previous 2011-2014 CDM program. Distributors will offer programs each year that, over the six years (from January 1, 2015 to December 31, 2020) will strive to achieve savings equal to the new six year CDM target with the full target in place (i.e., persisting) on December 31, 2020. In other words, distributors will be able to offer and execute programs on a basis so that, as long as savings equal to the full target are in place at the end the period, the distributor's 2015-2020 CDM target will have been met."]
[]
["2015-2020 CDM Program - 2018 fourth year of the current CDM plan"]
[]
["For the first year of the new 2015-2020 CDM plan, it is assumed that each year's program will achieve an equal amount of new CDM savings.  This results in each year's program being about 1/6 (16.67%) of the cumulative 2015-2020 CDM target for kWh savings.  A distributor may propose an alternative approach but would be expected to document in its application why it believes that its proposal is more reasonable.  In its proposal, the distributor should ensure that the sum of the results for each year's CDM program from 2015 to 2020 add up to its 2015-2020 CDM target as established by the IESO."]
[]
["6 Year (2015-2020) kWh Target:"]
[7510000]
[null,2015,2016,2017,2018,2019,2020,"Total"]
["%"]
["2015 CDM Programs",null,null,null,null,null,{"$f":"G34/$G$40","v":9.7547651503338856E-2},{"$f":"H34/H40","v":0.14344593874833556}]
["2016 CDM Programs",null,null,null,null,null,{"$f":"G35/$G$40","v":0.12930191899067861},{"$f":"H35/H40","v":0.19014127829560587}]
["2017 CDM Programs",null,null,null,null,null,0.20212053694722146,{"$f":"H36/H40","v":0.29722263648468711}]
["2018 CDM Programs",null,null,null,null,null,6.8174940495044287E-2,{"$f":"H37/H40","v":0.10025272969374167}]
["2019 CDM Programs",null,null,null,null,null,1.4088951646100037E-2,{"$f":"H38/H40","v":2.0718109187749668E-2}]
["2020 CDM Programs",null,null,null,null,null,0.48876600041761675,{"$f":"H39/H40","v":0.71874101198402129}]
["Total in Year",{"$f":"SUM(B26:B31)","v":0},{"$f":"SUM(C26:C31)","v":0},{"$f":"SUM(D26:D31)","v":0},{"$f":"SUM(E26:E29)","v":0},{"$f":"SUM(F26:F30)","v":0},{"$f":"SUM(G26:G31)","v":1},{"$f":"SUM(H26:H31)","v":1.4705217043941412}]
["kWh"]
[{"$f":"A26","v":"2015 CDM Programs"},1077169,1068894,1068387,1093167,1086232,1077279,{"$f":"G34","v":1077279}]
["2016 CDM Programs",null,1437693,1437694,1437694,1437694,1427961,1427961,null,null,2011,2012,2013,2014]
["2017 CDM Programs",null,null,2640268,2250773,2248143,2232142,2232142,null,"2011 CDM Programs",{"$f":"50%","v":0.5},1,1,1]
["2018 CDM Programs",null,null,null,767494,760196,752898,752898,null,"2012 CDM Programs",null,0.5,1,1]
["2019 CDM Programs",null,null,null,null,155593,155593,155593,null,"2013 CDM Programs",null,null,0.5,1]
["2020 CDM Programs",null,null,null,null,null,5397745,5397745,null,"2014 CDM Programs",null,null,null,0.5]
["Total in Year",{"$f":"SUM(B34:B39)","v":1077169},{"$f":"SUM(C34:C39)","v":2506587},{"$f":"SUM(D34:D39)","v":5146349},{"$f":"SUM(E34:E37)","v":5549128},{"$f":"SUM(F34:F38)","v":5687858},{"$f":"SUM(G34:G39)","v":11043618},{"$f":"A23","v":7510000}]
[null,null,null,null,null,null,{"$f":"IF(G40-H40<>0,\"Inputs do no match 2015-20 CDM target\",\"\")","v":"Inputs do no match 2015-20 CDM target"}]
[]
["Note: The default formulae in the above table assume that the 2015-2020 kWh CDM target is achieved through persistence of CDM savings to the end of 2020. The distributor should enter measured CDM savings for 2015, and persistence of 2015 programs for 2016-2020 in row 34. When available, (preliminary/final) CDM savings for 2016 can be entered into row 35. The distributor can also input estimates or forecasts of the 2017 CDM programs if it believes that these are more realistic and can be supported; such information would typically be derived from the CDM plans that the distributor has filed with the IESO. Similarly, CDM savings and persistence into future years can be estimated for 2018, 2019 and 2020 CDM programs. However, the distributor will have to support its proposals for estimated or forecasted savings, particularly beyond the 2017 bridge year. The sum of persistent savings to the end of 2020, should equal the target entered into cell A23."]
[]
["Determination of 2018 Load Forecast Adjustment"]
[]
["The Board determined that the \"net\" number should be used in its Decision and Order with respect to Centre Wellington Hydro Ltd.'s 2013 Cost of Service rates (EB-2012-0113).  This approach has also been used in Settlement Agreements accepted by the Board in other 2013 and 2014 applications.  The distributor should select whether the adjustment is done on a \"net\" or \"gross\" basis, but must support a proposal for the adjustment being done on a \"gross\" basis.  Sheet 2-I defaults to the adjustment being done on a \"net\" basis consistent with Board policy and practice."]
[]
["From each of the 2006-2010 CDM Final Report,  and the 2011 to 2016 CDM Final Reports, issued by the OPA/IESO for the distributor, the distributor should input the \"gross\" and \"net\" results of the cumulative CDM savings for 2018 into cells C57 to C63 and D57 to D63.  The model will calculate the cumulative savings for all programs from 2006 to 2016 and determine the \"net\" to \"gross\" factor \"g\"."]
[]
["Net-to-Gross Conversion"]
[]
["Is CDM adjustment being done on a \"net\" or \"gross\" basis?",null,null,null,null,"net"]
[]
[null,null,"\"Gross\"","\"Net\"","Difference","\"Net-to-Gross\" Conversion Factor"]
["Persistence of Historical CDM programs to 2015",null,"kWh","kWh","kWh","('g')"]
["2006-2010 CDM programs",null,null,null,{"$f":"IF(ISBLANK(D57),\"\",C57-D57)","v":""}]
["2011 CDM program",null,null,null,{"$f":"IF(ISBLANK(D58),\"\",C58-D58)","v":""}]
["2012 CDM program",null,null,null,""]
["2013 CDM program",null,null,null,""]
["2014 CDM program",null,null,null,""]
["2015 CDM program"]
["2016 CDM program",null,null,null,""]
["2006 to 2016 OPA CDM programs:  Persistence to 2018.",null,{"$f":"SUM(C57:C63)","v":0},{"$f":"SUM(D57:D63)","v":0},{"$f":"C64-D64","v":0},{"$f":"IF(D64=0,0,IF(F53=\"net\",0,E64/D64))","v":0}]
[]
["The default values below represent the factor used for how each year's CDM program is factored into the manual CDM adjustment.  Distributors can choose alternative weights of \"0\", \"0.5\" or \"1\" from the drop-down menu for each cell, but must support its alternatives."]
[]
["These factors do not mean that CDM programs are excluded, but the assumption that impacts of previous year CDM programs are already implicitly reflected in the actual data for historical years that are used to derive the load forecast prior to any manual CDM adjustment for the 2018 test year."]
[]
["Weight Factor for Inclusion in CDM Adjustment to 2018 Load Forecast"]
[null,2015,2016,2017,2018,2019,2020]
["Weight Factor for each year's CDM program impact on 2018 load forecast",0,0,0,0.5,1,0.5,"Distributor can select \"0\", \"0.5\", or \"1\" from drop-down list"]
["Default Value selection rationale.  ","Full year impact of 2015 CDM is assumed to be reflected in the base forecast, as the full year persistence of 2015 CDM programs is in the 2016 historical actual data. No further impact is necessary for the manual adjustment to the load forecast.","Default is 0.5, but one option is for full year impact of persistence of 2016 CDM programs on 2018 load forecast, but 50% impact in base forecast (first year impact of 2016 CDM programs on 2016 actuals, which is part of the data underlying the base load forecast).","Full year impact of persistence of 2017 programs on 2018 load forecast.  2017 CDM program impacts are not in the base forecast.","Only 50% of 2017 CDM programs are assumed to impact the 2018 load forecast based on the \"half-year\" rule.","2019 and 2020 are future years beyond the 2018 test year. No impacts of CDM programs beyond the 2018 test year are factored into the test year load forecast."]
[]
["2015-2020 LRAMVA and 2018 CDM adjustment to Load Forecast"]
[]
["One manual adjustment for CDM impacts to the 2018 load forecast is made.  There is a different but related threshold amount that is used for the 2018 LRAMVA amount for Account 1568."]
[]
["The amount used for the CDM threshold of the LRAMVA is the kWh that will be used to determine the base amount for the LRAMVA balance for 2018, for assessing performance against the six-year target."]
[]
["If used to determine the manual CDM adjustment for the system purchased kWh, the proposed loss factor should correspond with the proposed total loss factor calculated in Appendix 2-R ."]
[]
["The Manual Adjustment for the 2018 Load Forecast is the amount manually subtracted from the system-wide load forecast (either based on a purchased or billed basis) derived from the base forecast from historical data. If the distributor has developed their load forecast on a system purchased basis, then the manual adjustment should be on a system purchased basis, including the adjustment for losses.  If the load forecast has been developed on a billed basis, either on a system basis or on a class-specific basis, the manual adjustment should be on a billed basis, excluding losses."]
[]
["The distributor should determine the allocation of the savings to all customer classes in a reasonable manner (e.g. taking into account what programs and what IESO-measured impacts were directed at specific customer classes), for both the LRAMVA and for the load forecast adjustment."]
[]
[null,2015,2016,2017,2018,2019,2020,"Total for 2020"]
[]
["Amount used for CDM threshold for LRAMVA (2020)",null,null,null,{"$f":"H37","v":752898},{"$f":"H38","v":155593},{"$f":"H39","v":5397745},{"$f":"SUM(B89:G89)","v":6306236}]
[]
["Manual Adjustment for 2018 Load Forecast (billed basis)",{"$f":"B89*(1+F64)*B72","v":0},null,null,{"$f":"E89*(1+G64)*E72","v":376449},{"$f":"F89*(1+H64)*F72","v":155593},2698872.5,{"$f":"SUM(B91:G91)","v":3230914.5}]
["Manual Adjustment for 2018 LDC-only CDM programs (billed basis)"]
["Total Manual Forecast to Load Forecast",{"$f":"B91+B92","v":0},{"$f":"C91+C92","v":0},{"$f":"D91+D92","v":0},{"$f":"E91+E92","v":376449},{"$f":"F91+F92","v":155593},2698872.5,{"$f":"SUM(B93:G93)","v":3230914.5}]
[]
["Proposed Loss Factor (TLF)",null," Format: X.XX%"]
["Manual Adjustment for 2018 Load Forecast (system purchased basis)",{"$f":"B93*(1+$B95)","v":0},{"$f":"C93*(1+$B95)","v":0},{"$f":"D93*(1+$B95)","v":0},{"$f":"E93*(1+$B95)","v":376449},{"$f":"F93*(1+$B95)","v":155593},2698872.5,{"$f":"SUM(B96:G96)","v":3230914.5}]
[]
["Manual adjustment uses \"gross\" versus \"net\" (i.e. numbers multiplied by (1 + g).  The Weight factor is also used to calculate the impact of each year's program on the CDM adjustment to the 2018 load forecast."]

{"sheet":"App.2-IA_Load_Forecast_Instrct","index":30,"n_rows":45,"n_cols":18,"rows_kept":45,"cut":false,"hidden":false,"merged":[[9,1,9,17],[8,1,8,17],[18,1,18,17],[20,1,20,17],[22,1,22,17],[24,1,24,17],[26,1,26,17],[43,2,43,17],[44,2,44,17],[28,8,28,10],[28,12,28,14],[29,13,29,14],[29,9,29,10],[41,2,41,17],[42,2,42,17],[28,16,28,17]]}
[null,null,null,null,null,null,null,null,null,null,null,null,null,null,null,null,"File Number:",{"$f":"EBNUMBER","v":"EB-2019-0019"}]
[null,null,null,null,null,null,null,null,null,null,null,null,null,null,null,null,"Exhibit:"]
[null,null,null,null,null,null,null,null,null,null,null,null,null,null,null,null,"Tab:"]
[null,null,null,null,null,null,null,null,null,null,null,null,null,null,null,null,"Schedule:"]
[null,null,null,null,null,null,null,null,null,null,null,null,null,null,null,null,"Page:"]
[]
[null,null,null,null,null,null,null,null,null,null,null,null,null,null,null,null,"Date:"]
[]
[null,"Appendix 2-IA"]
[null,"Instructions on Customer, Connections, Load Forecast and Revenues Data and Analysis"]
[]
[null,"This sheet requires no inputs, but serves as a summary of the hiostorical and forecasted data to be provided with respect to:"]
[]
[null,"1)","Customers and connections"]
[null,"2)","Consumption (kWh)"]
[null,"3)","Demand (kW or kCA) for applicable demand-billed customer classes"]
[null,"4)","Revenues"]
[]
[null,"The spreadsheet summarizes the data provided and the analyses (variance or year-over-year) that are required. Data are required to be provided on a customer class level. Consumption (kWh) must also be provided on a total distribution system level."]
[]
[null,"Appendix 2-IB (formerly 2-IA) is the appendix spreadsheet that the distributor populates, and the spreadsheet is laid out for inputting the necessary data. The spreadsheet also calculates necessary statistics such as average consumption per customer/connection per year, and variances and % annual changes, as necessary."]
[]
[null,"The distributor is required to provide suitable documentation in Exhibit 3 of its Application, in accordance with section 2.3.2 of Chaoter 2 of the Filing Requirements. This would include explanations for material variations or of trends in the data."]
[]
[null,"The distributor is also required to input its test year customer/connection and load forecast in Sheet 10 - Load Forecast of the Revenue Requirement Work Form. This sheet should also be updated to reflect changes in the load forecast made through the stages of processing of the rates application."]
[]
[null,"The applicant must demonstrate the historical accuracy of its load forecast approach for at least the past 5 years. Such analysis will cover both customer/connections and consumption (kWh) and demand (kW or kVA) by providing the following, as shown in the following table:"]
[]
[null,null,null,"Calendar Year",null,"Customers / Connections",null,null,"Consumption (kWh) (3)",null,null,null,"Demand (kW or kVA)",null,null,null,"Revenues"]
[null,null,null,{"$f":"\"(for \"&TestYear&\" Cost of Service)\"","v":"(for 2020 Cost of Service)"},null,null,null,null,"Weather-actual","Weather-normalized",null,null,"Weather-actual","Weather-normalized",null,null,"Weather-actual","Weather-normalized"]
[null,null,"Historical",{"$f":"D32-1","v":2014},null,"Actual",null,null,"Actual","Actual (1)",null,null,"Actual","Actual (1)",null,null,"Actual"]
[null,null,"Historical",2015,null,"Actual",null,null,"Actual","Actual (1)",null,null,"Actual","Actual (1)",null,null,"Actual"]
[null,null,"Historical",2016,null,"Actual","Board-approved (2)",null,"Actual","Actual (1)","Board-approved (2)",null,"Actual","Actual (1)","Board-approved (2)",null,"Actual"]
[null,null,"Historical",2017,null,"Actual",null,null,"Actual","Actual (1)",null,null,"Actual","Actual (1)",null,null,"Actual"]
[null,null,"Historical",2018,null,"Actual",null,null,"Actual","Actual (1)",null,null,"Actual","Actual (1)",null,null,"Actual"]
[null,null,"Bridge Year (Forecast)",2019,null,"Forecast",null,null,null,"Forecast",null,null,null,"Forecast",null,null,null,"Forecast"]
[null,null,"Test Year (Forecast)",{"$f":"TestYear","v":2020},null,"Forecast",null,null,null,"Forecast",null,null,null,"Forecast",null,null,null,"Forecast"]
[]
[]
[null,"Notes:"]
[]
[null,"(1)","“Weather-normalized actuals” are estimated by replacing the actual weather-related values (typically Heating Degree Days (HDD) and Cooling Degree Days (CDD)) by the “typical” or “weather-normalized” values. These “weather-normalized HDD and CDD values would be the same as used to estimate the Bridge Year and Test Year forecasts."]
[null,"(2)","For 2017 Cost of Service rebasers, the typical situation is that 2013 would have been the most recent cost of service rebasing application. If the most recent rebasing application was for a rate year other than 2013, that year should be used. An applicant must provide historical information back to the greater of: a) at least five (5) historical actual years; or b) to its last cost of service application."]
[null,"(3)","Consumption must be provided on a total distribution system basis as well as at a customer class level."]
[null,"(4)","Revenues exclude commodity charges."]

{"sheet":"App.2-IB_Load_Forecast_Analysis","index":31,"n_rows":489,"n_cols":21,"rows_kept":489,"cut":false,"hidden":false,"merged":[[211,5,211,7],[220,11,220,12],[220,17,220,18],[190,5,190,7],[199,11,199,12],[199,17,199,18],[210,5,210,8],[210,10,210,14],[210,16,210,20],[167,5,167,8],[167,10,167,14],[167,16,167,20],[168,5,168,7],[177,11,177,12],[177,17,177,18],[187,3,187,5],[189,5,189,8],[189,10,189,14],[189,16,189,20],[134,11,134,12],[134,17,134,18],[144,3,144,5],[146,5,146,8],[146,10,146,14],[146,16,146,20],[147,5,147,7],[156,11,156,12],[156,17,156,18],[91,11,91,12],[81,5,81,8],[82,5,82,7],[70,17,70,18],[81,16,81,20],[91,17,91,18],[125,5,125,7],[46,11,46,12],[101,3,101,5],[103,5,103,8],[103,10,103,14],[113,11,113,12],[113,17,113,18],[124,5,124,8],[124,10,124,14],[124,16,124,20],[230,3,230,5],[232,5,232,8],[232,10,232,14],[232,16,232,20],[233,5,233,7],[24,1,24,21],[8,1,8,21],[9,1,9,21],[18,1,18,21],[20,1,20,21],[22,1,22,21],[26,1,26,21],[60,10,60,14],[60,16,60,20],[36,10,36,14],[37,5,37,7],[28,1,28,21],[58,3,58,5],[61,5,61,7],[60,5,60,8],[103,16,103,20],[104,5,104,7],[70,11,70,12],[81,10,81,14],[254,5,254,7],[263,11,263,12],[263,17,263,18],[273,3,273,5],[275,5,275,8],[275,10,275,14],[275,16,275,20],[242,11,242,12],[242,17,242,18],[253,5,253,8],[253,10,253,14],[253,16,253,20],[297,5,297,7],[306,11,306,12],[306,17,306,18],[316,3,316,5],[318,5,318,8],[318,10,318,14],[318,16,318,20],[276,5,276,7],[285,11,285,12],[285,17,285,18],[296,5,296,8],[296,10,296,14],[296,16,296,20],[340,5,340,7],[349,11,349,12],[349,17,349,18],[359,3,359,5],[361,5,361,8],[361,10,361,14],[361,16,361,20],[319,5,319,7],[328,11,328,12],[328,17,328,18],[339,5,339,8],[339,10,339,14],[339,16,339,20],[383,5,383,7],[392,11,392,12],[392,17,392,18],[402,3,402,5],[404,5,404,8],[404,10,404,14],[404,16,404,20],[362,5,362,7],[371,11,371,12],[371,17,371,18],[382,5,382,8],[382,10,382,14],[382,16,382,20],[426,5,426,7],[435,11,435,12],[435,17,435,18],[445,3,445,5],[447,5,447,8],[447,10,447,14],[447,16,447,20],[405,5,405,7],[414,11,414,12],[414,17,414,18],[425,5,425,8],[425,10,425,14],[425,16,425,20],[469,5,469,7],[478,11,478,12],[478,17,478,18],[448,5,448,7],[457,11,457,12],[457,17,457,18],[468,5,468,8],[468,10,468,14],[468,16,468,20]]}
[null,null,null,null,null,null,null,null,null,null,null,null,null,null,null,null,null,null,null,"File Number:",{"$f":"EBNUMBER","v":"EB-2019-0019"}]
[null,null,null,null,null,null,null,null,null,null,null,null,null,null,null,null,null,null,null,"Exhibit:",3]
[null,null,null,null,null,null,null,null,null,null,null,null,null,null,null,null,null,null,null,"Tab:"]
[null,null,null,null,null,null,null,null,null,null,null,null,null,null,null,null,null,null,null,"Schedule:"]
[null,null,null,null,null,null,null,null,null,null,null,null,null,null,null,null,null,null,null,"Page:"]
[]
[null,null,null,null,null,null,null,null,null,null,null,null,null,null,null,null,null,null,null,"Date:","2019-09-24"]
[]
[null,"Appendix 2-IB"]
[null,"Customer, Connections, Load Forecast and Revenues Data and Analysis"]
[]
[null,"This sheet requires no inputs, but serves as a summary of the hiostorical and forecasted data to be provided with respect to:"]
[]
[null,"1)","Customers and connections"]
[null,"2)","Consumption (kWh)"]
[null,"3)","Demand (kW or kCA) for applicable demand-billed customer classes"]
[null,"4)","Revenues"]
[]
[null,"The spreadsheet summarizes the data provided and the analyses (variance or year-over-year) that are required. Data are required to be provided on a customer class level. Consumption (kWh) must also be provided on a total distribution system level."]
[]
[null,"Appendix 2-IB (formerly 2-IA) is the appendix spreadsheet that the distributor populates, and the spreadsheet is laid out for inputting the necessary data. The spreadsheet also calculates necessary statistics such as average consumption per customer/connection per year, and variances and % annual changes, as necessary."]
[]
[null,"The distributor is required to provide suitable documentation in Exhibit 3 of its Application, in accordance with section 2.3.2 of Chaoter 2 of the Filing Requirements. This would include explanations for material variations or of trends in the data."]
[]
[null,"The distributor is also required to input its test year customer/connection and load forecast in Sheet 10 - Load Forecast of the Revenue Requirement Work Form. This sheet should also be updated to reflect changes in the load forecast made through the stages of processing of the rates application."]
[]
[null,"The applicant must demonstrate the historical accuracy of its load forecast approach for at least the past 5 years. Such analysis will cover both customer/connections and consumption (kWh) and demand (kW or kVA) by providing the following, as shown in the following table:"]
[]
[null,"This sheet is to be filled in accordance with the instructions documented in section 2.3.2 of Chapter 2 of the Filing Requirements for Distribution Rate Applications, in terms of one set of tables per customer class."]
[]
[null,"Color coding for Cells:",null,null,null,"Data input",null,null,null,null,"Drop-down List"]
[]
[null,null,null,null,null,"No data entry required",null,null,null,null,"Blank or calculated value"]
[]
[null,"Distribution System (Total)"]
[]
[null,null,null,"Calendar Year",null,null,null,null,null,null,"Consumption (kWh) (3)"]
[null,null,null,{"$f":"CONCATENATE(\"(for \",TestYear,\" Cost of Service\")","v":"(for 2020 Cost of Service"},null,null,null,null,null,null,null,"Actual (Weather actual)","Weather-normalized",null,"Weather-normalized"]
[null,null,"Historical",{"$f":"D40-1","v":2014},null,null,null,null,null,null,"Actual",222844848,219744952.07064366,{"$f":"IF(D39=RebaseYear,\"Board-approved\",\"\")","v":""}]
[null,null,"Historical",2015,null,null,null,null,null,null,"Actual",216436884,222523892.94743723,"Board-approved",217540073]
[null,null,"Historical",2016,null,null,null,null,null,null,"Actual",211050246,216924121.48628348,""]
[null,null,"Historical",2017,null,null,null,null,null,null,"Actual",217280995.02387795,223178769.58028805,""]
[null,null,"Historical",2018,null,null,null,null,null,null,"Actual",241087151.13,242891458.18821049,""]
[null,null,"Bridge Year",2019,null,null,null,null,null,null,"Forecast",null,222232331.01628613,""]
[null,null,"Test Year",{"$f":"TestYear","v":2020},null,null,null,null,null,null,"Forecast",null,230668617.70066589,""]
[null,null,null,null,null,null,null,null,null,null,null,null,null,null,{"$f":"SUM(O39:O44)","v":217540073}]
[null,null,"Variance Analysis",null,null,null,null,null,null,null,"Year","Year-over-year",null,null,"Versus Board-approved"]
[null,null,null,{"$f":"D39","v":2014},null,null,null,null,null,null,{"$f":"D48","v":2014}]
[null,null,null,2015,null,null,null,null,null,null,{"$f":"D49","v":2015},{"$f":"IF(L39=0,\"\",L40/L39-1)","v":-2.8755271021567386E-2},1.2646210302479144E-2]
[null,null,null,2016,null,null,null,null,null,null,2016,-2.4887800546971484E-2,-2.5164809886174644E-2]
[null,null,null,2017,null,null,null,null,null,null,2017,2.9522585933768442E-2,2.8833345278293843E-2]
[null,null,null,2018,null,null,null,null,null,null,2018,0.10956391332571846,8.8326898857782332E-2]
[null,null,null,2019,null,null,null,null,null,null,2019,{"$f":"IF(K44=\"Forecast\",\"\",IF(L43=0,\"\",L44/L43-1))","v":""},{"$f":"IF(M43=0,\"\",M44/M43-1)","v":-8.5054976103425273E-2}]
[null,null,null,2020,null,null,null,null,null,null,2020,{"$f":"IF(K45=\"Forecast\",\"\",IF(L44=0,\"\",L45/L44-1))","v":""},{"$f":"IF(M44=0,\"\",M45/M44-1)","v":3.7961563224396588E-2},null,{"$f":"IF(O46=0,\"\",M45/O46-1)","v":6.0350005953458963E-2}]
[null,null,null,"Geometric Mean",null,null,null,null,null,null,"Geometric Mean",{"$f":"IF(L39=0,\"\",(L43/L39)^(1/($D43-$D39-1))-1)","v":2.6574539677244768E-2},{"$f":"IF(M39=0,\"\",(M45/M39)^(1/($D45-$D39-1))-1)","v":9.7501378879185641E-3},null,{"$f":"IF(O46=0,\"\",(M45/O46)^(1/(TestYear-RebaseYear-1))-1)","v":1.4757595678272839E-2}]
[]
[null,"Customer Class Analysis (one for each Customer Class, excluding MicroFIT and Standby)"]
[]
[null,1,"Customer Class:","R1(i) Residential",null,null,null,"Is the customer class billed on consumption (kWh) or demand (kW or kVA)?",null,null,null,null,null,"kWh"]
[]
[null,null,null,"Calendar Year",null,"Customers",null,null,null,null,"Consumption (kWh) (3)",null,null,null,null,null,{"$f":"CONCATENATE(\"Consumption (kWh) per \",LEFT(F61,LEN(F61)-1))","v":"Consumption (kWh) per Customer"}]
[null,null,null,{"$f":"CONCATENATE(\"(for \",TestYear,\" Cost of Service\")","v":"(for 2020 Cost of Service"},null,null,null,null,null,null,null,"Actual (Weather actual)","Weather-normalized",null,"Weather-normalized",null,null,{"$f":"L62","v":"Actual (Weather actual)"},{"$f":"M62","v":"Weather-normalized"},null,{"$f":"O62","v":"Weather-normalized"}]
[null,null,"Historical",{"$f":"D64-1","v":2014},null,{"$f":"K39","v":"Actual"},7397.916666666667,{"$f":"IF(D63=RebaseYear,\"Board-approved\",\"\")","v":""},null,null,{"$f":"F63","v":"Actual"},85393126,83049520.449067235,{"$f":"H63","v":""},null,null,{"$f":"K63","v":"Actual"},{"$f":"IF(G63=0,\"\",L63/G63)","v":11542.861301041959},{"$f":"IF(G63=0,\"\",M63/G63)","v":11226.068661096106},{"$f":"N63","v":""},{"$f":"IF(T63=\"\",\"\",IF(I63=0,\"\",O63/I63))","v":""}]
[null,null,"Historical",2015,null,{"$f":"K40","v":"Actual"},7479.5,"Board-approved",7531,null,{"$f":"F64","v":"Actual"},80876149.5,83177285.839208007,{"$f":"H64","v":"Board-approved"},80045884,null,{"$f":"K64","v":"Actual"},{"$f":"IF(G64=0,\"\",L64/G64)","v":10813.042248813423},{"$f":"IF(G64=0,\"\",M64/G64)","v":11120.701362284646},{"$f":"N64","v":"Board-approved"},{"$f":"IF(T64=\"\",\"\",IF(I64=0,\"\",O64/I64))","v":10628.85194529279}]
[null,null,"Historical",2016,null,"Actual",7543.75,"",null,null,"Actual",75910135.700000003,78043495.712005302,"",null,null,"Actual",10062.65261971831,10345.450964308906,"",""]
[null,null,"Historical",2017,null,"Actual",7596.416666666667,"",null,null,"Actual",76321855.799999997,78579222.067692637,"",null,null,"Actual",10047.086560549382,10344.248547147357,"",""]
[null,null,"Historical",2018,null,"Actual",7639.75,"",null,null,"Actual",82834417.987999991,82696790.38756305,"",null,null,"Actual",10842.556103013841,10824.541429701632,"",""]
[null,null,"Bridge Year",2019,null,"Forecast",7721.7000694422823,"",null,null,"Forecast",null,81107232.753088519,"",null,null,"Forecast",0,10503.80512370078,"",""]
[null,null,"Test Year",{"$f":"TestYear","v":2020},null,"Forecast",8115.5292008802571,"",null,null,"Forecast",null,85077075.380733728,"",null,null,"Forecast",0,10483.244317758819,"",""]
[null,null,null,null,null,null,null,null,{"$f":"SUM(I63:I68)","v":7531},null,null,null,null,null,{"$f":"SUM(O63:O68)","v":80045884},null,null,null,null,null,{"$f":"SUM(U63:U68)","v":10628.85194529279}]
[null,null,"Variance Analysis","Year",null,null,"Year-over-year",null,"Test Year Versus Board-approved",null,"Year","Year-over-year",null,null,{"$f":"I71","v":"Test Year Versus Board-approved"},null,"Year","Year-over-year",null,null,{"$f":"O71","v":"Test Year Versus Board-approved"}]
[null,null,null,{"$f":"D63","v":2014},null,null,null,null,null,null,{"$f":"D72","v":2014},null,null,null,null,null,{"$f":"K72","v":2014}]
[null,null,null,2015,null,null,{"$f":"IF(G63=0,\"\",G64/G63-1)","v":1.10278794705716E-2},null,null,null,{"$f":"D73","v":2015},{"$f":"IF(L63=0,\"\",L64/L63-1)","v":-5.2896254202006832E-2},1.5384241769238471E-3,null,null,null,{"$f":"K73","v":2015},{"$f":"IF(R63=\"\",\"\",IF(R63=0,\"\",R64/R63-1))","v":-6.3226875312333286E-2},{"$f":"IF(S63=\"\",\"\",IF(S63=0,\"\",S64/S63-1))","v":-9.3859481883100671E-3}]
[null,null,null,2016,null,null,8.5901464001605365E-3,null,null,null,2016,-6.1402698208326556E-2,-6.1721058524642824E-2,null,null,null,2016,{"$f":"IF(R64=\"\",\"\",IF(R64=0,\"\",R65/R64-1))","v":-6.939671665274938E-2},-6.9712365499263074E-2]
[null,null,null,2017,null,null,6.9814968240817787E-3,null,null,null,2017,5.4237829534007354E-3,6.8644587329129703E-3,null,null,null,2017,-1.5469140948407567E-3,-1.1622665514499086E-4]
[null,null,null,2018,null,null,5.7044439812630188E-3,null,null,null,2018,8.5330238890758192E-2,5.2400217405095928E-2,null,null,null,2018,7.9174150403752641E-2,4.6430910893641153E-2]
[null,null,null,2019,null,null,1.0726799887729621E-2,null,null,null,2019,{"$f":"IF(K68=\"Forecast\",\"\",IF(L67=0,\"\",L68/L67-1))","v":""},{"$f":"IF(M67=0,\"\",M68/M67-1)","v":-1.9221515454529547E-2},null,null,null,2019,{"$f":"IF(Q68=\"Forecast\",\"\",IF(R67=0,\"\",R68/R67-1))","v":""},{"$f":"IF(S67=\"\",\"\",IF(S67=0,\"\",S68/S67-1))","v":-2.9630475164590164E-2}]
[null,null,null,2020,null,null,5.1002904528305582E-2,null,{"$f":"IF(I70=0,\"\",G69/I70-1)","v":7.7616412279943869E-2},null,2020,{"$f":"IF(K69=\"Forecast\",\"\",IF(L68=0,\"\",L69/L68-1))","v":""},{"$f":"IF(M68=0,\"\",M69/M68-1)","v":4.8945605624721944E-2},null,{"$f":"IF(O70=0,\"\",M69/O70-1)","v":6.2853842437841312E-2},null,2020,{"$f":"IF(Q69=\"Forecast\",\"\",IF(R68=0,\"\",R69/R68-1))","v":""},{"$f":"IF(S68=\"\",\"\",IF(S68=0,\"\",S69/S68-1))","v":-1.9574626242415682E-3},null,{"$f":"IF(U70=0,\"\",S69/U70-1)","v":-1.3699280814468029E-2}]
[null,null,null,"Geometric Mean",null,null,{"$f":"IF(G63=0,\"\",(G69/G63)^(1/($D69-$D63-1))-1)","v":1.8688684222536667E-2},null,{"$f":"IF(I70=0,\"\",(G69/I70)^(1/(TestYear-RebaseYear-1))-1)","v":1.8863605645541792E-2},null,"Geometric Mean",{"$f":"IF(L63=0,\"\",(L67/L63)^(1/($D67-$D63-1))-1)","v":-1.0089408467735872E-2},{"$f":"IF(M63=0,\"\",(M69/M63)^(1/($D69-$D63-1))-1)","v":4.835765357206423E-3},null,{"$f":"IF(O70=0,\"\",(M69/O70)^(1/(TestYear-RebaseYear-1))-1)","v":1.5356110391968825E-2},null,"Geometric Mean",{"$f":"IF(R63=\"\",\"\",IF(R63=0,\"\",(R67/R63)^(1/($D67-$D63-1))-1))","v":-2.0646679211409391E-2},{"$f":"IF(S63=\"\",\"\",IF(S63=0,\"\",(S69/S63)^(1/($D69-$D63-1))-1))","v":-1.3598775641552097E-2},null,{"$f":"IF(U70=0,\"\",(S69/U70)^(1/(TestYear-RebaseYear-1))-1)","v":-3.4425562304295498E-3}]
[]
[]
[null,null,null,"Calendar Year",null,"Revenues",null,null,null,null,{"$f":"IF(ISBLANK(N59),\"\",CONCATENATE(\"Demand (\",N59,\")\"))","v":"Demand (kWh)"},null,null,null,null,null,{"$f":"CONCATENATE(\"Demand (\",N59,\") per \",LEFT(F61,LEN(F61)-1))","v":"Demand (kWh) per Customer"}]
[null,null,null,{"$f":"CONCATENATE(\"(for \",TestYear,\" Cost of Service\")","v":"(for 2020 Cost of Service"},null,null,null,null,null,null,null,"Actual (Weather actual)","Weather-normalized",null,{"$f":"M83","v":"Weather-normalized"},null,null,{"$f":"L83","v":"Actual (Weather actual)"},{"$f":"M83","v":"Weather-normalized"},null,{"$f":"O83","v":"Weather-normalized"}]
[null,null,"Historical",{"$f":"D85-1","v":2014},null,{"$f":"F63","v":"Actual"},4831305.5950000007,{"$f":"IF(D84=RebaseYear,\"Board-approved\",\"\")","v":""},null,null,{"$f":"K63","v":"Actual"},null,null,{"$f":"N63","v":""},null,null,{"$f":"K84","v":"Actual"},{"$f":"IF(G84=0,\"\",L84/G84)","v":0},{"$f":"IF(G84=0,\"\",M84/G84)","v":0},{"$f":"N84","v":""},{"$f":"IF(T84=\"\",\"\",IF(I84=0,\"\",O84/I84))","v":""}]
[null,null,"Historical",2015,null,"Actual",4747596.0636,"Board-approved",4734787.4752000002,null,"Actual",null,null,"Board-approved",null,null,{"$f":"K85","v":"Actual"},{"$f":"IF(G85=0,\"\",L85/G85)","v":0},{"$f":"IF(G85=0,\"\",M85/G85)","v":0},{"$f":"N85","v":"Board-approved"},{"$f":"IF(T85=\"\",\"\",IF(I85=0,\"\",O85/I85))","v":0}]
[null,null,"Historical",2016,null,"Actual",4699185.9081600001,"",null,null,"Actual",null,null,"",null,null,"Actual",0,0,"",""]
[null,null,"Historical",2017,null,"Actual",4885573.6405800004,"",null,null,"Actual",null,null,"",null,null,"Actual",0,0,"",""]
[null,null,"Historical",2018,null,"Actual",5184809.4613456,"",null,null,"Actual",null,null,"",null,null,"Actual",0,0,"",""]
[null,null,"Bridge Year (Forecast)",2019,null,"Forecast",5308093.130543693,"",null,null,"Forecast",null,null,"",null,null,"Forecast",0,0,"",""]
[null,null,"Test Year (Forecast)",{"$f":"TestYear","v":2020},null,"Forecast",5636060.6024868935,"",null,null,"Forecast",null,null,"",null,null,"Forecast",0,0,"",""]
[null,null,null,null,null,null,null,null,{"$f":"SUM(I84:I89)","v":4734787.4752000002},null,null,null,null,null,{"$f":"SUM(O84:O89)","v":0},null,null,null,null,null,{"$f":"SUM(U84:U89)","v":0}]
[null,null,"Variance Analysis","Year",null,null,"Year-over-year",null,{"$f":"I71","v":"Test Year Versus Board-approved"},null,"Year","Year-over-year",null,null,{"$f":"I92","v":"Test Year Versus Board-approved"},null,"Year","Year-over-year",null,null,{"$f":"O92","v":"Test Year Versus Board-approved"}]
[null,null,null,{"$f":"D84","v":2014},null,null,null,null,null,null,{"$f":"D93","v":2014},null,null,null,null,null,{"$f":"K93","v":2014}]
[null,null,null,2015,null,null,{"$f":"IF(G84=0,\"\",G85/G84-1)","v":-1.7326482408116184E-2},null,null,null,{"$f":"D94","v":2015},{"$f":"IF(L84=0,\"\",L85/L84-1)","v":""},"",null,null,null,{"$f":"K94","v":2015},{"$f":"IF(R84=\"\",\"\",IF(R84=0,\"\",R85/R84-1))","v":""},{"$f":"IF(S84=\"\",\"\",IF(S84=0,\"\",S85/S84-1))","v":""}]
[null,null,null,2016,null,null,-1.019677217511461E-2,null,null,null,2016,"","",null,null,null,2016,{"$f":"IF(R85=\"\",\"\",IF(R85=0,\"\",R86/R85-1))","v":""},""]
[null,null,null,2017,null,null,3.9663834558310018E-2,null,null,null,2017,"","",null,null,null,2017,"",""]
[null,null,null,2018,null,null,6.1248860989448817E-2,null,null,null,2018,"","",null,null,null,2018,"",""]
[null,null,null,2019,null,null,2.377785917056574E-2,null,null,null,2019,{"$f":"IF(K89=\"Forecast\",\"\",IF(L88=0,\"\",L89/L88-1))","v":""},{"$f":"IF(M88=0,\"\",M89/M88-1)","v":""},null,null,null,2019,{"$f":"IF(Q89=\"Forecast\",\"\",IF(R88=0,\"\",R89/R88-1))","v":""},{"$f":"IF(S88=\"\",\"\",IF(S88=0,\"\",S89/S88-1))","v":""}]
[null,null,null,2020,null,null,6.1786307036705734E-2,null,{"$f":"IF(I91=0,\"\",G90/I91-1)","v":0.19035133720522968},null,2020,{"$f":"IF(K90=\"Forecast\",\"\",IF(L89=0,\"\",L90/L89-1))","v":""},{"$f":"IF(M89=0,\"\",M90/M89-1)","v":""},null,{"$f":"IF(O91=0,\"\",M90/O91-1)","v":""},null,2020,{"$f":"IF(Q90=\"Forecast\",\"\",IF(R89=0,\"\",R90/R89-1))","v":""},{"$f":"IF(S89=\"\",\"\",IF(S89=0,\"\",S90/S89-1))","v":""},null,{"$f":"IF(U91=0,\"\",S90/U91-1)","v":""}]
[null,null,null,"Geometric Mean",null,null,{"$f":"IF(G84=0,\"\",(G90/G84)^(1/($D90-$D84-1))-1)","v":3.1293377913148568E-2},null,{"$f":"IF(I91=0,\"\",(G90/I91)^(1/(TestYear-RebaseYear-1))-1)","v":4.4524884683586397E-2},null,"Geometric Mean",{"$f":"IF(L84=0,\"\",(L88/L84)^(1/($D88-$D84-1))-1)","v":""},{"$f":"IF(M84=0,\"\",(M90/M84)^(1/($D90-$D84-1))-1)","v":""},null,{"$f":"IF(O91=0,\"\",(M90/O91)^(1/(TestYear-RebaseYear-1))-1)","v":""},null,"Geometric Mean",{"$f":"IF(R84=\"\",\"\",IF(R84=0,\"\",(R88/R84)^(1/($D88-$D84-1))-1))","v":""},{"$f":"IF(S84=\"\",\"\",IF(S84=0,\"\",(S90/S84)^(1/($D90-$D84-1))-1))","v":""},null,{"$f":"IF(U91=0,\"\",(S90/U91)^(1/(TestYear-RebaseYear-1))-1)","v":""}]
[]
[null,2,"Customer Class:","R1(ii) GS < 50 kW",null,null,null,"Is the customer class billed on consumption (kWh) or demand (kW or kVA)?",null,null,null,null,null,"kWh"]
[]
[null,null,null,"Calendar Year",null,"Customers",null,null,null,null,"Consumption (kWh) (3)",null,null,null,null,null,{"$f":"CONCATENATE(\"Consumption (kWh) per \",LEFT(F104,LEN(F104)-1))","v":"Consumption (kWh) per Customer"}]
[null,null,null,{"$f":"CONCATENATE(\"(for \",TestYear,\" Cost of Service\")","v":"(for 2020 Cost of Service"},null,null,null,null,null,null,null,"Actual (Weather actual)","Weather-normalized",null,"Weather-normalized",null,null,{"$f":"L105","v":"Actual (Weather actual)"},{"$f":"M105","v":"Weather-normalized"},null,{"$f":"O105","v":"Weather-normalized"}]
[null,null,"Historical",{"$f":"D107-1","v":2014},null,{"$f":"F63","v":"Actual"},955.66666666666663,{"$f":"IF(D106=RebaseYear,\"Board-approved\",\"\")","v":""},null,null,{"$f":"F106","v":"Actual"},27212831,26465977.655057512,{"$f":"H106","v":""},null,null,{"$f":"K106","v":"Actual"},{"$f":"IF(G106=0,\"\",L106/G106)","v":28475.232996163239},{"$f":"IF(G106=0,\"\",M106/G106)","v":27693.733158413863},{"$f":"N106","v":""},{"$f":"IF(T106=\"\",\"\",IF(I106=0,\"\",O106/I106))","v":""}]
[null,null,"Historical",2015,null,{"$f":"F64","v":"Actual"},954.25,"Board-approved",null,null,{"$f":"F107","v":"Actual"},26130351,26873827.298192959,{"$f":"H107","v":"Board-approved"},25745817,null,{"$f":"K107","v":"Actual"},{"$f":"IF(G107=0,\"\",L107/G107)","v":27383.129159025411},{"$f":"IF(G107=0,\"\",M107/G107)","v":28162.250246992884},{"$f":"N107","v":"Board-approved"},{"$f":"IF(T107=\"\",\"\",IF(I107=0,\"\",O107/I107))","v":""}]
[null,null,"Historical",2016,null,"Actual",951.16666666666663,"",null,null,"Actual",24984442,25686598.688215028,"",null,null,"Actual",26267.154722270898,27005.360457208721,"",""]
[null,null,"Historical",2017,null,"Actual",961.16666666666663,"",null,null,"Actual",25604789,26362100.079167809,"",null,null,"Actual",26639.28108201838,27427.189262182568,"",""]
[null,null,"Historical",2018,null,"Actual",960.91666666666663,"",null,null,"Actual",26240993.814999998,26197394.969259784,"",null,null,"Actual",27308.292930361633,27262.920790141136,"",""]
[null,null,"Bridge Year",2019,null,"Forecast",956.10423537821703,"",null,null,"Forecast",null,25693841.336989745,"",null,null,"Forecast",0,26873.472981558061,"",""]
[null,null,"Test Year",{"$f":"TestYear","v":2020},null,"Forecast",997.31590555008074,"",null,null,"Forecast",null,28598828.238182604,"",null,null,"Forecast",0,28675.796785180719,"",""]
[null,null,null,null,null,null,null,null,{"$f":"SUM(I106:I111)","v":0},null,null,null,null,null,{"$f":"SUM(O106:O111)","v":25745817},null,null,null,null,null,{"$f":"SUM(U106:U111)","v":0}]
[null,null,"Variance Analysis","Year",null,null,"Year-over-year",null,"Test Year Versus Board-approved",null,"Year","Year-over-year",null,null,{"$f":"I114","v":"Test Year Versus Board-approved"},null,"Year","Year-over-year",null,null,{"$f":"O114","v":"Test Year Versus Board-approved"}]
[null,null,null,{"$f":"D106","v":2014},null,null,null,null,null,null,{"$f":"D115","v":2014},null,null,null,null,null,{"$f":"K115","v":2014}]
[null,null,null,2015,null,null,{"$f":"IF(G106=0,\"\",G107/G106-1)","v":-1.4823857690965392E-3},null,null,null,{"$f":"D116","v":2015},{"$f":"IF(L106=0,\"\",L107/L106-1)","v":-3.9778294290660154E-2},1.5410337318769285E-2,null,null,null,{"$f":"K116","v":2015},{"$f":"IF(R106=\"\",\"\",IF(R106=0,\"\",R107/R106-1))","v":-3.835276211032157E-2},1.691780179649327E-2]
[null,null,null,2016,null,null,-3.2311588507554223E-3,null,null,null,2016,-4.3853563237631232E-2,-4.4177875998249072E-2,null,null,null,2016,-4.0754087316813847E-2,-4.1079451380405696E-2]
[null,null,null,2017,null,null,1.0513404590853259E-2,null,null,null,2017,2.4829331789759435E-2,2.6297813858192853E-2,null,null,null,2017,1.4166983964653435E-2,1.5620187912035233E-2]
[null,null,null,2018,null,null,-2.6010057222125571E-4,null,null,null,2018,2.484710243072108E-2,-6.2477992805353155E-3,null,null,null,2018,{"$f":"IF(R109=\"\",\"\",IF(R109=0,\"\",R110/R109-1))","v":2.5113735099812295E-2},-5.9892565173614853E-3]
[null,null,null,2019,null,null,-5.0081671547476114E-3,null,null,null,2019,{"$f":"IF(K111=\"Forecast\",\"\",IF(L110=0,\"\",L111/L110-1))","v":""},{"$f":"IF(M110=0,\"\",M111/M110-1)","v":-1.9221515454529436E-2},null,null,null,2019,{"$f":"IF(Q111=\"Forecast\",\"\",IF(R110=0,\"\",R111/R110-1))","v":""},-1.4284889413753055E-2]
[null,null,null,2020,null,null,4.3103741879734647E-2,null,{"$f":"IF(I113=0,\"\",G112/I113-1)","v":""},null,2020,{"$f":"IF(K112=\"Forecast\",\"\",IF(L111=0,\"\",L112/L111-1))","v":""},{"$f":"IF(M111=0,\"\",M112/M111-1)","v":0.11306160348280581},null,{"$f":"IF(O113=0,\"\",M112/O113-1)","v":0.1108145543869361},null,2020,{"$f":"IF(Q112=\"Forecast\",\"\",IF(R111=0,\"\",R112/R111-1))","v":""},6.7067021998217458E-2,null,{"$f":"IF(U113=0,\"\",S112/U113-1)","v":""}]
[null,null,null,"Geometric Mean",null,null,{"$f":"IF(G106=0,\"\",(G112/G106)^(1/($D112-$D106-1))-1)","v":8.5681782389046557E-3},null,{"$f":"IF(I113=0,\"\",(G112/I113)^(1/(TestYear-RebaseYear-1))-1)","v":""},null,"Geometric Mean",{"$f":"IF(L106=0,\"\",(L110/L106)^(1/($D110-$D106-1))-1)","v":-1.2048743063876821E-2},{"$f":"IF(M106=0,\"\",(M112/M106)^(1/($D112-$D106-1))-1)","v":1.5621905913683953E-2},null,{"$f":"IF(O113=0,\"\",(M112/O113)^(1/(TestYear-RebaseYear-1))-1)","v":2.6621583056017029E-2},null,"Geometric Mean",{"$f":"IF(R106=\"\",\"\",IF(R106=0,\"\",(R110/R106)^(1/($D110-$D106-1))-1))","v":-1.3851264565145849E-2},{"$f":"IF(S106=\"\",\"\",IF(S106=0,\"\",(S112/S106)^(1/($D112-$D106-1))-1))","v":6.9938035196550619E-3},null,{"$f":"IF(U113=0,\"\",(S112/U113)^(1/(TestYear-RebaseYear-1))-1)","v":""}]
[]
[]
[null,null,null,"Calendar Year",null,"Revenues",null,null,null,null,{"$f":"IF(ISBLANK(N102),\"\",CONCATENATE(\"Demand (\",N102,\")\"))","v":"Demand (kWh)"},null,null,null,null,null,{"$f":"CONCATENATE(\"Demand (\",N102,\") per \",LEFT(F104,LEN(F104)-1))","v":"Demand (kWh) per Customer"}]
[null,null,null,{"$f":"CONCATENATE(\"(for \",TestYear,\" Cost of Service\")","v":"(for 2020 Cost of Service"},null,null,null,null,null,null,null,"Actual (Weather actual)","Weather-normalized",null,{"$f":"M126","v":"Weather-normalized"},null,null,{"$f":"L126","v":"Actual (Weather actual)"},{"$f":"M126","v":"Weather-normalized"},null,{"$f":"O126","v":"Weather-normalized"}]
[null,null,"Historical",{"$f":"D128-1","v":2014},null,{"$f":"F106","v":"Actual"},1150015.8875000002,{"$f":"IF(D127=RebaseYear,\"Board-approved\",\"\")","v":""},null,null,{"$f":"K106","v":"Actual"},null,null,{"$f":"N106","v":""},null,null,{"$f":"K127","v":"Actual"},{"$f":"IF(G127=0,\"\",L127/G127)","v":0},{"$f":"IF(G127=0,\"\",M127/G127)","v":0},{"$f":"N127","v":""},{"$f":"IF(T127=\"\",\"\",IF(I127=0,\"\",O127/I127))","v":""}]
[null,null,"Historical",2015,null,"Actual",1124341.8528,"Board-approved",1114739.9975999999,null,"Actual",null,null,"Board-approved",null,null,{"$f":"K128","v":"Actual"},{"$f":"IF(G128=0,\"\",L128/G128)","v":0},{"$f":"IF(G128=0,\"\",M128/G128)","v":0},{"$f":"N128","v":"Board-approved"},{"$f":"IF(T128=\"\",\"\",IF(I128=0,\"\",O128/I128))","v":0}]
[null,null,"Historical",2016,null,"Actual",1105677.0027999999,"",null,null,"Actual",null,null,"",null,null,"Actual",0,0,"",""]
[null,null,"Historical",2017,null,"Actual",1162926.3816,"",null,null,"Actual",null,null,"",null,null,"Actual",0,0,"",""]
[null,null,"Historical",2018,null,"Actual",1215504.5616694998,"",null,null,"Actual",null,null,"",null,null,"Actual",0,0,"",""]
[null,null,"Bridge Year (Forecast)",2019,null,"Forecast",1221721.8234064998,"",null,null,"Forecast",null,null,"",null,null,"Forecast",0,0,"",""]
[null,null,"Test Year (Forecast)",{"$f":"TestYear","v":2020},null,"Forecast",1349964.8877264773,"",null,null,"Forecast",null,null,"",null,null,"Forecast",0,0,"",""]
[null,null,null,null,null,null,null,null,{"$f":"SUM(I127:I132)","v":1114739.9975999999},null,null,null,null,null,{"$f":"SUM(O127:O132)","v":0},null,null,null,null,null,{"$f":"SUM(U127:U132)","v":0}]
[null,null,"Variance Analysis","Year",null,null,"Year-over-year",null,{"$f":"I114","v":"Test Year Versus Board-approved"},null,"Year","Year-over-year",null,null,{"$f":"I135","v":"Test Year Versus Board-approved"},null,"Year","Year-over-year",null,null,{"$f":"O135","v":"Test Year Versus Board-approved"}]
[null,null,null,{"$f":"D127","v":2014},null,null,null,null,null,null,{"$f":"D136","v":2014},null,null,null,null,null,{"$f":"K136","v":2014}]
[null,null,null,2015,null,null,{"$f":"IF(G127=0,\"\",G128/G127-1)","v":-2.2324939141330047E-2},null,null,null,{"$f":"D137","v":2015},{"$f":"IF(L127=0,\"\",L128/L127-1)","v":""},"",null,null,null,{"$f":"K137","v":2015},{"$f":"IF(R127=\"\",\"\",IF(R127=0,\"\",R128/R127-1))","v":""},""]
[null,null,null,2016,null,null,-1.6600689508727395E-2,null,null,null,2016,"","",null,null,null,2016,"",""]
[null,null,null,2017,null,null,5.1777669839403906E-2,null,null,null,2017,"","",null,null,null,2017,"",""]
[null,null,null,2018,null,null,4.5211959158722337E-2,null,null,null,2018,{"$f":"IF(L130=0,\"\",L131/L130-1)","v":""},"",null,null,null,2018,{"$f":"IF(R130=\"\",\"\",IF(R130=0,\"\",R131/R130-1))","v":""},""]
[null,null,null,2019,null,null,5.1149637221110655E-3,null,null,null,2019,{"$f":"IF(K132=\"Forecast\",\"\",IF(L131=0,\"\",L132/L131-1))","v":""},"",null,null,null,2019,{"$f":"IF(Q132=\"Forecast\",\"\",IF(R131=0,\"\",R132/R131-1))","v":""},""]
[null,null,null,2020,null,null,0.10496911969895106,null,{"$f":"IF(I134=0,\"\",G133/I134-1)","v":0.21101323235275427},null,2020,{"$f":"IF(K133=\"Forecast\",\"\",IF(L132=0,\"\",L133/L132-1))","v":""},"",null,{"$f":"IF(O134=0,\"\",M133/O134-1)","v":""},null,2020,{"$f":"IF(Q133=\"Forecast\",\"\",IF(R132=0,\"\",R133/R132-1))","v":""},"",null,{"$f":"IF(U134=0,\"\",S133/U134-1)","v":""}]
[null,null,null,"Geometric Mean",null,null,{"$f":"IF(G127=0,\"\",(G133/G127)^(1/($D133-$D127-1))-1)","v":3.2580041729670439E-2},null,{"$f":"IF(I134=0,\"\",(G133/I134)^(1/(TestYear-RebaseYear-1))-1)","v":4.9028342698366201E-2},null,"Geometric Mean",{"$f":"IF(L127=0,\"\",(L131/L127)^(1/($D131-$D127-1))-1)","v":""},{"$f":"IF(M127=0,\"\",(M133/M127)^(1/($D133-$D127-1))-1)","v":""},null,{"$f":"IF(O134=0,\"\",(M133/O134)^(1/(TestYear-RebaseYear-1))-1)","v":""},null,"Geometric Mean",{"$f":"IF(R127=\"\",\"\",IF(R127=0,\"\",(R131/R127)^(1/($D131-$D127-1))-1))","v":""},{"$f":"IF(S127=\"\",\"\",IF(S127=0,\"\",(S133/S127)^(1/($D133-$D127-1))-1))","v":""},null,{"$f":"IF(U134=0,\"\",(S133/U134)^(1/(TestYear-RebaseYear-1))-1)","v":""}]
[]
[null,3,"Customer Class:","R2 GS>50 kW",null,null,null,"Is the customer class billed on consumption (kWh) or demand (kW or kVA)?",null,null,null,null,null,"kW"]
[]
[null,null,null,"Calendar Year",null,"Customers",null,null,null,null,"Consumption (kWh) (3)",null,null,null,null,null,{"$f":"CONCATENATE(\"Consumption (kWh) per \",LEFT(F147,LEN(F147)-1))","v":"Consumption (kWh) per Customer"}]
[null,null,null,{"$f":"CONCATENATE(\"(for \",TestYear,\" Cost of Service\")","v":"(for 2020 Cost of Service"},null,null,null,null,null,null,null,"Actual (Weather actual)","Weather-normalized",null,"Weather-normalized",null,null,{"$f":"L148","v":"Actual (Weather actual)"},{"$f":"M148","v":"Weather-normalized"},null,{"$f":"O148","v":"Weather-normalized"}]
[null,null,"Historical",{"$f":"D150-1","v":2014},null,{"$f":"F106","v":"Actual"},43.416666666666664,{"$f":"IF(D149=RebaseYear,\"Board-approved\",\"\")","v":""},null,null,{"$f":"F149","v":"Actual"},83470707.799999997,83018955.036425754,{"$f":"H149","v":""},null,null,{"$f":"K149","v":"Actual"},{"$f":"IF(G149=0,\"\",L149/G149)","v":1922549.8917466411},{"$f":"IF(G149=0,\"\",M149/G149)","v":1912144.8376911883},{"$f":"N149","v":""},{"$f":"IF(T149=\"\",\"\",IF(I149=0,\"\",O149/I149))","v":""}]
[null,null,"Historical",2015,null,{"$f":"F107","v":"Actual"},42.166666666666664,"Board-approved",null,null,{"$f":"F150","v":"Actual"},86528983.700000003,86942369.948404223,{"$f":"H150","v":"Board-approved"},83288188,null,{"$f":"K150","v":"Actual"},{"$f":"IF(G150=0,\"\",L150/G150)","v":2052070.7596837946},{"$f":"IF(G150=0,\"\",M150/G150)","v":2061874.3861281634},{"$f":"N150","v":"Board-approved"},{"$f":"IF(T150=\"\",\"\",IF(I150=0,\"\",O150/I150))","v":""}]
[null,null,"Historical",2016,null,"Actual",42.083333333333336,"",null,null,"Actual",89578885.799999997,89962073.616219357,"",null,null,"Actual",2128607.1873267326,2137712.6403854103,"",""]
[null,null,"Historical",2017,null,"Actual",38.166666666666664,"",null,null,"Actual",94512142.900000006,94856925.109683245,"",null,null,"Actual",2476300.6873362446,2485334.2823497797,"",""]
[null,null,"Historical",2018,null,"Actual",39.75,"",null,null,"Actual",109202680.46470469,109181913.17147592,"",null,null,"Actual",2747237.2443950865,2746714.7967666895,"",""]
[null,null,"Bridge Year",2019,null,"Forecast",39.009207316089025,"",null,null,"Forecast",null,108942057.14409205,"",null,null,"Forecast",0,2792726.7596427114,"",""]
[null,null,"Test Year",{"$f":"TestYear","v":2020},null,"Forecast",37.282220262380214,"",null,null,"Forecast",null,110505010.79075159,"",null,null,"Forecast",0,2964013.6776472284,"",""]
[null,null,null,null,null,null,null,null,{"$f":"SUM(I149:I154)","v":0},null,null,null,null,null,{"$f":"SUM(O149:O154)","v":83288188},null,null,null,null,null,{"$f":"SUM(U149:U154)","v":0}]
[null,null,"Variance Analysis","Year",null,null,"Year-over-year",null,"Test Year Versus Board-approved",null,"Year","Year-over-year",null,null,{"$f":"I157","v":"Test Year Versus Board-approved"},null,"Year","Year-over-year",null,null,{"$f":"O157","v":"Test Year Versus Board-approved"}]
[null,null,null,{"$f":"D149","v":2014},null,null,null,null,null,null,{"$f":"D158","v":2014},null,null,null,null,null,{"$f":"K158","v":2014}]
[null,null,null,2015,null,null,{"$f":"IF(G149=0,\"\",G150/G149-1)","v":-2.8790786948176605E-2},null,null,null,{"$f":"D159","v":2015},{"$f":"IF(L149=0,\"\",L150/L149-1)","v":3.6638911788405837E-2},4.7259266395933475E-2,null,null,null,{"$f":"K159","v":2015},{"$f":"IF(R149=\"\",\"\",IF(R149=0,\"\",R150/R149-1))","v":6.7369314311777506E-2},7.8304501565773288E-2]
[null,null,null,2016,null,null,-1.9762845849801147E-3,null,null,null,2016,3.5247173485524197E-2,3.4732244699646087E-2,null,null,null,2016,3.729716788846571E-2,3.678121944162549E-2]
[null,null,null,2017,null,null,-9.3069306930693152E-2,null,null,null,2017,5.5071650600950095E-2,5.4410167492864314E-2,null,null,null,2017,0.16334319553161536,0.16261383096920667]
[null,null,null,2018,null,null,4.1484716157205392E-2,null,null,null,2018,0.15543545108535128,0.15101678707409771,null,null,null,2018,0.10941181676538969,0.10516915823886097]
[null,null,null,2019,null,null,-1.8636293934867321E-2,null,null,null,2019,{"$f":"IF(K154=\"Forecast\",\"\",IF(L153=0,\"\",L154/L153-1))","v":""},{"$f":"IF(M153=0,\"\",M154/M153-1)","v":-2.1968476317790753E-3},null,null,null,2019,{"$f":"IF(Q154=\"Forecast\",\"\",IF(R153=0,\"\",R154/R153-1))","v":""},{"$f":"IF(S153=\"\",\"\",IF(S153=0,\"\",S154/S153-1))","v":1.6751634691080763E-2}]
[null,null,null,2020,null,null,-4.4271267542432935E-2,null,{"$f":"IF(I156=0,\"\",G155/I156-1)","v":""},null,2020,{"$f":"IF(K155=\"Forecast\",\"\",IF(L154=0,\"\",L155/L154-1))","v":""},{"$f":"IF(M154=0,\"\",M155/M154-1)","v":1.4346650757588453E-2},null,{"$f":"IF(O156=0,\"\",M155/O156-1)","v":0.32677890399958742},null,2020,{"$f":"IF(Q155=\"Forecast\",\"\",IF(R154=0,\"\",R155/R154-1))","v":""},{"$f":"IF(S154=\"\",\"\",IF(S154=0,\"\",S155/S154-1))","v":6.1333217584963684E-2},null,{"$f":"IF(U156=0,\"\",S155/U156-1)","v":""}]
[null,null,null,"Geometric Mean",null,null,{"$f":"IF(G149=0,\"\",(G155/G149)^(1/($D155-$D149-1))-1)","v":-3.0005977141668416E-2},null,{"$f":"IF(I156=0,\"\",(G155/I156)^(1/(TestYear-RebaseYear-1))-1)","v":""},null,"Geometric Mean",{"$f":"IF(L149=0,\"\",(L153/L149)^(1/($D153-$D149-1))-1)","v":9.3703832985002844E-2},{"$f":"IF(M149=0,\"\",(M155/M149)^(1/($D155-$D149-1))-1)","v":5.8865849654399227E-2},null,{"$f":"IF(O156=0,\"\",(M155/O156)^(1/(TestYear-RebaseYear-1))-1)","v":7.3246891755612165E-2},null,"Geometric Mean",{"$f":"IF(R149=\"\",\"\",IF(R149=0,\"\",(R153/R149)^(1/($D153-$D149-1))-1))","v":0.12634866566615544},{"$f":"IF(S149=\"\",\"\",IF(S149=0,\"\",(S155/S149)^(1/($D155-$D149-1))-1))","v":9.1621004564733877E-2},null,{"$f":"IF(U156=0,\"\",(S155/U156)^(1/(TestYear-RebaseYear-1))-1)","v":""}]
[]
[]
[null,null,null,"Calendar Year",null,"Revenues",null,null,null,null,{"$f":"IF(ISBLANK(N145),\"\",CONCATENATE(\"Demand (\",N145,\")\"))","v":"Demand (kW)"},null,null,null,null,null,{"$f":"CONCATENATE(\"Demand (\",N145,\") per \",LEFT(F147,LEN(F147)-1))","v":"Demand (kW) per Customer"}]
[null,null,null,{"$f":"CONCATENATE(\"(for \",TestYear,\" Cost of Service\")","v":"(for 2020 Cost of Service"},null,null,null,null,null,null,null,"Actual (Weather actual)","Weather-normalized",null,{"$f":"M169","v":"Weather-normalized"},null,null,{"$f":"L169","v":"Actual (Weather actual)"},{"$f":"M169","v":"Weather-normalized"},null,{"$f":"O169","v":"Weather-normalized"}]
[null,null,"Historical",{"$f":"D171-1","v":2014},null,{"$f":"F149","v":"Actual"},918088.74560000002,{"$f":"IF(D170=RebaseYear,\"Board-approved\",\"\")","v":""},null,null,{"$f":"K149","v":"Actual"},196688,195623.50264633205,{"$f":"N149","v":""},null,null,{"$f":"K170","v":"Actual"},{"$f":"IF(G170=0,\"\",L170/G170)","v":0.21423636978738714},{"$f":"IF(G170=0,\"\",M170/G170)","v":0.2130768987027348},{"$f":"N170","v":""},{"$f":"IF(T170=\"\",\"\",IF(I170=0,\"\",O170/I170))","v":""}]
[null,null,"Historical",2015,null,"Actual",952357.29910000006,"Board-approved",979696.70310000004,null,"Actual",208261,209255.95255575166,"Board-approved",198901,null,{"$f":"K171","v":"Actual"},{"$f":"IF(G171=0,\"\",L171/G171)","v":0.21867948111156549},{"$f":"IF(G171=0,\"\",M171/G171)","v":0.21972420724186545},{"$f":"N171","v":"Board-approved"},{"$f":"IF(T171=\"\",\"\",IF(I171=0,\"\",O171/I171))","v":0.20302303699770405}]
[null,null,"Historical",2016,null,"Actual",997741.03025999991,"",null,null,"Actual",217368.6,218298.42847916443,"",null,null,"Actual",0.21786074082104875,0.21879267451021669,"",""]
[null,null,"Historical",2017,null,"Actual",976358.03068999993,"",null,null,"Actual",210836.1,211605.23435891417,"",null,null,"Actual",0.21594137946609654,0.2167291379878046,"",""]
[null,null,"Historical",2018,null,"Actual",1093385.45,"",null,null,"Actual",234800,234755.34761207909,"",null,null,"Actual",0.21474586112335775,0.2147050224713335,"",""]
[null,null,"Bridge Year (Forecast)",2019,null,"Forecast",1169246.1192856957,"",null,null,"Forecast",null,251600.07134922451,"",null,null,"Forecast",0,0.21518144657425037,"",""]
[null,null,"Test Year (Forecast)",{"$f":"TestYear","v":2020},null,"Forecast",1158725.9803531626,"",null,null,"Forecast",null,255209.68970345618,"",null,null,"Forecast",0,0.22025025245888769,"",""]
[null,null,null,null,null,null,null,null,{"$f":"SUM(I170:I175)","v":979696.70310000004},null,null,null,null,null,{"$f":"SUM(O170:O175)","v":198901},null,null,null,null,null,{"$f":"SUM(U170:U175)","v":0.20302303699770405}]
[null,null,"Variance Analysis","Year",null,null,"Year-over-year",null,{"$f":"I157","v":"Test Year Versus Board-approved"},null,"Year","Year-over-year",null,null,{"$f":"I178","v":"Test Year Versus Board-approved"},null,"Year","Year-over-year",null,null,{"$f":"O178","v":"Test Year Versus Board-approved"}]
[null,null,null,{"$f":"D170","v":2014},null,null,null,null,null,null,{"$f":"D179","v":2014},null,null,null,null,null,{"$f":"K179","v":2014}]
[null,null,null,2015,null,null,{"$f":"IF(G170=0,\"\",G171/G170-1)","v":3.7325970571183031E-2},null,null,null,{"$f":"D180","v":2015},{"$f":"IF(L170=0,\"\",L171/L170-1)","v":5.8839380135036201E-2},6.9687178304264075E-2,null,null,null,{"$f":"K180","v":2015},{"$f":"IF(R170=\"\",\"\",IF(R170=0,\"\",R171/R170-1))","v":2.0739295240055577E-2},3.1196758445430239E-2]
[null,null,null,2016,null,null,4.7654101252637471E-2,null,null,null,2016,4.3731663633613582E-2,4.3212514688219406E-2,null,null,null,2016,-3.7440197240042883E-3,-4.239554409329882E-3]
[null,null,null,2017,null,null,-2.1431412482282974E-2,null,null,null,2017,-3.0052638697585565E-2,-3.0660752653512979E-2,null,null,null,2017,-8.8100377687083675E-3,-9.4314698928172902E-3]
[null,null,null,2018,null,null,0.11986117349523506,null,null,null,2018,0.11366127527496483,0.10940236579355522,null,null,null,2018,-5.5363096489179364E-3,-9.3393787991027377E-3]
[null,null,null,2019,null,null,6.9381451239995728E-2,null,null,null,2019,{"$f":"IF(K175=\"Forecast\",\"\",IF(L174=0,\"\",L175/L174-1))","v":""},{"$f":"IF(M174=0,\"\",M175/M174-1)","v":7.17543770929574E-2},null,null,null,2019,{"$f":"IF(Q175=\"Forecast\",\"\",IF(R174=0,\"\",R175/R174-1))","v":""},{"$f":"IF(S174=\"\",\"\",IF(S174=0,\"\",S175/S174-1))","v":2.2189704620463324E-3}]
[null,null,null,2020,null,null,-8.9973691244406018E-3,null,{"$f":"IF(I177=0,\"\",G176/I177-1)","v":0.18273949140246182},null,2020,{"$f":"IF(K176=\"Forecast\",\"\",IF(L175=0,\"\",L176/L175-1))","v":""},{"$f":"IF(M175=0,\"\",M176/M175-1)","v":1.4346650757588453E-2},null,{"$f":"IF(O177=0,\"\",M176/O177-1)","v":0.2830990779506195},null,2020,{"$f":"IF(Q176=\"Forecast\",\"\",IF(R175=0,\"\",R176/R175-1))","v":""},{"$f":"IF(S175=\"\",\"\",IF(S175=0,\"\",S176/S175-1))","v":2.3555961563295202E-2},null,{"$f":"IF(U177=0,\"\",S176/U177-1)","v":8.4853500942252413E-2}]
[null,null,null,"Geometric Mean",null,null,{"$f":"IF(G170=0,\"\",(G176/G170)^(1/($D176-$D170-1))-1)","v":4.7657234206661458E-2},null,{"$f":"IF(I177=0,\"\",(G176/I177)^(1/(TestYear-RebaseYear-1))-1)","v":4.2851030222321951E-2},null,"Geometric Mean",{"$f":"IF(L170=0,\"\",(L174/L170)^(1/($D174-$D170-1))-1)","v":6.0816035768253229E-2},{"$f":"IF(M170=0,\"\",(M176/M170)^(1/($D176-$D170-1))-1)","v":5.4618112314690492E-2},null,{"$f":"IF(O177=0,\"\",(M176/O177)^(1/(TestYear-RebaseYear-1))-1)","v":6.4302416508781546E-2},null,"Geometric Mean",{"$f":"IF(R170=\"\",\"\",IF(R170=0,\"\",(R174/R170)^(1/($D174-$D170-1))-1))","v":7.9209703892657579E-4},{"$f":"IF(S170=\"\",\"\",IF(S170=0,\"\",(S176/S170)^(1/($D176-$D170-1))-1))","v":6.6442323698552297E-3},null,{"$f":"IF(U177=0,\"\",(S176/U177)^(1/(TestYear-RebaseYear-1))-1)","v":2.056994303576265E-2}]
[]
[null,4,"Customer Class:","Seasonal",null,null,null,"Is the customer class billed on consumption (kWh) or demand (kW or kVA)?",null,null,null,null,null,"kWh"]
[]
[null,null,null,"Calendar Year",null,"Customers",null,null,null,null,"Consumption (kWh) (3)",null,null,null,null,null,{"$f":"CONCATENATE(\"Consumption (kWh) per \",LEFT(F190,LEN(F190)-1))","v":"Consumption (kWh) per Customer"}]
[null,null,null,{"$f":"CONCATENATE(\"(for \",TestYear,\" Cost of Service\")","v":"(for 2020 Cost of Service"},null,null,null,null,null,null,null,"Actual (Weather actual)","Weather-normalized",null,"Weather-normalized",null,null,{"$f":"L191","v":"Actual (Weather actual)"},{"$f":"M191","v":"Weather-normalized"},null,{"$f":"O191","v":"Weather-normalized"}]
[null,null,"Historical",{"$f":"D193-1","v":2014},null,{"$f":"F149","v":"Actual"},3254.5,{"$f":"IF(D192=RebaseYear,\"Board-approved\",\"\")","v":""},null,null,{"$f":"F192","v":"Actual"},7919568,7702216.2716443771,{"$f":"H192","v":""},null,null,{"$f":"K192","v":"Actual"},{"$f":"IF(G192=0,\"\",L192/G192)","v":2433.420801966508},{"$f":"IF(G192=0,\"\",M192/G192)","v":2366.6358186032808},{"$f":"N192","v":""},{"$f":"IF(T192=\"\",\"\",IF(I192=0,\"\",O192/I192))","v":""}]
[null,null,"Historical",2015,null,{"$f":"F150","v":"Actual"},3175.9166666666665,"Board-approved",null,null,{"$f":"F193","v":"Actual"},6868390,7063813.5200187527,{"$f":"H193","v":"Board-approved"},7731414,null,{"$f":"K193","v":"Actual"},{"$f":"IF(G193=0,\"\",L193/G193)","v":2162.6480543675057},{"$f":"IF(G193=0,\"\",M193/G193)","v":2224.1810039155371},{"$f":"N193","v":"Board-approved"},{"$f":"IF(T193=\"\",\"\",IF(I193=0,\"\",O193/I193))","v":""}]
[null,null,"Historical",2016,null,"Actual",3139.9166666666665,"",null,null,"Actual",6205026,6379410.5432468792,"",null,null,"Actual",1976.1753762042517,2031.7133288824691,"",""]
[null,null,"Historical",2017,null,"Actual",3108.0833333333335,"",null,null,"Actual",6042453,6221170.2158400044,"",null,null,"Actual",1944.1090704346193,2001.6098503922581,"",""]
[null,null,"Historical",2018,null,"Actual",3076.4166666666665,"",null,null,"Actual",6043635.352,6033593.9821006889,"",null,null,"Actual",1964.5048141506625,1961.2408317362806,"",""]
[null,null,"Bridge Year",2019,null,"Forecast",3017.7417203975979,"",null,null,"Forecast"," ",5917619.1621273849,"",null,null,"Forecast",{"$error":"#VALUE!"},1960.9428872354649,"",""]
[null,null,"Test Year",{"$f":"TestYear","v":2020},null,"Forecast",2960.1858518389645,"",null,null,"Forecast"," ",5886660.7540439228,"",null,null,"Forecast",{"$error":"#VALUE!"},1988.6118806989555,"",""]
[null,null,null,null,null,null,null,null,{"$f":"SUM(I192:I197)","v":0},null,null,null,null,null,{"$f":"SUM(O192:O197)","v":7731414},null,null,null,null,null,{"$f":"SUM(U192:U197)","v":0}]
[null,null,"Variance Analysis","Year",null,null,"Year-over-year",null,"Test Year Versus Board-approved",null,"Year","Year-over-year",null,null,{"$f":"I200","v":"Test Year Versus Board-approved"},null,"Year","Year-over-year",null,null,{"$f":"O200","v":"Test Year Versus Board-approved"}]
[null,null,null,{"$f":"D192","v":2014},null,null,null,null,null,null,{"$f":"D201","v":2014},null,null,null,null,null,{"$f":"K201","v":2014}]
[null,null,null,2015,null,null,{"$f":"IF(G192=0,\"\",G193/G192-1)","v":-2.4146054181389931E-2},null,null,null,{"$f":"D202","v":2015},{"$f":"IF(L192=0,\"\",L193/L192-1)","v":-0.13273173486230561},-8.2885591511614232E-2,null,null,null,{"$f":"K202","v":2015},{"$f":"IF(R192=\"\",\"\",IF(R192=0,\"\",R193/R192-1))","v":-0.11127247181423949},-6.0192959798866075E-2]
[null,null,null,2016,null,null,-1.1335310015481048E-2,null,null,null,2016,-9.6582168455780715E-2,-9.6888596341379141E-2,null,null,null,2016,-8.6224236896368378E-2,-8.6534178061156042E-2]
[null,null,null,2017,null,null,-1.0138273308739509E-2,null,null,null,2017,-2.6200212537385026E-2,-2.4804850908111686E-2,null,null,null,2017,-1.6226447387085674E-2,-1.4816794309642778E-2]
[null,null,null,2018,null,null,-1.0188487009679115E-2,null,null,null,2018,1.9567417404808829E-4,-3.015127817299057E-2,null,null,null,2018,1.0491049101212901E-2,-2.0168275374976896E-2]
[null,null,null,2019,null,null,-1.907249655250487E-2,null,null,null,2019,{"$f":"IF(K197=\"Forecast\",\"\",IF(L196=0,\"\",L197/L196-1))","v":""},{"$f":"IF(M196=0,\"\",M197/M196-1)","v":-1.9221515454529436E-2},null,null,null,2019,{"$f":"IF(Q197=\"Forecast\",\"\",IF(R196=0,\"\",R197/R196-1))","v":""},{"$f":"IF(S196=\"\",\"\",IF(S196=0,\"\",S197/S196-1))","v":-1.5191632562117086E-4}]
[null,null,null,2020,null,null,-1.907249655250487E-2,null,{"$f":"IF(I199=0,\"\",G198/I199-1)","v":""},null,2020,{"$f":"IF(K198=\"Forecast\",\"\",IF(L197=0,\"\",L198/L197-1))","v":""},{"$f":"IF(M197=0,\"\",M198/M197-1)","v":-5.2315647957873468E-3},null,{"$f":"IF(O199=0,\"\",M198/O199-1)","v":-0.238604897623653},null,2020,{"$f":"IF(Q198=\"Forecast\",\"\",IF(R197=0,\"\",R198/R197-1))","v":""},{"$f":"IF(S197=\"\",\"\",IF(S197=0,\"\",S198/S197-1))","v":1.4110045551861239E-2},null,{"$f":"IF(U199=0,\"\",S198/U199-1)","v":""}]
[null,null,null,"Geometric Mean",null,null,{"$f":"IF(G192=0,\"\",(G198/G192)^(1/($D198-$D192-1))-1)","v":-1.8778760105188974E-2},null,{"$f":"IF(I199=0,\"\",(G198/I199)^(1/(TestYear-RebaseYear-1))-1)","v":""},null,"Geometric Mean",{"$f":"IF(L192=0,\"\",(L196/L192)^(1/($D196-$D192-1))-1)","v":-8.6169630560132382E-2},{"$f":"IF(M192=0,\"\",(M198/M192)^(1/($D198-$D192-1))-1)","v":-5.2344123942348109E-2},null,{"$f":"IF(O199=0,\"\",(M198/O199)^(1/(TestYear-RebaseYear-1))-1)","v":-6.5880324618807662E-2},null,"Geometric Mean",{"$f":"IF(R192=\"\",\"\",IF(R192=0,\"\",(R196/R192)^(1/($D196-$D192-1))-1))","v":-6.886648166030096E-2},{"$f":"IF(S192=\"\",\"\",IF(S192=0,\"\",(S198/S192)^(1/($D198-$D192-1))-1))","v":-3.4207742833570753E-2},null,{"$f":"IF(U199=0,\"\",(S198/U199)^(1/(TestYear-RebaseYear-1))-1)","v":""}]
[]
[]
[null,null,null,"Calendar Year",null,"Revenues",null,null,null,null,{"$f":"IF(ISBLANK(N188),\"\",CONCATENATE(\"Demand (\",N188,\")\"))","v":"Demand (kWh)"},null,null,null,null,null,{"$f":"CONCATENATE(\"Demand (\",N188,\") per \",LEFT(F190,LEN(F190)-1))","v":"Demand (kWh) per Customer"}]
[null,null,null,{"$f":"CONCATENATE(\"(for \",TestYear,\" Cost of Service\")","v":"(for 2020 Cost of Service"},null,null,null,null,null,null,null,"Actual (Weather actual)","Weather-normalized",null,{"$f":"M212","v":"Weather-normalized"},null,null,{"$f":"L212","v":"Actual (Weather actual)"},{"$f":"M212","v":"Weather-normalized"},null,{"$f":"O212","v":"Weather-normalized"}]
[null,null,"Historical",{"$f":"D214-1","v":2014},null,{"$f":"F192","v":"Actual"},1859618.0471999999,{"$f":"IF(D213=RebaseYear,\"Board-approved\",\"\")","v":""},null,null,{"$f":"K192","v":"Actual"},null,null,{"$f":"N192","v":""},null,null,{"$f":"K213","v":"Actual"},{"$f":"IF(G213=0,\"\",L213/G213)","v":0},{"$f":"IF(G213=0,\"\",M213/G213)","v":0},{"$f":"N213","v":""},{"$f":"IF(T213=\"\",\"\",IF(I213=0,\"\",O213/I213))","v":""}]
[null,null,"Historical",2015,null,"Actual",2038872.2679999999,"Board-approved",2152693.1267999997,null,"Actual",null,null,"Board-approved",null,null,{"$f":"K214","v":"Actual"},{"$f":"IF(G214=0,\"\",L214/G214)","v":0},{"$f":"IF(G214=0,\"\",M214/G214)","v":0},{"$f":"N214","v":"Board-approved"},{"$f":"IF(T214=\"\",\"\",IF(I214=0,\"\",O214/I214))","v":0}]
[null,null,"Historical",2016,null,"Actual",2181680.5609999998,"",null,null,"Actual",null,null,"",null,null,"Actual",0,0,"",""]
[null,null,"Historical",2017,null,"Actual",2420339.3706,"",null,null,"Actual",null,null,"",null,null,"Actual",0,0,"",""]
[null,null,"Historical",2018,null,"Actual",2656334.2600975996,"",null,null,"Actual",null,null,"",null,null,"Actual",0,0,"",""]
[null,null,"Bridge Year (Forecast)",2019,null,"Forecast",2866748.6131230532,"",null,null,"Forecast",null,null,"",null,null,"Forecast",0,0,"",""]
[null,null,"Test Year (Forecast)",{"$f":"TestYear","v":2020},null,"Forecast",2874728.1407316583,"",null,null,"Forecast",null,null,"",null,null,"Forecast",0,0,"",""]
[null,null,null,null,null,null,null,null,{"$f":"SUM(I213:I218)","v":2152693.1267999997},null,null,null,null,null,{"$f":"SUM(O213:O218)","v":0},null,null,null,null,null,{"$f":"SUM(U213:U218)","v":0}]
[null,null,"Variance Analysis","Year",null,null,"Year-over-year",null,{"$f":"I200","v":"Test Year Versus Board-approved"},null,"Year","Year-over-year",null,null,{"$f":"I221","v":"Test Year Versus Board-approved"},null,"Year","Year-over-year",null,null,{"$f":"O221","v":"Test Year Versus Board-approved"}]
[null,null,null,{"$f":"D213","v":2014},null,null,null,null,null,null,{"$f":"D222","v":2014},null,null,null,null,null,{"$f":"K222","v":2014}]
[null,null,null,2015,null,null,{"$f":"IF(G213=0,\"\",G214/G213-1)","v":9.6393031391527106E-2},null,null,null,{"$f":"D223","v":2015},{"$f":"IF(L213=0,\"\",L214/L213-1)","v":""},"",null,null,null,{"$f":"K223","v":2015},{"$f":"IF(R213=\"\",\"\",IF(R213=0,\"\",R214/R213-1))","v":""},""]
[null,null,null,2016,null,null,7.0042785534615959E-2,null,null,null,2016,"","",null,null,null,2016,"",""]
[null,null,null,2017,null,null,0.10939218777775972,null,null,null,2017,"","",null,null,null,2017,"",""]
[null,null,null,2018,null,null,9.7504875706375227E-2,null,null,null,2018,"","",null,null,null,2018,"",""]
[null,null,null,2019,null,null,7.9212302527665424E-2,null,null,null,2019,{"$f":"IF(K218=\"Forecast\",\"\",IF(L217=0,\"\",L218/L217-1))","v":""},{"$f":"IF(M217=0,\"\",M218/M217-1)","v":""},null,null,null,2019,{"$f":"IF(Q218=\"Forecast\",\"\",IF(R217=0,\"\",R218/R217-1))","v":""},{"$f":"IF(S217=\"\",\"\",IF(S217=0,\"\",S218/S217-1))","v":""}]
[null,null,null,2020,null,null,2.7834765741501233E-3,null,{"$f":"IF(I220=0,\"\",G219/I220-1)","v":0.33541009860749216},null,2020,{"$f":"IF(K219=\"Forecast\",\"\",IF(L218=0,\"\",L219/L218-1))","v":""},{"$f":"IF(M218=0,\"\",M219/M218-1)","v":""},null,{"$f":"IF(O220=0,\"\",M219/O220-1)","v":""},null,2020,{"$f":"IF(Q219=\"Forecast\",\"\",IF(R218=0,\"\",R219/R218-1))","v":""},{"$f":"IF(S218=\"\",\"\",IF(S218=0,\"\",S219/S218-1))","v":""},null,{"$f":"IF(U220=0,\"\",S219/U220-1)","v":""}]
[null,null,null,"Geometric Mean",null,null,{"$f":"IF(G213=0,\"\",(G219/G213)^(1/($D219-$D213-1))-1)","v":9.1024757276484625E-2},null,{"$f":"IF(I220=0,\"\",(G219/I220)^(1/(TestYear-RebaseYear-1))-1)","v":7.4988118178999752E-2},null,"Geometric Mean",{"$f":"IF(L213=0,\"\",(L217/L213)^(1/($D217-$D213-1))-1)","v":""},{"$f":"IF(M213=0,\"\",(M219/M213)^(1/($D219-$D213-1))-1)","v":""},null,{"$f":"IF(O220=0,\"\",(M219/O220)^(1/(TestYear-RebaseYear-1))-1)","v":""},null,"Geometric Mean",{"$f":"IF(R213=\"\",\"\",IF(R213=0,\"\",(R217/R213)^(1/($D217-$D213-1))-1))","v":""},{"$f":"IF(S213=\"\",\"\",IF(S213=0,\"\",(S219/S213)^(1/($D219-$D213-1))-1))","v":""},null,{"$f":"IF(U220=0,\"\",(S219/U220)^(1/(TestYear-RebaseYear-1))-1)","v":""}]
[]
[null,5,"Customer Class:","Street Lighting",null,null,null,"Is the customer class billed on consumption (kWh) or demand (kW or kVA)?",null,null,null,null,null,"kWh"]
[]
[null,null,null,"Calendar Year",null,"Customers",null,null,null,null,"Consumption (kWh) (3)",null,null,null,null,null,{"$f":"CONCATENATE(\"Consumption (kWh) per \",LEFT(F233,LEN(F233)-1))","v":"Consumption (kWh) per Customer"}]
[null,null,null,{"$f":"CONCATENATE(\"(for \",TestYear,\" Cost of Service\")","v":"(for 2020 Cost of Service"},null,null,null,null,null,null,null,"Actual (Weather actual)","Weather-normalized",null,"Weather-normalized",null,null,{"$f":"L234","v":"Actual (Weather actual)"},{"$f":"M234","v":"Weather-normalized"},null,{"$f":"O234","v":"Weather-normalized"}]
[null,null,"Historical",{"$f":"D236-1","v":2014},null,{"$f":"F192","v":"Actual"},1018.5833333333334,{"$f":"IF(D235=RebaseYear,\"Board-approved\",\"\")","v":""},null,null,{"$f":"F235","v":"Actual"},777268.7,777268.7,{"$f":"H235","v":""},null,null,{"$f":"K235","v":"Actual"},{"$f":"IF(G235=0,\"\",L235/G235)","v":763.08798167389341},{"$f":"IF(G235=0,\"\",M235/G235)","v":763.08798167389341},{"$f":"N235","v":""},{"$f":"IF(T235=\"\",\"\",IF(I235=0,\"\",O235/I235))","v":""}]
[null,null,"Historical",2015,null,{"$f":"F193","v":"Actual"},1022.6666666666666,"Board-approved",null,null,{"$f":"F236","v":"Actual"},742696.3,742696.3,{"$f":"H236","v":"Board-approved"},804705,null,{"$f":"K236","v":"Actual"},{"$f":"IF(G236=0,\"\",L236/G236)","v":726.23497392438082},{"$f":"IF(G236=0,\"\",M236/G236)","v":726.23497392438082},{"$f":"N236","v":"Board-approved"},{"$f":"IF(T236=\"\",\"\",IF(I236=0,\"\",O236/I236))","v":""}]
[null,null,"Historical",2016,null,"Actual",1066.3333333333333,"",null,null,"Actual",584575.4,584575.4,"",null,null,"Actual",548.2107533604252,548.2107533604252,"",""]
[null,null,"Historical",2017,null,"Actual",1070,"",null,null,"Actual",582536.69999999995,582536.69999999995,"",null,null,"Actual",544.42682242990645,544.42682242990645,"",""]
[null,null,"Historical",2018,null,"Actual",1067.0833333333333,"",null,null,"Actual",568783.78491911688,568783.78491911688,"",null,null,"Actual",533.02658485196434,533.02658485196434,"",""]
[null,null,"Bridge Year",2019,null,"Forecast",1072.3304169663468,"",null,null,"Forecast",null,571580.61998845474,"",null,null,"Forecast",0,533.02658485196434,"",""]
[null,null,"Test Year",{"$f":"TestYear","v":2020},null,"Forecast",1127.6033016645551,"",null,null,"Forecast",null,601042.53695405717,"",null,null,"Forecast",0,533.02658485196434,"",""]
[null,null,null,null,null,null,null,null,{"$f":"SUM(I235:I240)","v":0},null,null,null,null,null,{"$f":"SUM(O235:O240)","v":804705},null,null,null,null,null,{"$f":"SUM(U235:U240)","v":0}]
[null,null,"Variance Analysis","Year",null,null,"Year-over-year",null,"Test Year Versus Board-approved",null,"Year","Year-over-year",null,null,{"$f":"I243","v":"Test Year Versus Board-approved"},null,"Year","Year-over-year",null,null,{"$f":"O243","v":"Test Year Versus Board-approved"}]
[null,null,null,{"$f":"D235","v":2014},null,null,null,null,null,null,{"$f":"D244","v":2014},null,null,null,null,null,{"$f":"K244","v":2014}]
[null,null,null,2015,null,null,{"$f":"IF(G235=0,\"\",G236/G235-1)","v":4.0088358013579128E-3},null,null,null,{"$f":"D245","v":2015},{"$f":"IF(L235=0,\"\",L236/L235-1)","v":-4.447934157132527E-2},-4.447934157132527E-2,null,null,null,{"$f":"K245","v":2015},{"$f":"IF(R235=\"\",\"\",IF(R235=0,\"\",R236/R235-1))","v":-4.8294572361987198E-2},-4.8294572361987198E-2]
[null,null,null,2016,null,null,4.2698826597131756E-2,null,null,null,2016,-0.21290115488659367,-0.21290115488659367,null,null,null,2016,-0.24513308633700193,-0.24513308633700193]
[null,null,null,2017,null,null,3.4385745545484347E-3,null,null,null,2017,-3.4874885258601163E-3,-3.4874885258601163E-3,null,null,null,2017,-6.9023289078589123E-3,-6.9023289078589123E-3]
[null,null,null,2018,null,null,-2.7258566978194398E-3,null,null,null,2018,-2.3608667197934641E-2,-2.3608667197934641E-2,null,null,null,2018,-2.0939889638537879E-2,-2.0939889638537879E-2]
[null,null,null,2019,null,null,4.9172201168419249E-3,null,null,null,2019,{"$f":"IF(K240=\"Forecast\",\"\",IF(L239=0,\"\",L240/L239-1))","v":""},{"$f":"IF(M239=0,\"\",M240/M239-1)","v":4.917220116842147E-3},null,null,null,2019,{"$f":"IF(Q240=\"Forecast\",\"\",IF(R239=0,\"\",R240/R239-1))","v":""},{"$f":"IF(S239=\"\",\"\",IF(S239=0,\"\",S240/S239-1))","v":0}]
[null,null,null,2020,null,null,5.1544639435461503E-2,null,{"$f":"IF(I242=0,\"\",G241/I242-1)","v":""},null,2020,{"$f":"IF(K241=\"Forecast\",\"\",IF(L240=0,\"\",L241/L240-1))","v":""},{"$f":"IF(M240=0,\"\",M241/M240-1)","v":5.1544639435461503E-2},null,{"$f":"IF(O242=0,\"\",M241/O242-1)","v":-0.25308959562316979},null,2020,{"$f":"IF(Q241=\"Forecast\",\"\",IF(R240=0,\"\",R241/R240-1))","v":""},{"$f":"IF(S240=\"\",\"\",IF(S240=0,\"\",S241/S240-1))","v":0},null,{"$f":"IF(U242=0,\"\",S241/U242-1)","v":""}]
[null,null,null,"Geometric Mean",null,null,{"$f":"IF(G235=0,\"\",(G241/G235)^(1/($D241-$D235-1))-1)","v":2.0544519049445986E-2},null,{"$f":"IF(I242=0,\"\",(G241/I242)^(1/(TestYear-RebaseYear-1))-1)","v":""},null,"Geometric Mean",{"$f":"IF(L235=0,\"\",(L239/L235)^(1/($D239-$D235-1))-1)","v":-9.8860536378243435E-2},{"$f":"IF(M235=0,\"\",(M241/M235)^(1/($D241-$D235-1))-1)","v":-5.0124237986993836E-2},null,{"$f":"IF(O242=0,\"\",(M241/O242)^(1/(TestYear-RebaseYear-1))-1)","v":-7.0355022562741065E-2},null,"Geometric Mean",{"$f":"IF(R235=\"\",\"\",IF(R235=0,\"\",(R239/R235)^(1/($D239-$D235-1))-1))","v":-0.11272532575662331},{"$f":"IF(S235=\"\",\"\",IF(S235=0,\"\",(S241/S235)^(1/($D241-$D235-1))-1))","v":-6.9246128627746706E-2},null,{"$f":"IF(U242=0,\"\",(S241/U242)^(1/(TestYear-RebaseYear-1))-1)","v":""}]
[]
[]
[null,null,null,"Calendar Year",null,"Revenues",null,null,null,null,{"$f":"IF(ISBLANK(N231),\"\",CONCATENATE(\"Demand (\",N231,\")\"))","v":"Demand (kWh)"},null,null,null,null,null,{"$f":"CONCATENATE(\"Demand (\",N231,\") per \",LEFT(F233,LEN(F233)-1))","v":"Demand (kWh) per Customer"}]
[null,null,null,{"$f":"CONCATENATE(\"(for \",TestYear,\" Cost of Service\")","v":"(for 2020 Cost of Service"},null,null,null,null,null,null,null,"Actual (Weather actual)","Weather-normalized",null,{"$f":"M255","v":"Weather-normalized"},null,null,{"$f":"L255","v":"Actual (Weather actual)"},{"$f":"M255","v":"Weather-normalized"},null,{"$f":"O255","v":"Weather-normalized"}]
[null,null,"Historical",{"$f":"D257-1","v":2014},null,{"$f":"F235","v":"Actual"},134709.26772999999,{"$f":"IF(D256=RebaseYear,\"Board-approved\",\"\")","v":""},null,null,{"$f":"K235","v":"Actual"},2227,2227,{"$f":"N235","v":""},null,null,{"$f":"K256","v":"Actual"},{"$f":"IF(G256=0,\"\",L256/G256)","v":1.653189893707694E-2},{"$f":"IF(G256=0,\"\",M256/G256)","v":1.653189893707694E-2},{"$f":"N256","v":""},{"$f":"IF(T256=\"\",\"\",IF(I256=0,\"\",O256/I256))","v":""}]
[null,null,"Historical",2015,null,"Actual",144733.63621000003,"Board-approved",155628.97349999999,null,"Actual",2128,2128,"Board-approved",null,null,{"$f":"K257","v":"Actual"},{"$f":"IF(G257=0,\"\",L257/G257)","v":1.4702871120520987E-2},{"$f":"IF(G257=0,\"\",M257/G257)","v":1.4702871120520987E-2},{"$f":"N257","v":"Board-approved"},{"$f":"IF(T257=\"\",\"\",IF(I257=0,\"\",O257/I257))","v":0}]
[null,null,"Historical",2016,null,"Actual",143648.75656000001,"",null,null,"Actual",1623,1623,"",null,null,"Actual",1.1298392265039179E-2,1.1298392265039179E-2,"",""]
[null,null,"Historical",2017,null,"Actual",158229.47129999998,"",null,null,"Actual",1619,1619,"",null,null,"Actual",1.0231975034097205E-2,1.0231975034097205E-2,"",""]
[null,null,"Historical",2018,null,"Actual",199870.46926905564,"",null,null,"Actual",1580.78,1580.78,"",null,null,"Actual",7.9090223072025359E-3,7.9090223072025359E-3,"",""]
[null,null,"Bridge Year (Forecast)",2019,null,"Forecast",215572.51347355067,"",null,null,"Forecast",null,1581,"",null,null,"Forecast",0,7.3339591143839322E-3,"",""]
[null,null,"Test Year (Forecast)",{"$f":"TestYear","v":2020},null,"Forecast",202404.12764592434,"",null,null,"Forecast",null,1655,"",null,null,"Forecast",0,8.1767107185441116E-3,"",""]
[null,null,null,null,null,null,null,null,{"$f":"SUM(I256:I261)","v":155628.97349999999},null,null,null,null,null,{"$f":"SUM(O256:O261)","v":0},null,null,null,null,null,{"$f":"SUM(U256:U261)","v":0}]
[null,null,"Variance Analysis","Year",null,null,"Year-over-year",null,{"$f":"I243","v":"Test Year Versus Board-approved"},null,"Year","Year-over-year",null,null,{"$f":"I264","v":"Test Year Versus Board-approved"},null,"Year","Year-over-year",null,null,{"$f":"O264","v":"Test Year Versus Board-approved"}]
[null,null,null,{"$f":"D256","v":2014},null,null,null,null,null,null,{"$f":"D265","v":2014},null,null,null,null,null,{"$f":"K265","v":2014}]
[null,null,null,2015,null,null,{"$f":"IF(G256=0,\"\",G257/G256-1)","v":7.4414839074710359E-2},null,null,null,{"$f":"D266","v":2015},{"$f":"IF(L256=0,\"\",L257/L256-1)","v":-4.445442299057023E-2},-4.445442299057023E-2,null,null,null,{"$f":"K266","v":2015},{"$f":"IF(R256=\"\",\"\",IF(R256=0,\"\",R257/R256-1))","v":-0.11063628101753631},-0.11063628101753631]
[null,null,null,2016,null,null,-7.4956981556514313E-3,null,null,null,2016,-0.23731203007518797,-0.23731203007518797,null,null,null,2016,-0.23155197563625052,-0.23155197563625052]
[null,null,null,2017,null,null,0.10150254752751597,null,null,null,2017,-2.4645717806530687E-3,-2.4645717806530687E-3,null,null,null,2017,-9.4386635365972249E-2,-9.4386635365972249E-2]
[null,null,null,2018,null,null,0.26316840742079672,null,null,null,2018,-2.3607164916615186E-2,-2.3607164916615186E-2,null,null,null,2018,-0.22702877197741611,-0.22702877197741611]
[null,null,null,2019,null,null,7.8561101406920297E-2,null,null,null,2019,{"$f":"IF(K261=\"Forecast\",\"\",IF(L260=0,\"\",L261/L260-1))","v":""},{"$f":"IF(M260=0,\"\",M261/M260-1)","v":1.3917180126266082E-4},null,null,null,2019,{"$f":"IF(Q261=\"Forecast\",\"\",IF(R260=0,\"\",R261/R260-1))","v":""},{"$f":"IF(S260=\"\",\"\",IF(S260=0,\"\",S261/S260-1))","v":-7.2709769992039264E-2}]
[null,null,null,2020,null,null,-6.1085644062140676E-2,null,{"$f":"IF(I263=0,\"\",G262/I263-1)","v":0.30055556554785312},null,2020,{"$f":"IF(K262=\"Forecast\",\"\",IF(L261=0,\"\",L262/L261-1))","v":""},{"$f":"IF(M261=0,\"\",M262/M261-1)","v":4.6805819101834345E-2},null,{"$f":"IF(O263=0,\"\",M262/O263-1)","v":""},null,2020,{"$f":"IF(Q262=\"Forecast\",\"\",IF(R261=0,\"\",R262/R261-1))","v":""},{"$f":"IF(S261=\"\",\"\",IF(S261=0,\"\",S262/S261-1))","v":0.1149108675159245},null,{"$f":"IF(U263=0,\"\",S262/U263-1)","v":""}]
[null,null,null,"Geometric Mean",null,null,{"$f":"IF(G256=0,\"\",(G262/G256)^(1/($D262-$D256-1))-1)","v":8.4836722380863039E-2},null,{"$f":"IF(I263=0,\"\",(G262/I263)^(1/(TestYear-RebaseYear-1))-1)","v":6.7904036271382306E-2},null,"Geometric Mean",{"$f":"IF(L256=0,\"\",(L260/L256)^(1/($D260-$D256-1))-1)","v":-0.10796121290328797},{"$f":"IF(M256=0,\"\",(M262/M256)^(1/($D262-$D256-1))-1)","v":-5.7642793228067757E-2},null,{"$f":"IF(O263=0,\"\",(M262/O263)^(1/(TestYear-RebaseYear-1))-1)","v":""},null,"Geometric Mean",{"$f":"IF(R256=\"\",\"\",IF(R256=0,\"\",(R260/R256)^(1/($D260-$D256-1))-1))","v":-0.21789207554555345},{"$f":"IF(S256=\"\",\"\",IF(S256=0,\"\",(S262/S256)^(1/($D262-$D256-1))-1))","v":-0.13133729036774733},null,{"$f":"IF(U263=0,\"\",(S262/U263)^(1/(TestYear-RebaseYear-1))-1)","v":""}]
[]
[null,{"$f":"B231+1","v":6},"Customer Class:",null,null,null,null,"Is the customer class billed on consumption (kWh) or demand (kW or kVA)?"]
[]
[null,null,null,"Calendar Year",null,"Customers",null,null,null,null,"Consumption (kWh) (3)",null,null,null,null,null,{"$f":"CONCATENATE(\"Consumption (kWh) per \",LEFT(F276,LEN(F276)-1))","v":"Consumption (kWh) per Customer"}]
[null,null,null,{"$f":"CONCATENATE(\"(for \",TestYear,\" Cost of Service\")","v":"(for 2020 Cost of Service"},null,null,null,null,null,null,null,"Actual (Weather actual)","Weather-normalized",null,"Weather-normalized",null,null,{"$f":"L277","v":"Actual (Weather actual)"},{"$f":"M277","v":"Weather-normalized"},null,{"$f":"O277","v":"Weather-normalized"}]
[null,null,"Historical",{"$f":"D279-1","v":2014},null,{"$f":"F235","v":"Actual"},null,{"$f":"IF(D278=RebaseYear,\"Board-approved\",\"\")","v":""},null,null,{"$f":"F278","v":"Actual"},null,null,{"$f":"H278","v":""},null,null,{"$f":"K278","v":"Actual"},{"$f":"IF(G278=0,\"\",L278/G278)","v":""},{"$f":"IF(G278=0,\"\",M278/G278)","v":""},{"$f":"N278","v":""},{"$f":"IF(T278=\"\",\"\",IF(I278=0,\"\",O278/I278))","v":""}]
[null,null,"Historical",2015,null,{"$f":"F236","v":"Actual"},null,"Board-approved",null,null,{"$f":"F279","v":"Actual"},null,null,{"$f":"H279","v":"Board-approved"},null,null,{"$f":"K279","v":"Actual"},{"$f":"IF(G279=0,\"\",L279/G279)","v":""},{"$f":"IF(G279=0,\"\",M279/G279)","v":""},{"$f":"N279","v":"Board-approved"},{"$f":"IF(T279=\"\",\"\",IF(I279=0,\"\",O279/I279))","v":""}]
[null,null,"Historical",2016,null,"Actual",null,"",null,null,"Actual",null,null,"",null,null,"Actual","","","",""]
[null,null,"Historical",2017,null,"Actual",null,"",null,null,"Actual",null,null,"",null,null,"Actual","","","",""]
[null,null,"Historical",2018,null,"Actual",null,"",null,null,"Actual",null,null,"",null,null,"Actual","","","",""]
[null,null,"Bridge Year",2019,null,"Forecast",null,"",null,null,"Forecast",null,null,"",null,null,"Forecast","","","",""]
[null,null,"Test Year",{"$f":"TestYear","v":2020},null,"Forecast",null,"",null,null,"Forecast",null,null,"",null,null,"Forecast","","","",""]
[null,null,null,null,null,null,null,null,{"$f":"SUM(I278:I283)","v":0},null,null,null,null,null,{"$f":"SUM(O278:O283)","v":0},null,null,null,null,null,{"$f":"SUM(U278:U283)","v":0}]
[null,null,"Variance Analysis","Year",null,null,"Year-over-year",null,"Test Year Versus Board-approved",null,"Year","Year-over-year",null,null,{"$f":"I286","v":"Test Year Versus Board-approved"},null,"Year","Year-over-year",null,null,{"$f":"O286","v":"Test Year Versus Board-approved"}]
[null,null,null,{"$f":"D278","v":2014},null,null,null,null,null,null,{"$f":"D287","v":2014},null,null,null,null,null,{"$f":"K287","v":2014}]
[null,null,null,2015,null,null,{"$f":"IF(G278=0,\"\",G279/G278-1)","v":""},null,null,null,{"$f":"D288","v":2015},{"$f":"IF(L278=0,\"\",L279/L278-1)","v":""},"",null,null,null,{"$f":"K288","v":2015},{"$f":"IF(R278=\"\",\"\",IF(R278=0,\"\",R279/R278-1))","v":""},""]
[null,null,null,2016,null,null,"",null,null,null,2016,"","",null,null,null,2016,"",""]
[null,null,null,2017,null,null,"",null,null,null,2017,"","",null,null,null,2017,"",""]
[null,null,null,2018,null,null,"",null,null,null,2018,"","",null,null,null,2018,"",""]
[null,null,null,2019,null,null,"",null,null,null,2019,{"$f":"IF(K283=\"Forecast\",\"\",IF(L282=0,\"\",L283/L282-1))","v":""},{"$f":"IF(M282=0,\"\",M283/M282-1)","v":""},null,null,null,2019,{"$f":"IF(Q283=\"Forecast\",\"\",IF(R282=0,\"\",R283/R282-1))","v":""},{"$f":"IF(S282=\"\",\"\",IF(S282=0,\"\",S283/S282-1))","v":""}]
[null,null,null,2020,null,null,"",null,{"$f":"IF(I285=0,\"\",G284/I285-1)","v":""},null,2020,{"$f":"IF(K284=\"Forecast\",\"\",IF(L283=0,\"\",L284/L283-1))","v":""},{"$f":"IF(M283=0,\"\",M284/M283-1)","v":""},null,{"$f":"IF(O285=0,\"\",M284/O285-1)","v":""},null,2020,{"$f":"IF(Q284=\"Forecast\",\"\",IF(R283=0,\"\",R284/R283-1))","v":""},{"$f":"IF(S283=\"\",\"\",IF(S283=0,\"\",S284/S283-1))","v":""},null,{"$f":"IF(U285=0,\"\",S284/U285-1)","v":""}]
[null,null,null,"Geometric Mean",null,null,{"$f":"IF(G278=0,\"\",(G284/G278)^(1/($D284-$D278-1))-1)","v":""},null,{"$f":"IF(I285=0,\"\",(G284/I285)^(1/(TestYear-RebaseYear-1))-1)","v":""},null,"Geometric Mean",{"$f":"IF(L278=0,\"\",(L282/L278)^(1/($D282-$D278-1))-1)","v":""},{"$f":"IF(M278=0,\"\",(M284/M278)^(1/($D284-$D278-1))-1)","v":""},null,{"$f":"IF(O285=0,\"\",(M284/O285)^(1/(TestYear-RebaseYear-1))-1)","v":""},null,"Geometric Mean",{"$f":"IF(R278=\"\",\"\",IF(R278=0,\"\",(R282/R278)^(1/($D282-$D278-1))-1))","v":""},{"$f":"IF(S278=\"\",\"\",IF(S278=0,\"\",(S284/S278)^(1/($D284-$D278-1))-1))","v":""},null,{"$f":"IF(U285=0,\"\",(S284/U285)^(1/(TestYear-RebaseYear-1))-1)","v":""}]
[]
[]
[null,null,null,"Calendar Year",null,"Revenues",null,null,null,null,{"$f":"IF(ISBLANK(N274),\"\",CONCATENATE(\"Demand (\",N274,\")\"))","v":""},null,null,null,null,null,{"$f":"CONCATENATE(\"Demand (\",N274,\") per \",LEFT(F276,LEN(F276)-1))","v":"Demand () per Customer"}]
[null,null,null,{"$f":"CONCATENATE(\"(for \",TestYear,\" Cost of Service\")","v":"(for 2020 Cost of Service"},null,null,null,null,null,null,null,"Actual (Weather actual)","Weather-normalized",null,{"$f":"M298","v":"Weather-normalized"},null,null,{"$f":"L298","v":"Actual (Weather actual)"},{"$f":"M298","v":"Weather-normalized"},null,{"$f":"O298","v":"Weather-normalized"}]
[null,null,"Historical",{"$f":"D300-1","v":2014},null,{"$f":"F278","v":"Actual"},null,{"$f":"IF(D299=RebaseYear,\"Board-approved\",\"\")","v":""},null,null,{"$f":"K278","v":"Actual"},null,null,{"$f":"N278","v":""},null,null,{"$f":"K299","v":"Actual"},{"$f":"IF(G299=0,\"\",L299/G299)","v":""},{"$f":"IF(G299=0,\"\",M299/G299)","v":""},{"$f":"N299","v":""},{"$f":"IF(T299=\"\",\"\",IF(I299=0,\"\",O299/I299))","v":""}]
[null,null,"Historical",2015,null,"Actual",null,"Board-approved",null,null,"Actual",null,null,"Board-approved",null,null,{"$f":"K300","v":"Actual"},{"$f":"IF(G300=0,\"\",L300/G300)","v":""},{"$f":"IF(G300=0,\"\",M300/G300)","v":""},{"$f":"N300","v":"Board-approved"},{"$f":"IF(T300=\"\",\"\",IF(I300=0,\"\",O300/I300))","v":""}]
[null,null,"Historical",2016,null,"Actual",null,"",null,null,"Actual",null,null,"",null,null,"Actual","","","",""]
[null,null,"Historical",2017,null,"Actual",null,"",null,null,"Actual",null,null,"",null,null,"Actual","","","",""]
[null,null,"Historical",2018,null,"Actual",null,"",null,null,"Actual",null,null,"",null,null,"Actual","","","",""]
[null,null,"Bridge Year (Forecast)",2019,null,"Forecast",null,"",null,null,"Forecast",null,null,"",null,null,"Forecast","","","",""]
[null,null,"Test Year (Forecast)",{"$f":"TestYear","v":2020},null,"Forecast",null,"",null,null,"Forecast",null,null,"",null,null,"Forecast","","","",""]
[null,null,null,null,null,null,null,null,{"$f":"SUM(I299:I304)","v":0},null,null,null,null,null,{"$f":"SUM(O299:O304)","v":0},null,null,null,null,null,{"$f":"SUM(U299:U304)","v":0}]
[null,null,"Variance Analysis","Year",null,null,"Year-over-year",null,{"$f":"I286","v":"Test Year Versus Board-approved"},null,"Year","Year-over-year",null,null,{"$f":"I307","v":"Test Year Versus Board-approved"},null,"Year","Year-over-year",null,null,{"$f":"O307","v":"Test Year Versus Board-approved"}]
[null,null,null,{"$f":"D299","v":2014},null,null,null,null,null,null,{"$f":"D308","v":2014},null,null,null,null,null,{"$f":"K308","v":2014}]
[null,null,null,2015,null,null,{"$f":"IF(G299=0,\"\",G300/G299-1)","v":""},null,null,null,{"$f":"D309","v":2015},{"$f":"IF(L299=0,\"\",L300/L299-1)","v":""},"",null,null,null,{"$f":"K309","v":2015},{"$f":"IF(R299=\"\",\"\",IF(R299=0,\"\",R300/R299-1))","v":""},""]
[null,null,null,2016,null,null,"",null,null,null,2016,"","",null,null,null,2016,"",""]
[null,null,null,2017,null,null,"",null,null,null,2017,"","",null,null,null,2017,"",""]
[null,null,null,2018,null,null,"",null,null,null,2018,"","",null,null,null,2018,"",""]
[null,null,null,2019,null,null,"",null,null,null,2019,{"$f":"IF(K304=\"Forecast\",\"\",IF(L303=0,\"\",L304/L303-1))","v":""},{"$f":"IF(M303=0,\"\",M304/M303-1)","v":""},null,null,null,2019,{"$f":"IF(Q304=\"Forecast\",\"\",IF(R303=0,\"\",R304/R303-1))","v":""},{"$f":"IF(S303=\"\",\"\",IF(S303=0,\"\",S304/S303-1))","v":""}]
[null,null,null,2020,null,null,"",null,{"$f":"IF(I306=0,\"\",G305/I306-1)","v":""},null,2020,{"$f":"IF(K305=\"Forecast\",\"\",IF(L304=0,\"\",L305/L304-1))","v":""},{"$f":"IF(M304=0,\"\",M305/M304-1)","v":""},null,{"$f":"IF(O306=0,\"\",M305/O306-1)","v":""},null,2020,{"$f":"IF(Q305=\"Forecast\",\"\",IF(R304=0,\"\",R305/R304-1))","v":""},{"$f":"IF(S304=\"\",\"\",IF(S304=0,\"\",S305/S304-1))","v":""},null,{"$f":"IF(U306=0,\"\",S305/U306-1)","v":""}]
[null,null,null,"Geometric Mean",null,null,{"$f":"IF(G299=0,\"\",(G305/G299)^(1/($D305-$D299-1))-1)","v":""},null,{"$f":"IF(I306=0,\"\",(G305/I306)^(1/(TestYear-RebaseYear-1))-1)","v":""},null,"Geometric Mean",{"$f":"IF(L299=0,\"\",(L303/L299)^(1/($D303-$D299-1))-1)","v":""},{"$f":"IF(M299=0,\"\",(M305/M299)^(1/($D305-$D299-1))-1)","v":""},null,{"$f":"IF(O306=0,\"\",(M305/O306)^(1/(TestYear-RebaseYear-1))-1)","v":""},null,"Geometric Mean",{"$f":"IF(R299=\"\",\"\",IF(R299=0,\"\",(R303/R299)^(1/($D303-$D299-1))-1))","v":""},{"$f":"IF(S299=\"\",\"\",IF(S299=0,\"\",(S305/S299)^(1/($D305-$D299-1))-1))","v":""},null,{"$f":"IF(U306=0,\"\",(S305/U306)^(1/(TestYear-RebaseYear-1))-1)","v":""}]
[]
[null,{"$f":"B274+1","v":7},"Customer Class:",null,null,null,null,"Is the customer class billed on consumption (kWh) or demand (kW or kVA)?"]
[]
[null,null,null,"Calendar Year",null,"Customers",null,null,null,null,"Consumption (kWh) (3)",null,null,null,null,null,{"$f":"CONCATENATE(\"Consumption (kWh) per \",LEFT(F319,LEN(F319)-1))","v":"Consumption (kWh) per Customer"}]
[null,null,null,{"$f":"CONCATENATE(\"(for \",TestYear,\" Cost of Service\")","v":"(for 2020 Cost of Service"},null,null,null,null,null,null,null,"Actual (Weather actual)","Weather-normalized",null,"Weather-normalized",null,null,{"$f":"L320","v":"Actual (Weather actual)"},{"$f":"M320","v":"Weather-normalized"},null,{"$f":"O320","v":"Weather-normalized"}]
[null,null,"Historical",{"$f":"D322-1","v":2014},null,{"$f":"F278","v":"Actual"},null,{"$f":"IF(D321=RebaseYear,\"Board-approved\",\"\")","v":""},null,null,{"$f":"F321","v":"Actual"},null,null,{"$f":"H321","v":""},null,null,{"$f":"K321","v":"Actual"},{"$f":"IF(G321=0,\"\",L321/G321)","v":""},{"$f":"IF(G321=0,\"\",M321/G321)","v":""},{"$f":"N321","v":""},{"$f":"IF(T321=\"\",\"\",IF(I321=0,\"\",O321/I321))","v":""}]
[null,null,"Historical",2015,null,{"$f":"F279","v":"Actual"},null,"Board-approved",null,null,{"$f":"F322","v":"Actual"},null,null,{"$f":"H322","v":"Board-approved"},null,null,{"$f":"K322","v":"Actual"},{"$f":"IF(G322=0,\"\",L322/G322)","v":""},{"$f":"IF(G322=0,\"\",M322/G322)","v":""},{"$f":"N322","v":"Board-approved"},{"$f":"IF(T322=\"\",\"\",IF(I322=0,\"\",O322/I322))","v":""}]
[null,null,"Historical",2016,null,"Actual",null,"",null,null,"Actual",null,null,"",null,null,"Actual","","","",""]
[null,null,"Historical",2017,null,"Actual",null,"",null,null,"Actual",null,null,"",null,null,"Actual","","","",""]
[null,null,"Historical",2018,null,"Actual",null,"",null,null,"Actual",null,null,"",null,null,"Actual","","","",""]
[null,null,"Bridge Year",2019,null,"Forecast",null,"",null,null,"Forecast",null,null,"",null,null,"Forecast","","","",""]
[null,null,"Test Year",{"$f":"TestYear","v":2020},null,"Forecast",null,"",null,null,"Forecast",null,null,"",null,null,"Forecast","","","",""]
[null,null,null,null,null,null,null,null,{"$f":"SUM(I321:I326)","v":0},null,null,null,null,null,{"$f":"SUM(O321:O326)","v":0},null,null,null,null,null,{"$f":"SUM(U321:U326)","v":0}]
[null,null,"Variance Analysis","Year",null,null,"Year-over-year",null,"Test Year Versus Board-approved",null,"Year","Year-over-year",null,null,{"$f":"I329","v":"Test Year Versus Board-approved"},null,"Year","Year-over-year",null,null,{"$f":"O329","v":"Test Year Versus Board-approved"}]
[null,null,null,{"$f":"D321","v":2014},null,null,null,null,null,null,{"$f":"D330","v":2014},null,null,null,null,null,{"$f":"K330","v":2014}]
[null,null,null,2015,null,null,{"$f":"IF(G321=0,\"\",G322/G321-1)","v":""},null,null,null,{"$f":"D331","v":2015},{"$f":"IF(L321=0,\"\",L322/L321-1)","v":""},"",null,null,null,{"$f":"K331","v":2015},{"$f":"IF(R321=\"\",\"\",IF(R321=0,\"\",R322/R321-1))","v":""},""]
[null,null,null,2016,null,null,"",null,null,null,2016,"","",null,null,null,2016,"",""]
[null,null,null,2017,null,null,"",null,null,null,2017,"","",null,null,null,2017,"",""]
[null,null,null,2018,null,null,"",null,null,null,2018,"","",null,null,null,2018,"",""]
[null,null,null,2019,null,null,"",null,null,null,2019,{"$f":"IF(K326=\"Forecast\",\"\",IF(L325=0,\"\",L326/L325-1))","v":""},{"$f":"IF(M325=0,\"\",M326/M325-1)","v":""},null,null,null,2019,{"$f":"IF(Q326=\"Forecast\",\"\",IF(R325=0,\"\",R326/R325-1))","v":""},{"$f":"IF(S325=\"\",\"\",IF(S325=0,\"\",S326/S325-1))","v":""}]
[null,null,null,2020,null,null,"",null,{"$f":"IF(I328=0,\"\",G327/I328-1)","v":""},null,2020,{"$f":"IF(K327=\"Forecast\",\"\",IF(L326=0,\"\",L327/L326-1))","v":""},{"$f":"IF(M326=0,\"\",M327/M326-1)","v":""},null,{"$f":"IF(O328=0,\"\",M327/O328-1)","v":""},null,2020,{"$f":"IF(Q327=\"Forecast\",\"\",IF(R326=0,\"\",R327/R326-1))","v":""},{"$f":"IF(S326=\"\",\"\",IF(S326=0,\"\",S327/S326-1))","v":""},null,{"$f":"IF(U328=0,\"\",S327/U328-1)","v":""}]
[null,null,null,"Geometric Mean",null,null,{"$f":"IF(G321=0,\"\",(G327/G321)^(1/($D327-$D321-1))-1)","v":""},null,{"$f":"IF(I328=0,\"\",(G327/I328)^(1/(TestYear-RebaseYear-1))-1)","v":""},null,"Geometric Mean",{"$f":"IF(L321=0,\"\",(L325/L321)^(1/($D325-$D321-1))-1)","v":""},{"$f":"IF(M321=0,\"\",(M327/M321)^(1/($D327-$D321-1))-1)","v":""},null,{"$f":"IF(O328=0,\"\",(M327/O328)^(1/(TestYear-RebaseYear-1))-1)","v":""},null,"Geometric Mean",{"$f":"IF(R321=\"\",\"\",IF(R321=0,\"\",(R325/R321)^(1/($D325-$D321-1))-1))","v":""},{"$f":"IF(S321=\"\",\"\",IF(S321=0,\"\",(S327/S321)^(1/($D327-$D321-1))-1))","v":""},null,{"$f":"IF(U328=0,\"\",(S327/U328)^(1/(TestYear-RebaseYear-1))-1)","v":""}]
[]
[]
[null,null,null,"Calendar Year",null,"Revenues",null,null,null,null,{"$f":"IF(ISBLANK(N317),\"\",CONCATENATE(\"Demand (\",N317,\")\"))","v":""},null,null,null,null,null,{"$f":"CONCATENATE(\"Demand (\",N317,\") per \",LEFT(F319,LEN(F319)-1))","v":"Demand () per Customer"}]
[null,null,null,{"$f":"CONCATENATE(\"(for \",TestYear,\" Cost of Service\")","v":"(for 2020 Cost of Service"},null,null,null,null,null,null,null,"Actual (Weather actual)","Weather-normalized",null,{"$f":"M341","v":"Weather-normalized"},null,null,{"$f":"L341","v":"Actual (Weather actual)"},{"$f":"M341","v":"Weather-normalized"},null,{"$f":"O341","v":"Weather-normalized"}]
[null,null,"Historical",{"$f":"D343-1","v":2014},null,{"$f":"F321","v":"Actual"},null,{"$f":"IF(D342=RebaseYear,\"Board-approved\",\"\")","v":""},null,null,{"$f":"K321","v":"Actual"},null,null,{"$f":"N321","v":""},null,null,{"$f":"K342","v":"Actual"},{"$f":"IF(G342=0,\"\",L342/G342)","v":""},{"$f":"IF(G342=0,\"\",M342/G342)","v":""},{"$f":"N342","v":""},{"$f":"IF(T342=\"\",\"\",IF(I342=0,\"\",O342/I342))","v":""}]
[null,null,"Historical",2015,null,"Actual",null,"Board-approved",null,null,"Actual",null,null,"Board-approved",null,null,{"$f":"K343","v":"Actual"},{"$f":"IF(G343=0,\"\",L343/G343)","v":""},{"$f":"IF(G343=0,\"\",M343/G343)","v":""},{"$f":"N343","v":"Board-approved"},{"$f":"IF(T343=\"\",\"\",IF(I343=0,\"\",O343/I343))","v":""}]
[null,null,"Historical",2016,null,"Actual",null,"",null,null,"Actual",null,null,"",null,null,"Actual","","","",""]
[null,null,"Historical",2017,null,"Actual",null,"",null,null,"Actual",null,null,"",null,null,"Actual","","","",""]
[null,null,"Historical",2018,null,"Actual",null,"",null,null,"Actual",null,null,"",null,null,"Actual","","","",""]
[null,null,"Bridge Year (Forecast)",2019,null,"Forecast",null,"",null,null,"Forecast",null,null,"",null,null,"Forecast","","","",""]
[null,null,"Test Year (Forecast)",{"$f":"TestYear","v":2020},null,"Forecast",null,"",null,null,"Forecast",null,null,"",null,null,"Forecast","","","",""]
[null,null,null,null,null,null,null,null,{"$f":"SUM(I342:I347)","v":0},null,null,null,null,null,{"$f":"SUM(O342:O347)","v":0},null,null,null,null,null,{"$f":"SUM(U342:U347)","v":0}]
[null,null,"Variance Analysis","Year",null,null,"Year-over-year",null,{"$f":"I329","v":"Test Year Versus Board-approved"},null,"Year","Year-over-year",null,null,{"$f":"I350","v":"Test Year Versus Board-approved"},null,"Year","Year-over-year",null,null,{"$f":"O350","v":"Test Year Versus Board-approved"}]
[null,null,null,{"$f":"D342","v":2014},null,null,null,null,null,null,{"$f":"D351","v":2014},null,null,null,null,null,{"$f":"K351","v":2014}]
[null,null,null,2015,null,null,{"$f":"IF(G342=0,\"\",G343/G342-1)","v":""},null,null,null,{"$f":"D352","v":2015},{"$f":"IF(L342=0,\"\",L343/L342-1)","v":""},"",null,null,null,{"$f":"K352","v":2015},{"$f":"IF(R342=\"\",\"\",IF(R342=0,\"\",R343/R342-1))","v":""},""]
[null,null,null,2016,null,null,"",null,null,null,2016,"","",null,null,null,2016,"",""]
[null,null,null,2017,null,null,"",null,null,null,2017,"","",null,null,null,2017,"",""]
[null,null,null,2018,null,null,"",null,null,null,2018,"","",null,null,null,2018,"",""]
[null,null,null,2019,null,null,"",null,null,null,2019,{"$f":"IF(K347=\"Forecast\",\"\",IF(L346=0,\"\",L347/L346-1))","v":""},{"$f":"IF(M346=0,\"\",M347/M346-1)","v":""},null,null,null,2019,{"$f":"IF(Q347=\"Forecast\",\"\",IF(R346=0,\"\",R347/R346-1))","v":""},{"$f":"IF(S346=\"\",\"\",IF(S346=0,\"\",S347/S346-1))","v":""}]
[null,null,null,2020,null,null,"",null,{"$f":"IF(I349=0,\"\",G348/I349-1)","v":""},null,2020,{"$f":"IF(K348=\"Forecast\",\"\",IF(L347=0,\"\",L348/L347-1))","v":""},{"$f":"IF(M347=0,\"\",M348/M347-1)","v":""},null,{"$f":"IF(O349=0,\"\",M348/O349-1)","v":""},null,2020,{"$f":"IF(Q348=\"Forecast\",\"\",IF(R347=0,\"\",R348/R347-1))","v":""},{"$f":"IF(S347=\"\",\"\",IF(S347=0,\"\",S348/S347-1))","v":""},null,{"$f":"IF(U349=0,\"\",S348/U349-1)","v":""}]
[null,null,null,"Geometric Mean",null,null,{"$f":"IF(G342=0,\"\",(G348/G342)^(1/($D348-$D342-1))-1)","v":""},null,{"$f":"IF(I349=0,\"\",(G348/I349)^(1/(TestYear-RebaseYear-1))-1)","v":""},null,"Geometric Mean",{"$f":"IF(L342=0,\"\",(L346/L342)^(1/($D346-$D342-1))-1)","v":""},{"$f":"IF(M342=0,\"\",(M348/M342)^(1/($D348-$D342-1))-1)","v":""},null,{"$f":"IF(O349=0,\"\",(M348/O349)^(1/(TestYear-RebaseYear-1))-1)","v":""},null,"Geometric Mean",{"$f":"IF(R342=\"\",\"\",IF(R342=0,\"\",(R346/R342)^(1/($D346-$D342-1))-1))","v":""},{"$f":"IF(S342=\"\",\"\",IF(S342=0,\"\",(S348/S342)^(1/($D348-$D342-1))-1))","v":""},null,{"$f":"IF(U349=0,\"\",(S348/U349)^(1/(TestYear-RebaseYear-1))-1)","v":""}]
[]
[null,{"$f":"B317+1","v":8},"Customer Class:",null,null,null,null,"Is the customer class billed on consumption (kWh) or demand (kW or kVA)?"]
[]
[null,null,null,"Calendar Year",null,"Customers",null,null,null,null,"Consumption (kWh) (3)",null,null,null,null,null,{"$f":"CONCATENATE(\"Consumption (kWh) per \",LEFT(F362,LEN(F362)-1))","v":"Consumption (kWh) per Customer"}]
[null,null,null,{"$f":"CONCATENATE(\"(for \",TestYear,\" Cost of Service\")","v":"(for 2020 Cost of Service"},null,null,null,null,null,null,null,"Actual (Weather actual)","Weather-normalized",null,"Weather-normalized",null,null,{"$f":"L363","v":"Actual (Weather actual)"},{"$f":"M363","v":"Weather-normalized"},null,{"$f":"O363","v":"Weather-normalized"}]
[null,null,"Historical",{"$f":"D365-1","v":2014},null,{"$f":"F321","v":"Actual"},null,{"$f":"IF(D364=RebaseYear,\"Board-approved\",\"\")","v":""},null,null,{"$f":"F364","v":"Actual"},null,null,{"$f":"H364","v":""},null,null,{"$f":"K364","v":"Actual"},{"$f":"IF(G364=0,\"\",L364/G364)","v":""},{"$f":"IF(G364=0,\"\",M364/G364)","v":""},{"$f":"N364","v":""},{"$f":"IF(T364=\"\",\"\",IF(I364=0,\"\",O364/I364))","v":""}]
[null,null,"Historical",2015,null,{"$f":"F322","v":"Actual"},null,"Board-approved",null,null,{"$f":"F365","v":"Actual"},null,null,{"$f":"H365","v":"Board-approved"},null,null,{"$f":"K365","v":"Actual"},{"$f":"IF(G365=0,\"\",L365/G365)","v":""},{"$f":"IF(G365=0,\"\",M365/G365)","v":""},{"$f":"N365","v":"Board-approved"},{"$f":"IF(T365=\"\",\"\",IF(I365=0,\"\",O365/I365))","v":""}]
[null,null,"Historical",2016,null,"Actual",null,"",null,null,"Actual",null,null,"",null,null,"Actual","","","",""]
[null,null,"Historical",2017,null,"Actual",null,"",null,null,"Actual",null,null,"",null,null,"Actual","","","",""]
[null,null,"Historical",2018,null,"Actual",null,"",null,null,"Actual",null,null,"",null,null,"Actual","","","",""]
[null,null,"Bridge Year",2019,null,"Forecast",null,"",null,null,"Forecast",null,null,"",null,null,"Forecast","","","",""]
[null,null,"Test Year",{"$f":"TestYear","v":2020},null,"Forecast",null,"",null,null,"Forecast",null,null,"",null,null,"Forecast","","","",""]
[null,null,null,null,null,null,null,null,{"$f":"SUM(I364:I369)","v":0},null,null,null,null,null,{"$f":"SUM(O364:O369)","v":0},null,null,null,null,null,{"$f":"SUM(U364:U369)","v":0}]
[null,null,"Variance Analysis","Year",null,null,"Year-over-year",null,"Test Year Versus Board-approved",null,"Year","Year-over-year",null,null,{"$f":"I372","v":"Test Year Versus Board-approved"},null,"Year","Year-over-year",null,null,{"$f":"O372","v":"Test Year Versus Board-approved"}]
[null,null,null,{"$f":"D364","v":2014},null,null,null,null,null,null,{"$f":"D373","v":2014},null,null,null,null,null,{"$f":"K373","v":2014}]
[null,null,null,2015,null,null,{"$f":"IF(G364=0,\"\",G365/G364-1)","v":""},null,null,null,{"$f":"D374","v":2015},{"$f":"IF(L364=0,\"\",L365/L364-1)","v":""},"",null,null,null,{"$f":"K374","v":2015},{"$f":"IF(R364=\"\",\"\",IF(R364=0,\"\",R365/R364-1))","v":""},""]
[null,null,null,2016,null,null,"",null,null,null,2016,"","",null,null,null,2016,"",""]
[null,null,null,2017,null,null,"",null,null,null,2017,"","",null,null,null,2017,"",""]
[null,null,null,2018,null,null,"",null,null,null,2018,"","",null,null,null,2018,"",""]
[null,null,null,2019,null,null,"",null,null,null,2019,{"$f":"IF(K369=\"Forecast\",\"\",IF(L368=0,\"\",L369/L368-1))","v":""},{"$f":"IF(M368=0,\"\",M369/M368-1)","v":""},null,null,null,2019,{"$f":"IF(Q369=\"Forecast\",\"\",IF(R368=0,\"\",R369/R368-1))","v":""},{"$f":"IF(S368=\"\",\"\",IF(S368=0,\"\",S369/S368-1))","v":""}]
[null,null,null,2020,null,null,"",null,{"$f":"IF(I371=0,\"\",G370/I371-1)","v":""},null,2020,{"$f":"IF(K370=\"Forecast\",\"\",IF(L369=0,\"\",L370/L369-1))","v":""},{"$f":"IF(M369=0,\"\",M370/M369-1)","v":""},null,{"$f":"IF(O371=0,\"\",M370/O371-1)","v":""},null,2020,{"$f":"IF(Q370=\"Forecast\",\"\",IF(R369=0,\"\",R370/R369-1))","v":""},{"$f":"IF(S369=\"\",\"\",IF(S369=0,\"\",S370/S369-1))","v":""},null,{"$f":"IF(U371=0,\"\",S370/U371-1)","v":""}]
[null,null,null,"Geometric Mean",null,null,{"$f":"IF(G364=0,\"\",(G370/G364)^(1/($D370-$D364-1))-1)","v":""},null,{"$f":"IF(I371=0,\"\",(G370/I371)^(1/(TestYear-RebaseYear-1))-1)","v":""},null,"Geometric Mean",{"$f":"IF(L364=0,\"\",(L368/L364)^(1/($D368-$D364-1))-1)","v":""},{"$f":"IF(M364=0,\"\",(M370/M364)^(1/($D370-$D364-1))-1)","v":""},null,{"$f":"IF(O371=0,\"\",(M370/O371)^(1/(TestYear-RebaseYear-1))-1)","v":""},null,"Geometric Mean",{"$f":"IF(R364=\"\",\"\",IF(R364=0,\"\",(R368/R364)^(1/($D368-$D364-1))-1))","v":""},{"$f":"IF(S364=\"\",\"\",IF(S364=0,\"\",(S370/S364)^(1/($D370-$D364-1))-1))","v":""},null,{"$f":"IF(U371=0,\"\",(S370/U371)^(1/(TestYear-RebaseYear-1))-1)","v":""}]
[]
[]
[null,null,null,"Calendar Year",null,"Revenues",null,null,null,null,{"$f":"IF(ISBLANK(N360),\"\",CONCATENATE(\"Demand (\",N360,\")\"))","v":""},null,null,null,null,null,{"$f":"CONCATENATE(\"Demand (\",N360,\") per \",LEFT(F362,LEN(F362)-1))","v":"Demand () per Customer"}]
[null,null,null,{"$f":"CONCATENATE(\"(for \",TestYear,\" Cost of Service\")","v":"(for 2020 Cost of Service"},null,null,null,null,null,null,null,"Actual (Weather actual)","Weather-normalized",null,{"$f":"M384","v":"Weather-normalized"},null,null,{"$f":"L384","v":"Actual (Weather actual)"},{"$f":"M384","v":"Weather-normalized"},null,{"$f":"O384","v":"Weather-normalized"}]
[null,null,"Historical",{"$f":"D386-1","v":2014},null,{"$f":"F364","v":"Actual"},null,{"$f":"IF(D385=RebaseYear,\"Board-approved\",\"\")","v":""},null,null,{"$f":"K364","v":"Actual"},null,null,{"$f":"N364","v":""},null,null,{"$f":"K385","v":"Actual"},{"$f":"IF(G385=0,\"\",L385/G385)","v":""},{"$f":"IF(G385=0,\"\",M385/G385)","v":""},{"$f":"N385","v":""},{"$f":"IF(T385=\"\",\"\",IF(I385=0,\"\",O385/I385))","v":""}]
[null,null,"Historical",2015,null,"Actual",null,"Board-approved",null,null,"Actual",null,null,"Board-approved",null,null,{"$f":"K386","v":"Actual"},{"$f":"IF(G386=0,\"\",L386/G386)","v":""},{"$f":"IF(G386=0,\"\",M386/G386)","v":""},{"$f":"N386","v":"Board-approved"},{"$f":"IF(T386=\"\",\"\",IF(I386=0,\"\",O386/I386))","v":""}]
[null,null,"Historical",2016,null,"Actual",null,"",null,null,"Actual",null,null,"",null,null,"Actual","","","",""]
[null,null,"Historical",2017,null,"Actual",null,"",null,null,"Actual",null,null,"",null,null,"Actual","","","",""]
[null,null,"Historical",2018,null,"Actual",null,"",null,null,"Actual",null,null,"",null,null,"Actual","","","",""]
[null,null,"Bridge Year (Forecast)",2019,null,"Forecast",null,"",null,null,"Forecast",null,null,"",null,null,"Forecast","","","",""]
[null,null,"Test Year (Forecast)",{"$f":"TestYear","v":2020},null,"Forecast",null,"",null,null,"Forecast",null,null,"",null,null,"Forecast","","","",""]
[null,null,null,null,null,null,null,null,{"$f":"SUM(I385:I390)","v":0},null,null,null,null,null,{"$f":"SUM(O385:O390)","v":0},null,null,null,null,null,{"$f":"SUM(U385:U390)","v":0}]
[null,null,"Variance Analysis","Year",null,null,"Year-over-year",null,{"$f":"I372","v":"Test Year Versus Board-approved"},null,"Year","Year-over-year",null,null,{"$f":"I393","v":"Test Year Versus Board-approved"},null,"Year","Year-over-year",null,null,{"$f":"O393","v":"Test Year Versus Board-approved"}]
[null,null,null,{"$f":"D385","v":2014},null,null,null,null,null,null,{"$f":"D394","v":2014},null,null,null,null,null,{"$f":"K394","v":2014}]
[null,null,null,2015,null,null,{"$f":"IF(G385=0,\"\",G386/G385-1)","v":""},null,null,null,{"$f":"D395","v":2015},{"$f":"IF(L385=0,\"\",L386/L385-1)","v":""},"",null,null,null,{"$f":"K395","v":2015},{"$f":"IF(R385=\"\",\"\",IF(R385=0,\"\",R386/R385-1))","v":""},""]
[null,null,null,2016,null,null,"",null,null,null,2016,"","",null,null,null,2016,"",""]
[null,null,null,2017,null,null,"",null,null,null,2017,"","",null,null,null,2017,"",""]
[null,null,null,2018,null,null,"",null,null,null,2018,"","",null,null,null,2018,"",""]
[null,null,null,2019,null,null,"",null,null,null,2019,{"$f":"IF(K390=\"Forecast\",\"\",IF(L389=0,\"\",L390/L389-1))","v":""},{"$f":"IF(M389=0,\"\",M390/M389-1)","v":""},null,null,null,2019,{"$f":"IF(Q390=\"Forecast\",\"\",IF(R389=0,\"\",R390/R389-1))","v":""},{"$f":"IF(S389=\"\",\"\",IF(S389=0,\"\",S390/S389-1))","v":""}]
[null,null,null,2020,null,null,"",null,{"$f":"IF(I392=0,\"\",G391/I392-1)","v":""},null,2020,{"$f":"IF(K391=\"Forecast\",\"\",IF(L390=0,\"\",L391/L390-1))","v":""},{"$f":"IF(M390=0,\"\",M391/M390-1)","v":""},null,{"$f":"IF(O392=0,\"\",M391/O392-1)","v":""},null,2020,{"$f":"IF(Q391=\"Forecast\",\"\",IF(R390=0,\"\",R391/R390-1))","v":""},{"$f":"IF(S390=\"\",\"\",IF(S390=0,\"\",S391/S390-1))","v":""},null,{"$f":"IF(U392=0,\"\",S391/U392-1)","v":""}]
[null,null,null,"Geometric Mean",null,null,{"$f":"IF(G385=0,\"\",(G391/G385)^(1/($D391-$D385-1))-1)","v":""},null,{"$f":"IF(I392=0,\"\",(G391/I392)^(1/(TestYear-RebaseYear-1))-1)","v":""},null,"Geometric Mean",{"$f":"IF(L385=0,\"\",(L389/L385)^(1/($D389-$D385-1))-1)","v":""},{"$f":"IF(M385=0,\"\",(M391/M385)^(1/($D391-$D385-1))-1)","v":""},null,{"$f":"IF(O392=0,\"\",(M391/O392)^(1/(TestYear-RebaseYear-1))-1)","v":""},null,"Geometric Mean",{"$f":"IF(R385=\"\",\"\",IF(R385=0,\"\",(R389/R385)^(1/($D389-$D385-1))-1))","v":""},{"$f":"IF(S385=\"\",\"\",IF(S385=0,\"\",(S391/S385)^(1/($D391-$D385-1))-1))","v":""},null,{"$f":"IF(U392=0,\"\",(S391/U392)^(1/(TestYear-RebaseYear-1))-1)","v":""}]
[]
[null,{"$f":"B360+1","v":9},"Customer Class:",null,null,null,null,"Is the customer class billed on consumption (kWh) or demand (kW or kVA)?"]
[]
[null,null,null,"Calendar Year",null,"Customers",null,null,null,null,"Consumption (kWh) (3)",null,null,null,null,null,{"$f":"CONCATENATE(\"Consumption (kWh) per \",LEFT(F405,LEN(F405)-1))","v":"Consumption (kWh) per Customer"}]
[null,null,null,{"$f":"CONCATENATE(\"(for \",TestYear,\" Cost of Service\")","v":"(for 2020 Cost of Service"},null,null,null,null,null,null,null,"Actual (Weather actual)","Weather-normalized",null,"Weather-normalized",null,null,{"$f":"L406","v":"Actual (Weather actual)"},{"$f":"M406","v":"Weather-normalized"},null,{"$f":"O406","v":"Weather-normalized"}]
[null,null,"Historical",{"$f":"D408-1","v":2014},null,{"$f":"F364","v":"Actual"},null,{"$f":"IF(D407=RebaseYear,\"Board-approved\",\"\")","v":""},null,null,{"$f":"F407","v":"Actual"},null,null,{"$f":"H407","v":""},null,null,{"$f":"K407","v":"Actual"},{"$f":"IF(G407=0,\"\",L407/G407)","v":""},{"$f":"IF(G407=0,\"\",M407/G407)","v":""},{"$f":"N407","v":""},{"$f":"IF(T407=\"\",\"\",IF(I407=0,\"\",O407/I407))","v":""}]
[null,null,"Historical",2015,null,{"$f":"F365","v":"Actual"},null,"Board-approved",null,null,{"$f":"F408","v":"Actual"},null,null,{"$f":"H408","v":"Board-approved"},null,null,{"$f":"K408","v":"Actual"},{"$f":"IF(G408=0,\"\",L408/G408)","v":""},{"$f":"IF(G408=0,\"\",M408/G408)","v":""},{"$f":"N408","v":"Board-approved"},{"$f":"IF(T408=\"\",\"\",IF(I408=0,\"\",O408/I408))","v":""}]
[null,null,"Historical",2016,null,"Actual",null,"",null,null,"Actual",null,null,"",null,null,"Actual","","","",""]
[null,null,"Historical",2017,null,"Actual",null,"",null,null,"Actual",null,null,"",null,null,"Actual","","","",""]
[null,null,"Historical",2018,null,"Actual",null,"",null,null,"Actual",null,null,"",null,null,"Actual","","","",""]
[null,null,"Bridge Year",2019,null,"Forecast",null,"",null,null,"Forecast",null,null,"",null,null,"Forecast","","","",""]
[null,null,"Test Year",{"$f":"TestYear","v":2020},null,"Forecast",null,"",null,null,"Forecast",null,null,"",null,null,"Forecast","","","",""]
[null,null,null,null,null,null,null,null,{"$f":"SUM(I407:I412)","v":0},null,null,null,null,null,{"$f":"SUM(O407:O412)","v":0},null,null,null,null,null,{"$f":"SUM(U407:U412)","v":0}]
[null,null,"Variance Analysis","Year",null,null,"Year-over-year",null,"Test Year Versus Board-approved",null,"Year","Year-over-year",null,null,{"$f":"I415","v":"Test Year Versus Board-approved"},null,"Year","Year-over-year",null,null,{"$f":"O415","v":"Test Year Versus Board-approved"}]
[null,null,null,{"$f":"D407","v":2014},null,null,null,null,null,null,{"$f":"D416","v":2014},null,null,null,null,null,{"$f":"K416","v":2014}]
[null,null,null,2015,null,null,{"$f":"IF(G407=0,\"\",G408/G407-1)","v":""},null,null,null,{"$f":"D417","v":2015},{"$f":"IF(L407=0,\"\",L408/L407-1)","v":""},"",null,null,null,{"$f":"K417","v":2015},{"$f":"IF(R407=\"\",\"\",IF(R407=0,\"\",R408/R407-1))","v":""},""]
[null,null,null,2016,null,null,"",null,null,null,2016,"","",null,null,null,2016,"",""]
[null,null,null,2017,null,null,"",null,null,null,2017,"","",null,null,null,2017,"",""]
[null,null,null,2018,null,null,"",null,null,null,2018,"","",null,null,null,2018,"",""]
[null,null,null,2019,null,null,"",null,null,null,2019,{"$f":"IF(K412=\"Forecast\",\"\",IF(L411=0,\"\",L412/L411-1))","v":""},{"$f":"IF(M411=0,\"\",M412/M411-1)","v":""},null,null,null,2019,{"$f":"IF(Q412=\"Forecast\",\"\",IF(R411=0,\"\",R412/R411-1))","v":""},{"$f":"IF(S411=\"\",\"\",IF(S411=0,\"\",S412/S411-1))","v":""}]
[null,null,null,2020,null,null,"",null,{"$f":"IF(I414=0,\"\",G413/I414-1)","v":""},null,2020,{"$f":"IF(K413=\"Forecast\",\"\",IF(L412=0,\"\",L413/L412-1))","v":""},{"$f":"IF(M412=0,\"\",M413/M412-1)","v":""},null,{"$f":"IF(O414=0,\"\",M413/O414-1)","v":""},null,2020,{"$f":"IF(Q413=\"Forecast\",\"\",IF(R412=0,\"\",R413/R412-1))","v":""},{"$f":"IF(S412=\"\",\"\",IF(S412=0,\"\",S413/S412-1))","v":""},null,{"$f":"IF(U414=0,\"\",S413/U414-1)","v":""}]
[null,null,null,"Geometric Mean",null,null,{"$f":"IF(G407=0,\"\",(G413/G407)^(1/($D413-$D407-1))-1)","v":""},null,{"$f":"IF(I414=0,\"\",(G413/I414)^(1/(TestYear-RebaseYear-1))-1)","v":""},null,"Geometric Mean",{"$f":"IF(L407=0,\"\",(L411/L407)^(1/($D411-$D407-1))-1)","v":""},{"$f":"IF(M407=0,\"\",(M413/M407)^(1/($D413-$D407-1))-1)","v":""},null,{"$f":"IF(O414=0,\"\",(M413/O414)^(1/(TestYear-RebaseYear-1))-1)","v":""},null,"Geometric Mean",{"$f":"IF(R407=\"\",\"\",IF(R407=0,\"\",(R411/R407)^(1/($D411-$D407-1))-1))","v":""},{"$f":"IF(S407=\"\",\"\",IF(S407=0,\"\",(S413/S407)^(1/($D413-$D407-1))-1))","v":""},null,{"$f":"IF(U414=0,\"\",(S413/U414)^(1/(TestYear-RebaseYear-1))-1)","v":""}]
[]
[]
[null,null,null,"Calendar Year",null,"Revenues",null,null,null,null,{"$f":"IF(ISBLANK(N403),\"\",CONCATENATE(\"Demand (\",N403,\")\"))","v":""},null,null,null,null,null,{"$f":"CONCATENATE(\"Demand (\",N403,\") per \",LEFT(F405,LEN(F405)-1))","v":"Demand () per Customer"}]
[null,null,null,{"$f":"CONCATENATE(\"(for \",TestYear,\" Cost of Service\")","v":"(for 2020 Cost of Service"},null,null,null,null,null,null,null,"Actual (Weather actual)","Weather-normalized",null,{"$f":"M427","v":"Weather-normalized"},null,null,{"$f":"L427","v":"Actual (Weather actual)"},{"$f":"M427","v":"Weather-normalized"},null,{"$f":"O427","v":"Weather-normalized"}]
[null,null,"Historical",{"$f":"D429-1","v":2014},null,{"$f":"F407","v":"Actual"},null,{"$f":"IF(D428=RebaseYear,\"Board-approved\",\"\")","v":""},null,null,{"$f":"K407","v":"Actual"},null,null,{"$f":"N407","v":""},null,null,{"$f":"K428","v":"Actual"},{"$f":"IF(G428=0,\"\",L428/G428)","v":""},{"$f":"IF(G428=0,\"\",M428/G428)","v":""},{"$f":"N428","v":""},{"$f":"IF(T428=\"\",\"\",IF(I428=0,\"\",O428/I428))","v":""}]
[null,null,"Historical",2015,null,"Actual",null,"Board-approved",null,null,"Actual",null,null,"Board-approved",null,null,{"$f":"K429","v":"Actual"},{"$f":"IF(G429=0,\"\",L429/G429)","v":""},{"$f":"IF(G429=0,\"\",M429/G429)","v":""},{"$f":"N429","v":"Board-approved"},{"$f":"IF(T429=\"\",\"\",IF(I429=0,\"\",O429/I429))","v":""}]
[null,null,"Historical",2016,null,"Actual",null,"",null,null,"Actual",null,null,"",null,null,"Actual","","","",""]
[null,null,"Historical",2017,null,"Actual",null,"",null,null,"Actual",null,null,"",null,null,"Actual","","","",""]
[null,null,"Historical",2018,null,"Actual",null,"",null,null,"Actual",null,null,"",null,null,"Actual","","","",""]
[null,null,"Bridge Year (Forecast)",2019,null,"Forecast",null,"",null,null,"Forecast",null,null,"",null,null,"Forecast","","","",""]
[null,null,"Test Year (Forecast)",{"$f":"TestYear","v":2020},null,"Forecast",null,"",null,null,"Forecast",null,null,"",null,null,"Forecast","","","",""]
[null,null,null,null,null,null,null,null,{"$f":"SUM(I428:I433)","v":0},null,null,null,null,null,{"$f":"SUM(O428:O433)","v":0},null,null,null,null,null,{"$f":"SUM(U428:U433)","v":0}]
[null,null,"Variance Analysis","Year",null,null,"Year-over-year",null,{"$f":"I415","v":"Test Year Versus Board-approved"},null,"Year","Year-over-year",null,null,{"$f":"I436","v":"Test Year Versus Board-approved"},null,"Year","Year-over-year",null,null,{"$f":"O436","v":"Test Year Versus Board-approved"}]
[null,null,null,{"$f":"D428","v":2014},null,null,null,null,null,null,{"$f":"D437","v":2014},null,null,null,null,null,{"$f":"K437","v":2014}]
[null,null,null,2015,null,null,{"$f":"IF(G428=0,\"\",G429/G428-1)","v":""},null,null,null,{"$f":"D438","v":2015},{"$f":"IF(L428=0,\"\",L429/L428-1)","v":""},"",null,null,null,{"$f":"K438","v":2015},{"$f":"IF(R428=\"\",\"\",IF(R428=0,\"\",R429/R428-1))","v":""},""]
[null,null,null,2016,null,null,"",null,null,null,2016,"","",null,null,null,2016,"",""]
[null,null,null,2017,null,null,"",null,null,null,2017,"","",null,null,null,2017,"",""]
[null,null,null,2018,null,null,"",null,null,null,2018,"","",null,null,null,2018,"",""]
[null,null,null,2019,null,null,"",null,null,null,2019,{"$f":"IF(K433=\"Forecast\",\"\",IF(L432=0,\"\",L433/L432-1))","v":""},{"$f":"IF(M432=0,\"\",M433/M432-1)","v":""},null,null,null,2019,{"$f":"IF(Q433=\"Forecast\",\"\",IF(R432=0,\"\",R433/R432-1))","v":""},{"$f":"IF(S432=\"\",\"\",IF(S432=0,\"\",S433/S432-1))","v":""}]
[null,null,null,2020,null,null,"",null,{"$f":"IF(I435=0,\"\",G434/I435-1)","v":""},null,2020,{"$f":"IF(K434=\"Forecast\",\"\",IF(L433=0,\"\",L434/L433-1))","v":""},{"$f":"IF(M433=0,\"\",M434/M433-1)","v":""},null,{"$f":"IF(O435=0,\"\",M434/O435-1)","v":""},null,2020,{"$f":"IF(Q434=\"Forecast\",\"\",IF(R433=0,\"\",R434/R433-1))","v":""},{"$f":"IF(S433=\"\",\"\",IF(S433=0,\"\",S434/S433-1))","v":""},null,{"$f":"IF(U435=0,\"\",S434/U435-1)","v":""}]
[null,null,null,"Geometric Mean",null,null,{"$f":"IF(G428=0,\"\",(G434/G428)^(1/($D434-$D428-1))-1)","v":""},null,{"$f":"IF(I435=0,\"\",(G434/I435)^(1/(TestYear-RebaseYear-1))-1)","v":""},null,"Geometric Mean",{"$f":"IF(L428=0,\"\",(L432/L428)^(1/($D432-$D428-1))-1)","v":""},{"$f":"IF(M428=0,\"\",(M434/M428)^(1/($D434-$D428-1))-1)","v":""},null,{"$f":"IF(O435=0,\"\",(M434/O435)^(1/(TestYear-RebaseYear-1))-1)","v":""},null,"Geometric Mean",{"$f":"IF(R428=\"\",\"\",IF(R428=0,\"\",(R432/R428)^(1/($D432-$D428-1))-1))","v":""},{"$f":"IF(S428=\"\",\"\",IF(S428=0,\"\",(S434/S428)^(1/($D434-$D428-1))-1))","v":""},null,{"$f":"IF(U435=0,\"\",(S434/U435)^(1/(TestYear-RebaseYear-1))-1)","v":""}]
[]
[null,{"$f":"B403+1","v":10},"Customer Class:",null,null,null,null,"Is the customer class billed on consumption (kWh) or demand (kW or kVA)?"]
[]
[null,null,null,"Calendar Year",null,"Customers",null,null,null,null,"Consumption (kWh) (3)",null,null,null,null,null,{"$f":"CONCATENATE(\"Consumption (kWh) per \",LEFT(F448,LEN(F448)-1))","v":"Consumption (kWh) per Customer"}]
[null,null,null,{"$f":"CONCATENATE(\"(for \",TestYear,\" Cost of Service\")","v":"(for 2020 Cost of Service"},null,null,null,null,null,null,null,"Actual (Weather actual)","Weather-normalized",null,"Weather-normalized",null,null,{"$f":"L449","v":"Actual (Weather actual)"},{"$f":"M449","v":"Weather-normalized"},null,{"$f":"O449","v":"Weather-normalized"}]
[null,null,"Historical",{"$f":"D451-1","v":2014},null,{"$f":"F407","v":"Actual"},null,{"$f":"IF(D450=RebaseYear,\"Board-approved\",\"\")","v":""},null,null,{"$f":"F450","v":"Actual"},null,null,{"$f":"H450","v":""},null,null,{"$f":"K450","v":"Actual"},{"$f":"IF(G450=0,\"\",L450/G450)","v":""},{"$f":"IF(G450=0,\"\",M450/G450)","v":""},{"$f":"N450","v":""},{"$f":"IF(T450=\"\",\"\",IF(I450=0,\"\",O450/I450))","v":""}]
[null,null,"Historical",2015,null,{"$f":"F408","v":"Actual"},null,"Board-approved",null,null,{"$f":"F451","v":"Actual"},null,null,{"$f":"H451","v":"Board-approved"},null,null,{"$f":"K451","v":"Actual"},{"$f":"IF(G451=0,\"\",L451/G451)","v":""},{"$f":"IF(G451=0,\"\",M451/G451)","v":""},{"$f":"N451","v":"Board-approved"},{"$f":"IF(T451=\"\",\"\",IF(I451=0,\"\",O451/I451))","v":""}]
[null,null,"Historical",2016,null,"Actual",null,"",null,null,"Actual",null,null,"",null,null,"Actual","","","",""]
[null,null,"Historical",2017,null,"Actual",null,"",null,null,"Actual",null,null,"",null,null,"Actual","","","",""]
[null,null,"Historical",2018,null,"Actual",null,"",null,null,"Actual",null,null,"",null,null,"Actual","","","",""]
[null,null,"Bridge Year",2019,null,"Forecast",null,"",null,null,"Forecast",null,null,"",null,null,"Forecast","","","",""]
[null,null,"Test Year",{"$f":"TestYear","v":2020},null,"Forecast",null,"",null,null,"Forecast",null,null,"",null,null,"Forecast","","","",""]
[null,null,null,null,null,null,null,null,{"$f":"SUM(I450:I455)","v":0},null,null,null,null,null,{"$f":"SUM(O450:O455)","v":0},null,null,null,null,null,{"$f":"SUM(U450:U455)","v":0}]
[null,null,"Variance Analysis","Year",null,null,"Year-over-year",null,"Test Year Versus Board-approved",null,"Year","Year-over-year",null,null,{"$f":"I458","v":"Test Year Versus Board-approved"},null,"Year","Year-over-year",null,null,{"$f":"O458","v":"Test Year Versus Board-approved"}]
[null,null,null,{"$f":"D450","v":2014},null,null,null,null,null,null,{"$f":"D459","v":2014},null,null,null,null,null,{"$f":"K459","v":2014}]
[null,null,null,2015,null,null,{"$f":"IF(G450=0,\"\",G451/G450-1)","v":""},null,null,null,{"$f":"D460","v":2015},{"$f":"IF(L450=0,\"\",L451/L450-1)","v":""},"",null,null,null,{"$f":"K460","v":2015},{"$f":"IF(R450=\"\",\"\",IF(R450=0,\"\",R451/R450-1))","v":""},""]
[null,null,null,2016,null,null,"",null,null,null,2016,"","",null,null,null,2016,"",""]
[null,null,null,2017,null,null,"",null,null,null,2017,"","",null,null,null,2017,"",""]
[null,null,null,2018,null,null,"",null,null,null,2018,"","",null,null,null,2018,"",""]
[null,null,null,2019,null,null,"",null,null,null,2019,{"$f":"IF(K455=\"Forecast\",\"\",IF(L454=0,\"\",L455/L454-1))","v":""},{"$f":"IF(M454=0,\"\",M455/M454-1)","v":""},null,null,null,2019,{"$f":"IF(Q455=\"Forecast\",\"\",IF(R454=0,\"\",R455/R454-1))","v":""},{"$f":"IF(S454=\"\",\"\",IF(S454=0,\"\",S455/S454-1))","v":""}]
[null,null,null,2020,null,null,"",null,{"$f":"IF(I457=0,\"\",G456/I457-1)","v":""},null,2020,{"$f":"IF(K456=\"Forecast\",\"\",IF(L455=0,\"\",L456/L455-1))","v":""},{"$f":"IF(M455=0,\"\",M456/M455-1)","v":""},null,{"$f":"IF(O457=0,\"\",M456/O457-1)","v":""},null,2020,{"$f":"IF(Q456=\"Forecast\",\"\",IF(R455=0,\"\",R456/R455-1))","v":""},{"$f":"IF(S455=\"\",\"\",IF(S455=0,\"\",S456/S455-1))","v":""},null,{"$f":"IF(U457=0,\"\",S456/U457-1)","v":""}]
[null,null,null,"Geometric Mean",null,null,{"$f":"IF(G450=0,\"\",(G456/G450)^(1/($D456-$D450-1))-1)","v":""},null,{"$f":"IF(I457=0,\"\",(G456/I457)^(1/(TestYear-RebaseYear-1))-1)","v":""},null,"Geometric Mean",{"$f":"IF(L450=0,\"\",(L454/L450)^(1/($D454-$D450-1))-1)","v":""},{"$f":"IF(M450=0,\"\",(M456/M450)^(1/($D456-$D450-1))-1)","v":""},null,{"$f":"IF(O457=0,\"\",(M456/O457)^(1/(TestYear-RebaseYear-1))-1)","v":""},null,"Geometric Mean",{"$f":"IF(R450=\"\",\"\",IF(R450=0,\"\",(R454/R450)^(1/($D454-$D450-1))-1))","v":""},{"$f":"IF(S450=\"\",\"\",IF(S450=0,\"\",(S456/S450)^(1/($D456-$D450-1))-1))","v":""},null,{"$f":"IF(U457=0,\"\",(S456/U457)^(1/(TestYear-RebaseYear-1))-1)","v":""}]
[]
[]
[null,null,null,"Calendar Year",null,"Revenues",null,null,null,null,{"$f":"IF(ISBLANK(N446),\"\",CONCATENATE(\"Demand (\",N446,\")\"))","v":""},null,null,null,null,null,{"$f":"CONCATENATE(\"Demand (\",N446,\") per \",LEFT(F448,LEN(F448)-1))","v":"Demand () per Customer"}]
[null,null,null,{"$f":"CONCATENATE(\"(for \",TestYear,\" Cost of Service\")","v":"(for 2020 Cost of Service"},null,null,null,null,null,null,null,"Actual (Weather actual)","Weather-normalized",null,{"$f":"M470","v":"Weather-normalized"},null,null,{"$f":"L470","v":"Actual (Weather actual)"},{"$f":"M470","v":"Weather-normalized"},null,{"$f":"O470","v":"Weather-normalized"}]
[null,null,"Historical",{"$f":"D472-1","v":2014},null,{"$f":"F450","v":"Actual"},null,{"$f":"IF(D471=RebaseYear,\"Board-approved\",\"\")","v":""},null,null,{"$f":"K450","v":"Actual"},null,null,{"$f":"N450","v":""},null,null,{"$f":"K471","v":"Actual"},{"$f":"IF(G471=0,\"\",L471/G471)","v":""},{"$f":"IF(G471=0,\"\",M471/G471)","v":""},{"$f":"N471","v":""},{"$f":"IF(T471=\"\",\"\",IF(I471=0,\"\",O471/I471))","v":""}]
[null,null,"Historical",2015,null,"Actual",null,"Board-approved",null,null,"Actual",null,null,"Board-approved",null,null,{"$f":"K472","v":"Actual"},{"$f":"IF(G472=0,\"\",L472/G472)","v":""},{"$f":"IF(G472=0,\"\",M472/G472)","v":""},{"$f":"N472","v":"Board-approved"},{"$f":"IF(T472=\"\",\"\",IF(I472=0,\"\",O472/I472))","v":""}]
[null,null,"Historical",2016,null,"Actual",null,"",null,null,"Actual",null,null,"",null,null,"Actual","","","",""]
[null,null,"Historical",2017,null,"Actual",null,"",null,null,"Actual",null,null,"",null,null,"Actual","","","",""]
[null,null,"Historical",2018,null,"Actual",null,"",null,null,"Actual",null,null,"",null,null,"Actual","","","",""]
[null,null,"Bridge Year (Forecast)",2019,null,"Forecast",null,"",null,null,"Forecast",null,null,"",null,null,"Forecast","","","",""]
[null,null,"Test Year (Forecast)",{"$f":"TestYear","v":2020},null,"Forecast",null,"",null,null,"Forecast",null,null,"",null,null,"Forecast","","","",""]
[null,null,null,null,null,null,null,null,{"$f":"SUM(I471:I476)","v":0},null,null,null,null,null,{"$f":"SUM(O471:O476)","v":0},null,null,null,null,null,{"$f":"SUM(U471:U476)","v":0}]
[null,null,"Variance Analysis","Year",null,null,"Year-over-year",null,{"$f":"I458","v":"Test Year Versus Board-approved"},null,"Year","Year-over-year",null,null,{"$f":"I479","v":"Test Year Versus Board-approved"},null,"Year","Year-over-year",null,null,{"$f":"O479","v":"Test Year Versus Board-approved"}]
[null,null,null,{"$f":"D471","v":2014},null,null,null,null,null,null,{"$f":"D480","v":2014},null,null,null,null,null,{"$f":"K480","v":2014}]
[null,null,null,2015,null,null,{"$f":"IF(G471=0,\"\",G472/G471-1)","v":""},null,null,null,{"$f":"D481","v":2015},{"$f":"IF(L471=0,\"\",L472/L471-1)","v":""},"",null,null,null,{"$f":"K481","v":2015},{"$f":"IF(R471=\"\",\"\",IF(R471=0,\"\",R472/R471-1))","v":""},""]
[null,null,null,2016,null,null,"",null,null,null,2016,"","",null,null,null,2016,"",""]
[null,null,null,2017,null,null,"",null,null,null,2017,"","",null,null,null,2017,"",""]
[null,null,null,2018,null,null,"",null,null,null,2018,"","",null,null,null,2018,"",""]
[null,null,null,2019,null,null,"",null,null,null,2019,{"$f":"IF(K476=\"Forecast\",\"\",IF(L475=0,\"\",L476/L475-1))","v":""},{"$f":"IF(M475=0,\"\",M476/M475-1)","v":""},null,null,null,2019,{"$f":"IF(Q476=\"Forecast\",\"\",IF(R475=0,\"\",R476/R475-1))","v":""},{"$f":"IF(S475=\"\",\"\",IF(S475=0,\"\",S476/S475-1))","v":""}]
[null,null,null,2020,null,null,"",null,{"$f":"IF(I478=0,\"\",G477/I478-1)","v":""},null,2020,{"$f":"IF(K477=\"Forecast\",\"\",IF(L476=0,\"\",L477/L476-1))","v":""},{"$f":"IF(M476=0,\"\",M477/M476-1)","v":""},null,{"$f":"IF(O478=0,\"\",M477/O478-1)","v":""},null,2020,{"$f":"IF(Q477=\"Forecast\",\"\",IF(R476=0,\"\",R477/R476-1))","v":""},{"$f":"IF(S476=\"\",\"\",IF(S476=0,\"\",S477/S476-1))","v":""},null,{"$f":"IF(U478=0,\"\",S477/U478-1)","v":""}]
[null,null,null,"Geometric Mean",null,null,{"$f":"IF(G471=0,\"\",(G477/G471)^(1/($D477-$D471-1))-1)","v":""},null,{"$f":"IF(I478=0,\"\",(G477/I478)^(1/(TestYear-RebaseYear-1))-1)","v":""},null,"Geometric Mean",{"$f":"IF(L471=0,\"\",(L475/L471)^(1/($D475-$D471-1))-1)","v":""},{"$f":"IF(M471=0,\"\",(M477/M471)^(1/($D477-$D471-1))-1)","v":""},null,{"$f":"IF(O478=0,\"\",(M477/O478)^(1/(TestYear-RebaseYear-1))-1)","v":""},null,"Geometric Mean",{"$f":"IF(R471=\"\",\"\",IF(R471=0,\"\",(R475/R471)^(1/($D475-$D471-1))-1))","v":""},{"$f":"IF(S471=\"\",\"\",IF(S471=0,\"\",(S477/S471)^(1/($D477-$D471-1))-1))","v":""},null,{"$f":"IF(U478=0,\"\",(S477/U478)^(1/(TestYear-RebaseYear-1))-1)","v":""}]
[]
[null,"Note: If there are more than ten (10) customer classes, please contact OEB Staff to add tables for additional customer classes."]

{"sheet":"App.2-JA_OM&A_Summary_Analys","index":32,"n_rows":41,"n_cols":53,"rows_kept":41,"cut":false,"hidden":false,"merged":[[43,1,44,18],[39,0,39,50],[8,0,8,19],[9,0,9,19],[11,20,11,21],[40,0,40,50],[10,23,10,25],[10,26,10,28],[10,29,10,31],[10,32,10,34],[10,35,10,37],[10,38,10,40],[10,41,10,43],[10,44,10,46],[10,47,10,48],[10,49,10,50],[10,15,10,16],[10,13,10,14],[10,11,10,12],[10,1,10,2],[10,3,10,4],[10,5,10,6],[10,7,10,8],[10,9,10,10]]}
[null,null,null,null,null,null,null,null,null,null,null,null,null,null,null,null,null,null,"File Number:",{"$f":"EBNUMBER","v":"EB-2019-0019"},{"$f":"'LDC Info'!$E$28","v":2015},"Last Rebasing Year","Column"]
[null,null,null,null,null,null,null,null,null,null,null,null,null,null,null,null,null,null,"Exhibit:",4,{"$f":"TestYear","v":2020},2010,"B","ae"]
[null,null,null,null,null,null,null,null,null,null,null,null,null,null,null,null,null,null,"Tab:",null,{"$f":"'LDC Info'!$E$28","v":2015},2011,"D","ah"]
["TO BE UPDATED AT THE DRAFT RATE ORDER STAGE",null,null,null,null,null,null,null,null,null,null,null,null,null,null,null,null,null,"Schedule:",null,null,2012,"G","ak"]
[null,null,null,null,null,null,null,null,null,null,null,null,null,null,null,null,null,null,"Page:",null,null,2013,"J","an"]
[null,null,null,null,null,null,null,null,null,null,null,null,null,null,null,null,null,null,null,null,null,2014,"M","aq"]
[null,null,null,null,null,null,null,null,null,null,null,null,null,null,null,null,null,null,"Date:","2019-09-24",null,2015,"P","at"]
[null,null,null,null,null,null,null,null,null,null,null,null,null,null,null,null,null,null,null,null,null,2016,"S","aw"]
["Appendix 2-JA",null,null,null,null,null,null,null,null,null,null,null,null,null,null,null,null,null,null,null,null,2017,"V","az"]
["Summary of Recoverable OM&A Expenses"]
[null,2010,null,2011,null,2012,null,2013,null,2014,null,2015,null,2016,null,2017,null,2018,2019,2020,null,null,null,2010,null,null,2011,null,null,2012,null,null,2013,null,null,2014,null,null,2015,null,null,2016,null,null,2017,null,null,2018,null,2019,null,2020]
[null,{"$f":"CONCATENATE(B11,\" \",IF($U1=B11,\"Last Rebasing Year \",\"\"),\" Board Approved\")","v":"2010  Board Approved"},{"$f":"CONCATENATE(B11,\" \",IF($U1=B11,\"Last Rebasing Year \",\"\"),\" Actuals\")","v":"2010  Actuals"},{"$f":"CONCATENATE(D11,\" \",IF($U1=D11,\"Last Rebasing Year \",\"\"),\" Board Approved\")","v":"2011  Board Approved"},{"$f":"CONCATENATE(D11,\" \",IF($U1=D11,\"Last Rebasing Year \",\"\"),\" Actuals\")","v":"2011  Actuals"},{"$f":"CONCATENATE(F11,\" \",IF($U1=F11,\"Last Rebasing Year \",\"\"),\" Board Approved\")","v":"2012  Board Approved"},{"$f":"CONCATENATE(F11,\" \",IF($U1=F11,\"Last Rebasing Year \",\"\"),\" Actuals\")","v":"2012  Actuals"},{"$f":"CONCATENATE(H11,\" \",IF($U1=H11,\"Last Rebasing Year \",\"\"),\" Board Approved\")","v":"2013  Board Approved"},{"$f":"CONCATENATE(H11,\" \",IF($U1=H11,\"Last Rebasing Year \",\"\"),\" Actuals\")","v":"2013  Actuals"},{"$f":"CONCATENATE(J11,\" \",IF($U1=J11,\"Last Rebasing Year \",\"\"),\" Board Approved\")","v":"2014  Board Approved"},{"$f":"CONCATENATE(J11,\" \",IF($U1=J11,\"Last Rebasing Year \",\"\"),\" Actuals\")","v":"2014  Actuals"},{"$f":"CONCATENATE(L11,\" \",IF($U1=L11,\"Last Rebasing Year \",\"\"),\" Board Approved\")","v":"2015 Last Rebasing Year  Board Approved"},{"$f":"CONCATENATE(L11,\" \",IF($U1=L11,\"Last Rebasing Year \",\"\"),\" Actuals\")","v":"2015 Last Rebasing Year  Actuals"},{"$f":"CONCATENATE(N11,\" \",IF($U1=N11,\"Last Rebasing Year \",\"\"),\" Board Approved\")","v":"2016  Board Approved"},{"$f":"CONCATENATE(N11,\" \",IF($U1=N11,\"Last Rebasing Year \",\"\"),\" Actuals\")","v":"2016  Actuals"},{"$f":"CONCATENATE(P11,\" \",IF($U1=P11,\"Last Rebasing Year \",\"\"),\" Board Approved\")","v":"2017  Board Approved"},{"$f":"CONCATENATE(P11,\" \",IF($U1=P11,\"Last Rebasing Year \",\"\"),\" Actuals\")","v":"2017  Actuals"},"2018 Actuals",{"$f":"BridgeYear & \" Bridge Year\"","v":"2019 Bridge Year"},{"$f":"TestYear & \" Test Year\"","v":"2020 Test Year"},null,null,null,{"$f":"CONCATENATE(IF($U1=X11,\"Last Rebasing Year \",\"\"),,X11,\" Board Approved\")","v":"2010 Board Approved"},{"$f":"CONCATENATE(IF($U1=X11,\"Last Rebasing Year \",\"\"),X11,\" Actuals\")","v":"2010 Actuals"},{"$f":"CONCATENATE(\"Variance \",X11,\" Board Approved - \",X11,\" Actuals\")","v":"Variance 2010 Board Approved - 2010 Actuals"},{"$f":"CONCATENATE(IF($U1=AA11,\"Last Rebasing Year \",\"\"),,AA11,\" Board Approved\")","v":"2011 Board Approved"},{"$f":"CONCATENATE(IF($U1=AA11,\"Last Rebasing Year \",\"\"),AA11,\" Actuals\")","v":"2011 Actuals"},{"$f":"CONCATENATE(\"Variance \",AA11,\" Board Approved - \",AA11,\" Actuals\")","v":"Variance 2011 Board Approved - 2011 Actuals"},{"$f":"CONCATENATE(IF($U1=AD11,\"Last Rebasing Year\",\"\"),,AD11,\" Board Approved\")","v":"2012 Board Approved"},{"$f":"CONCATENATE(IF($U1=AD11,\"Last Rebasing Year \",\"\"),AD11,\" Actuals\")","v":"2012 Actuals"},{"$f":"CONCATENATE(\"Variance \",AD11,\" Board Approved - \",AD11,\" Actuals\")","v":"Variance 2012 Board Approved - 2012 Actuals"},{"$f":"CONCATENATE(IF($U1=AG11,\"Last Rebasing Year \",\"\"),,AG11,\" Board Approved\")","v":"2013 Board Approved"},{"$f":"CONCATENATE(IF($U1=AG11,\"Last Rebasing Year \",\"\"),AG11,\" Actuals\")","v":"2013 Actuals"},{"$f":"CONCATENATE(\"Variance \",AG11,\" Board Approved - \",AG11,\" Actuals\")","v":"Variance 2013 Board Approved - 2013 Actuals"},{"$f":"CONCATENATE(IF($U1=AJ11,\"Last Rebasing Year \",\"\"),,AJ11,\" Board Approved\")","v":"2014 Board Approved"},{"$f":"CONCATENATE(IF($U1=AJ11,\"Last Rebasing Year \",\"\"),AJ11,\" Actuals\")","v":"2014 Actuals"},{"$f":"CONCATENATE(\"Variance \",AJ11,\" Board Approved - \",AJ11,\" Actuals\")","v":"Variance 2014 Board Approved - 2014 Actuals"},{"$f":"CONCATENATE(IF($U1=AM11,\"Last Rebasing Year \",\"\"),,AM11,\" Board Approved\")","v":"Last Rebasing Year 2015 Board Approved"},{"$f":"CONCATENATE(IF($U1=AM11,\"Last Rebasing Year \",\"\"),AM11,\" Actuals\")","v":"Last Rebasing Year 2015 Actuals"},{"$f":"CONCATENATE(\"Variance \",AM11,\" Board Approved - \",AM11,\" Actuals\")","v":"Variance 2015 Board Approved - 2015 Actuals"},{"$f":"CONCATENATE(IF($U1=AP11,\"Last Rebasing Year \",\"\"),,AP11,\" Board Approved\")","v":"2016 Board Approved"},{"$f":"CONCATENATE(IF($U1=AP11,\"Last Rebasing Year \",\"\"),AP11,\" Actuals\")","v":"2016 Actuals"},{"$f":"CONCATENATE(\"Variance \",AP11,\" Actuals - \",AM11,\" Actuals\")","v":"Variance 2016 Actuals - 2015 Actuals"},{"$f":"CONCATENATE(IF($U1=AS11,\"Last Rebasing Year \",\"\"),,AS11,\" Board Approved\")","v":"2017 Board Approved"},{"$f":"CONCATENATE(IF($U1=AS11,\"Last Rebasing Year \",\"\"),AS11,\" Actuals\")","v":"2017 Actuals"},{"$f":"CONCATENATE(\"Variance \",AS11,\" Actuals - \",AP11,\" Actuals\")","v":"Variance 2017 Actuals - 2016 Actuals"},{"$f":"CONCATENATE(AV11,\" Actuals\")","v":"2018 Actuals"},{"$f":"CONCATENATE(\"Variance \",AV11,\" Acutals vs. \",AV11-1,\" Actuals\")","v":"Variance 2018 Acutals vs. 2017 Actuals"},{"$f":"CONCATENATE(AX11,\" Bridge Year\")","v":"2019 Bridge Year"},{"$f":"CONCATENATE(\"Variance \",AX11,\" Bridge vs. \",AX11-1,\" Actuals\")","v":"Variance 2019 Bridge vs. 2018 Actuals"},{"$f":"CONCATENATE(AZ11,\" Test Year\")","v":"2020 Test Year"},{"$f":"CONCATENATE(\"Variance \",AZ11,\" Test vs. \",AZ11-1,\" Bridge\")","v":"Variance 2020 Test vs. 2019 Bridge"}]
["Reporting Basis",null,null,null,null,null,null,null,null,null,null,"MIFRS","MIFRS","MIFRS","MIFRS","MIFRS","MIFRS","MIFRS","MIFRS","MIFRS",null,"Operations","Operations",{"$f":"B14","v":0},{"$f":"C14","v":0},{"$f":"X13-Y13","v":0},{"$f":"D14","v":0},{"$f":"E14","v":0},{"$f":"AA13-AB13","v":0},{"$f":"F14","v":0},{"$f":"G14","v":0},{"$f":"AD13-AE13","v":0},{"$f":"H14","v":0},{"$f":"I14","v":0},{"$f":"AG13-AH13","v":0},{"$f":"J14","v":0},{"$f":"K14","v":0},{"$f":"AJ13-AK13","v":0},{"$f":"L14","v":1642392},{"$f":"M14","v":1417406.67},{"$f":"AM13-AN13","v":224985.33000000007},{"$f":"N14","v":0},{"$f":"O14","v":1296571.74},{"$f":"AQ13-AN13","v":-120834.92999999993},{"$f":"P14","v":0},{"$f":"Q14","v":1451821.1099999999},{"$f":"AT13-AQ13","v":155249.36999999988},{"$f":"R14","v":1566231.78},{"$f":"AV13-AT13","v":114410.67000000016},{"$f":"S14","v":1790340.96},{"$f":"AX13-AV13","v":224109.17999999993},{"$f":"T14","v":1782437.3599999999},{"$f":"AZ13-AX13","v":-7903.6000000000931}]
["Operations",null,null,null,null,null,null,null,null,null,null,1642392,1417406.67,null,1296571.74,null,1451821.1099999999,1566231.78,1790340.96,1782437.3599999999,null,"Maintenance ","Maintenance ",{"$f":"B15","v":0},{"$f":"C15","v":0},0,{"$f":"D15","v":0},{"$f":"E15","v":0},0,{"$f":"F15","v":0},{"$f":"G15","v":0},0,{"$f":"H15","v":0},{"$f":"I15","v":0},0,{"$f":"J15","v":0},{"$f":"K15","v":0},0,{"$f":"L15","v":5118954},{"$f":"M15","v":4879021.4200000018},239932.57999999821,{"$f":"N15","v":0},{"$f":"O15","v":5064914.8400000008},185893.41999999899,{"$f":"P15","v":0},{"$f":"Q15","v":5263561.8999999994},{"$f":"AT14-AQ14","v":198647.05999999866},{"$f":"R15","v":5145408.12},{"$f":"AV14-AT14","v":-118153.77999999933},{"$f":"S15","v":5225959.47},{"$f":"AX14-AV14","v":80551.349999999627},{"$f":"T15","v":5297809.8200000012},{"$f":"AZ14-AX14","v":71850.35000000149}]
["Maintenance",null,null,null,null,null,null,null,null,null,null,5118954,4879021.4200000018,null,5064914.8400000008,null,5263561.8999999994,5145408.12,5225959.47,5297809.8200000012,null,"Billing and Collecting ","Billing and Collecting ",{"$f":"B19","v":0},0,0,{"$f":"D19","v":0},0,0,{"$f":"F19","v":0},0,0,{"$f":"H19","v":0},0,0,{"$f":"J19","v":0},0,0,{"$f":"L19","v":1090942},964836.47999999986,126105.52000000014,{"$f":"N19","v":0},875601.71,-89234.769999999902,{"$f":"P19","v":0},874404.33000000007,{"$f":"AT15-AQ15","v":-1197.3799999998882},{"$f":"R19","v":919934.89},45530.559999999939,{"$f":"S19","v":970386.84000000008},50451.95000000007,{"$f":"T19","v":995414.1100000001},{"$f":"AZ15-AX15","v":25027.270000000019}]
["SubTotal",{"$f":"SUM(B14:B15)","v":0},{"$f":"SUM(C14:C15)","v":0},0,0,0,0,0,0,0,0,6761346,6296428.0900000017,0,6361486.580000001,0,6715383.0099999998,6711639.9000000004,7016300.4299999997,7080247.1800000016,null,"Community Relations ","Community Relations ",0,0,0,0,0,0,0,0,0,0,0,0,0,0,0,22102,24429.71,-2327.7099999999991,0,32308.39,7878.68,0,47552.270000000004,{"$f":"AT16-AQ16","v":15243.880000000005},{"$f":"R20","v":141890.12},94337.849999999991,{"$f":"S20","v":94552.320000000007},-47337.799999999988,{"$f":"T20","v":96558},2005.679999999993]
["%Change (year over year)",null,{"$f":"IF(ISERROR((C16-B16)/B16), \"\", (C16-B16)/B16)","v":""},null,{"$f":"IF(ISERROR((E16-D16)/D16), \"\", (E16-D16)/D16)","v":""},null,{"$f":"IF(ISERROR((G16-F16)/F16), \"\", (G16-F16)/F16)","v":""},null,{"$f":"IF(ISERROR((I16-H16)/H16), \"\", (I16-H16)/H16)","v":""},null,{"$f":"IF(ISERROR((K16-J16)/J16), \"\", (K16-J16)/J16)","v":""},null,{"$f":"IF(ISERROR((M16-L16)/L16), \"\", (M16-L16)/L16)","v":-6.8761147558488847E-2},null,{"$f":"IF(ISERROR((O16-M16)/M16), \"\", (O16-M16)/M16)","v":1.033260271856758E-2},null,{"$f":"IF(ISERROR((Q16-O16)/O16), \"\", (Q16-O16)/O16)","v":5.5631089612390369E-2},{"$f":"IF(ISERROR((R16-Q16)/Q16), \"\", (R16-Q16)/Q16)","v":-5.5739337494607093E-4},{"$f":"IF(ISERROR((S16-R16)/R16), \"\", (S16-R16)/R16)","v":4.5392859947685708E-2},{"$f":"IF(ISERROR((T16-S16)/S16), \"\", (T16-S16)/S16)","v":9.1140267777846378E-3},null,"Administrative and General ","Administrative and General ",0,0,0,0,0,0,0,0,0,0,0,0,0,0,0,4430491,4529864.74,-99373.740000000224,0,4534507,4642.2599999997765,0,4494381.5999999996,-40125.400000000373,{"$f":"R21","v":4361131.4399999995},-133250.16000000015,{"$f":"S21","v":4843215.04},482083.60000000056,{"$f":"T21","v":5516062.7000000002},672847.66000000015]
["%Change (Test Year vs \nLast Rebasing Year - Actual)",null,null,null,null,null,null,null,null,null,null,null,null,null,null,null,null,null,null,{"$f":"IF(ISERROR((T16-M16)/M16), \"\", (T16-M16)/M16)","v":0.12448630855402966},null,"Total OM&A Expenses ","Total OM&A Expenses ",0,0,0,0,0,0,0,0,0,0,0,0,0,0,0,{"$f":"L25","v":12304881},{"$f":"M25","v":11815559.020000001},489321.97999999858,0,{"$f":"O25","v":11803903.68},-11655.340000001714,0,{"$f":"Q25","v":12131721.209999999},327817.52999999933,{"$f":"R25","v":12134596.35},2875.140000000596,{"$f":"S25","v":12924454.629999999},789858.27999999933,{"$f":"T25","v":13688281.990000002},763827.36000000313]
["Billing and Collecting",null,null,null,null,null,null,null,null,null,null,1090942,964836.47999999986,null,875601.71,null,874404.33000000007,919934.89,970386.84000000008,995414.1100000001,null,"Adjustments for Total non-recoverable items (from Appendices 2-JA and 2-JB)","Adjustments for Total non-recoverable items (from Appendices 2-JA and 2-JB)",null,null,null,null,null,null,null,null,null,null,null,null,null,null,null,null,null,null,null,null,{"$f":"AN19-AQ19","v":0}]
["Community Relations",null,null,null,null,null,null,null,null,null,null,22102,24429.71,null,32308.39,null,47552.270000000004,141890.12,94552.320000000007,96558,null,"Total Recoverable OM&A Expenses ","Total Recoverable OM&A Expenses ",{"$f":"X18-X19","v":0},0,0,0,0,0,0,0,0,{"$f":"AG18-AG19","v":0},0,0,0,0,0,12304881,11815559.020000001,489321.97999999858,0,11803903.68,{"$f":"AQ20-AN20","v":-11655.340000001714},{"$f":"AS18-AS19","v":0},12131721.209999999,{"$f":"AU18-AU19","v":327817.52999999933},12134596.35,2875.140000000596,{"$f":"AX18-AX19","v":12924454.629999999},789858.27999999933,13688281.990000002,763827.36000000313]
["Administrative and General",null,null,null,null,null,null,null,null,null,null,4430491,4529864.74,null,4534507,null,4494381.5999999996,4361131.4399999995,4843215.04,5516062.7000000002,null,"Variance from previous year ","Variance from previous year ",null,null,null,null,{"$f":"AB20-Y20","v":0},null,null,{"$f":"AE20-AB20","v":0},null,null,{"$f":"AH20-AE20","v":0},null,null,{"$f":"AK20-AH20","v":0},null,null,null,null,null,{"$f":"AQ20-AN20","v":-11655.340000001714},null,null,{"$f":"AT20-AQ20","v":327817.52999999933},null,{"$f":"AV20-AT20","v":2875.140000000596},null,{"$f":"AX20-AV20","v":789858.27999999933},null,{"$f":"AZ20-AX20","v":763827.36000000313}]
["SubTotal",{"$f":"SUM(B19:B21)","v":0},{"$f":"SUM(C19:C21)","v":0},0,0,0,0,0,0,0,0,5543535,5519130.9299999997,0,5442417.0999999996,0,{"$f":"SUM(Q19:Q21)","v":5416338.1999999993},{"$f":"SUM(R19:R21)","v":5422956.4499999993},{"$f":"SUM(S19:S21)","v":5908154.2000000002},{"$f":"SUM(T19:T21)","v":6608034.8100000005},null,"Percent change (year over year) ","Percent change (year over year) ",null,null,null,null,{"$f":"IF(ISERROR(AB21/Y20), \"\", AB21/Y20)","v":""},null,null,{"$f":"IF(ISERROR(AE21/AB20), \"\", AE21/AB20)","v":""},null,null,{"$f":"IF(ISERROR(AH21/AE20), \"\", AH21/AE20)","v":""},null,null,{"$f":"IF(ISERROR(AK21/AH20), \"\", AK21/AH20)","v":""},null,null,null,null,null,{"$f":"IF(ISERROR(AQ21/AN20), \"\", AQ21/AN20)","v":-9.864399966411164E-4},null,null,{"$f":"IF(ISERROR(AT21/AQ20), \"\", AT21/AQ20)","v":2.7771959081251952E-2},null,{"$f":"IF(ISERROR(AV21/AT20), \"\", AV21/AT20)","v":2.3699357661060167E-4},null,{"$f":"IF(ISERROR(AX21/AV20), \"\", AX21/AV20)","v":6.5091434211571389E-2},null,{"$f":"IF(ISERROR(AZ21/AX20), \"\", AZ21/AX20)","v":5.9099388087681594E-2}]
["%Change (year over year)",null,{"$f":"IF(ISERROR((C22-B22)/B22), \"\", (C22-B22)/B22)","v":""},null,{"$f":"IF(ISERROR((E22-D22)/D22), \"\", (E22-D22)/D22)","v":""},null,{"$f":"IF(ISERROR((G22-F22)/F22), \"\", (G22-F22)/F22)","v":""},null,{"$f":"IF(ISERROR((I22-H22)/H22), \"\", (I22-H22)/H22)","v":""},null,{"$f":"IF(ISERROR((K22-J22)/J22), \"\", (K22-J22)/J22)","v":""},null,{"$f":"IF(ISERROR((M22-L22)/L22), \"\", (M22-L22)/L22)","v":-4.4022577651264575E-3},null,{"$f":"IF(ISERROR((O22-M22)/M22), \"\", (O22-M22)/M22)","v":-1.3899621330418424E-2},null,{"$f":"IF(ISERROR((Q22-O22)/O22), \"\", (Q22-O22)/O22)","v":-4.791786355367797E-3},{"$f":"IF(ISERROR((R22-Q22)/Q22), \"\", (R22-Q22)/Q22)","v":1.221904865541816E-3},{"$f":"IF(ISERROR((S22-R22)/R22), \"\", (S22-R22)/R22)","v":8.9471076242922984E-2},{"$f":"IF(ISERROR((T22-S22)/S22), \"\", (T22-S22)/S22)","v":0.11846011229700137},null,"Percent Change:                                                    Test year vs. Most Current Actual ","Percent Change:                                                    Test year vs. Most Current Actual ",null,null,null,null,null,null,null,null,null,null,null,null,null,null,null,null,null,null,null,null,null,null,null,null,null,null,null,null,null,{"$f":"AZ20/AV20-1","v":0.1280376862309065}]
["%Change (Test Year vs \nLast Rebasing Year - Actual)",null,null,null,null,null,null,null,null,null,null,null,null,null,null,null,null,null,null,{"$f":"IF(ISERROR((T22-M22)/M22), \"\", (T22-M22)/M22)","v":0.19729625801792691},null,"Simple average of % variance for all years","Simple average of % variance for all years",null,null,null,null,null,null,null,null,null,null,null,null,null,null,null,null,null,null,null,null,null,null,null,null,null,null,null,null,null,{"$f":"AVERAGE(AQ22,AT22,AV22,AX22,AZ22)","v":3.0242666992094887E-2}]
["Total",{"$f":"SUM(B22,B16)","v":0},{"$f":"SUM(C22,C16)","v":0},0,0,0,0,0,0,0,0,12304881,{"$f":"SUM(M22,M16)","v":11815559.020000001},0,11803903.68,0,{"$f":"SUM(Q22,Q16)","v":12131721.209999999},{"$f":"SUM(R22,R16)","v":12134596.35},{"$f":"SUM(S22,S16)","v":12924454.629999999},{"$f":"SUM(T22,T16)","v":13688281.990000002},null,"Compound Annual Growth Rate for all years","Compound Annual Growth Rate for all years",null,null,null,null,null,null,null,null,null,null,null,null,null,null,null,null,null,null,null,null,null,null,null,null,null,null,null,null,null,{"$f":"IF((AZ20-AN20)=0, \"\", (AZ20/AN20)^(1/(AZ11-AM11))-1)","v":2.9861763187333912E-2}]
["%Change (year over year)",null,{"$f":"IF(ISERROR((C25-B25)/B25), \"\", (C25-B25)/B25)","v":""},null,{"$f":"IF(ISERROR((E25-D25)/D25), \"\", (E25-D25)/D25)","v":""},null,{"$f":"IF(ISERROR((G25-F25)/F25), \"\", (G25-F25)/F25)","v":""},null,{"$f":"IF(ISERROR((I25-H25)/H25), \"\", (I25-H25)/H25)","v":""},null,{"$f":"IF(ISERROR((K25-J25)/J25), \"\", (K25-J25)/J25)","v":""},null,{"$f":"IF(ISERROR((M25-L25)/L25), \"\", (M25-L25)/L25)","v":-3.9766494287917016E-2},null,{"$f":"IF(ISERROR((O25-M25)/M25), \"\", (O25-M25)/M25)","v":-9.864399966411164E-4},null,{"$f":"IF(ISERROR((Q25-O25)/O25), \"\", (Q25-O25)/O25)","v":2.7771959081251952E-2},{"$f":"IF(ISERROR((R25-Q25)/Q25), \"\", (R25-Q25)/Q25)","v":2.3699357661060167E-4},{"$f":"IF(ISERROR((S25-R25)/R25), \"\", (S25-R25)/R25)","v":6.5091434211571389E-2},{"$f":"IF(ISERROR((T25-S25)/S25), \"\", (T25-S25)/S25)","v":5.9099388087681594E-2},null,null,{"$f":"\"Compound Growth Rate                                                            (\" &#REF! & \" vs. \" & 'LDC Info'!E28 & \" Actuals)\"","v":{"$error":"#REF!"}}]
[]
[]
[null,null,null,null,null,null,null,null,null,null,null,null,null,null,null,null,null,null,null,null,null,null,null,{"$f":"B12","v":"2010  Board Approved"},{"$f":"C12","v":"2010  Actuals"},"Last Rebasing Year (2011 Board Approved)","Last Rebasing Year (2011 Actuals)","2011 Actuals","Last Rebasing Year (2012 Board Approved)","Last Rebasing Year (2012 Actuals)","2012 Actuals","Last Rebasing Year (2013 Board Approved)","Last Rebasing Year (2013 Actuals)","2013 Actuals","Last Rebasing Year (2014 Board Approved)","Last Rebasing Year (2014 Actuals)","2014 Actuals","Last Rebasing Year (2015 Board Approved)","Last Rebasing Year (2015 Approved)","2015 Actuals","Last Rebasing Year (2016 Board Approved)",null,{"$f":"BridgeYear -3 & \" Actuals\"","v":"2016 Actuals"},"Last Rebasing Year (2017 Board Approved)",{"$f":"BridgeYear -2 & \" Actuals\"","v":"2017 Actuals"},{"$f":"BridgeYear -1 & \" Actuals\"","v":"2018 Actuals"},{"$f":"BridgeYear & \" Bridge Year\"","v":"2019 Bridge Year"},{"$f":"TestYear & \" Test Year\"","v":"2020 Test Year"}]
[null,null,null,null,null,null,null,null,null,null,null,null,null,null,null,null,null,null,null,null,null,null,"Operations",{"$f":"B14","v":0},0,0,0,{"$f":"E14","v":0},0,0,{"$f":"G14","v":0},0,0,{"$f":"I14","v":0},0,0,{"$f":"K14","v":0},1642392,{"$f":"L14","v":1642392},1417406.67,0,null,{"$f":"O14","v":1296571.74},0,1451821.1099999999,{"$f":"R14","v":1566231.78},1790340.96,1782437.3599999999]
[null,null,null,null,null,null,null,null,null,null,null,null,null,null,null,null,null,null,null,null,null,null,"Maintenance",0,0,0,0,0,0,0,0,0,0,0,0,0,0,5118954,5118954,4879021.4200000018,0,null,5064914.8400000008,0,5263561.8999999994,5145408.12,5225959.47,5297809.8200000012]
[null,null,null,null,null,null,null,null,null,null,null,null,null,null,null,null,null,null,null,null,null,null,"Billing and Collecting",{"$f":"B19","v":0},0,0,0,{"$f":"E19","v":0},0,0,{"$f":"G19","v":0},0,0,{"$f":"I19","v":0},0,0,{"$f":"K19","v":0},{"$f":"L19","v":1090942},{"$f":"L19","v":1090942},964836.47999999986,0,null,{"$f":"O19","v":875601.71},0,874404.33000000007,{"$f":"R19","v":919934.89},{"$f":"S19","v":970386.84000000008},995414.1100000001]
[null,null,null,null,null,null,null,null,null,null,null,null,null,null,null,null,null,null,null,null,null,null,"Community Relations",0,0,0,0,0,0,0,0,0,0,0,0,0,{"$f":"K19","v":0},{"$f":"L20","v":22102},22102,24429.71,0,null,32308.39,0,47552.270000000004,{"$f":"R20","v":141890.12},94552.320000000007,96558]
[null,null,null,null,null,null,null,null,null,null,null,null,null,null,null,null,null,null,null,null,null,null,"Administrative and General",0,0,0,0,0,0,0,0,0,0,0,0,0,{"$f":"K21","v":0},{"$f":"L21","v":4430491},4430491,4529864.74,0,null,4534507,0,4494381.5999999996,{"$f":"R21","v":4361131.4399999995},4843215.04,5516062.7000000002]
[null,null,null,null,null,null,null,null,null,null,null,null,null,null,null,null,null,null,null,null,null,null,"Total",{"$f":"SUM(X30:X34)","v":0},{"$f":"SUM(Y30:Y34)","v":0},0,0,0,0,0,0,0,0,0,0,0,0,12304881,12304881,11815559.020000001,0,null,11803903.68,0,12131721.209999999,12134596.35,12924454.629999999,13688281.990000002]
[null,null,null,null,null,null,null,null,null,null,null,null,null,null,null,null,null,null,null,null,null,null,"%Change (year over year)",null,{"$f":"IF(ISERROR((Y35-X35)/X35), \"\", (Y35-X35)/X35)","v":""},null,{"$f":"IF(ISERROR((AA35-Z35)/Z35), \"\", (AA35-Z35)/Z35)","v":""},{"$f":"IF(ISERROR((AB35-Y35)/Y35), \"\", (AB35-Y35)/Y35)","v":""},null,{"$f":"IF(ISERROR((AD35-AC35)/AC35), \"\", (AD35-AC35)/AC35)","v":""},{"$f":"IF(ISERROR((AE35-AB35)/AB35), \"\", (AE35-AB35)/AB35)","v":""},null,{"$f":"IF(ISERROR((AG35-AF35)/AF35), \"\", (AG35-AF35)/AF35)","v":""},{"$f":"IF(ISERROR((AH35-AE35)/AE35), \"\", (AH35-AE35)/AE35)","v":""},null,{"$f":"IF(ISERROR((AJ35-AI35)/AI35), \"\", (AJ35-AI35)/AI35)","v":""},{"$f":"IF(ISERROR((AK35-AH35)/AH35), \"\", (AK35-AH35)/AH35)","v":""},null,{"$f":"IF(ISERROR((AM35-AL35)/AL35), \"\", (AM35-AL35)/AL35)","v":0},{"$f":"IF(ISERROR((AN35-AK35)/AK35), \"\", (AN35-AK35)/AK35)","v":""},null,{"$f":"IF(ISERROR((AP35-AO35)/AO35), \"\", (AP35-AO35)/AO35)","v":""},{"$f":"IF(ISERROR((AQ35-AN35)/AN35), \"\", (AQ35-AN35)/AN35)","v":-9.864399966411164E-4},null,{"$f":"IF(ISERROR((AS35-AQ35)/AQ35), \"\", (AS35-AQ35)/AQ35)","v":2.7771959081251952E-2},{"$f":"IF(ISERROR((AT35-AS35)/AS35), \"\", (AT35-AS35)/AS35)","v":2.3699357661060167E-4},{"$f":"IF(ISERROR((AU35-AT35)/AT35), \"\", (AU35-AT35)/AT35)","v":6.5091434211571389E-2},{"$f":"IF(ISERROR((AV35-AU35)/AU35), \"\", (AV35-AU35)/AU35)","v":5.9099388087681594E-2}]
[]
["Note:"]
[]
["1     Historical actuals going back to the last cost of service application are required to be entered by the applicant."]
["2     Recoverable OM&A that is included on these tables should be identical to the recoverable OM&A that is shown for the corresponding periods on Appendix 2-JB."]

{"sheet":"Hidden_OM&A Summary","index":33,"n_rows":91,"n_cols":8,"rows_kept":91,"cut":false,"hidden":true,"merged":[]}
["Utility Name","EB Number","Test Year","Bridge Year","Last Rebasing Year","Heading","Year","Amount"]
[{"$f":"'LDC Info'!$E$14","v":"Algoma Power Inc."},{"$f":"EBNUMBER","v":"EB-2019-0019"},{"$f":"TestYear","v":2020},{"$f":"BridgeYear","v":2019},{"$f":"RebaseYear","v":2015},"Operations",{"$f":"'App.2-JA_OM&A_Summary_Analys'!$B$12","v":"2010  Board Approved"},{"$f":"'App.2-JA_OM&A_Summary_Analys'!B$14","v":0}]
[{"$f":"'LDC Info'!$E$14","v":"Algoma Power Inc."},"EB-2019-0019",2020,2019,2015,"Maintenance",{"$f":"'App.2-JA_OM&A_Summary_Analys'!$B$12","v":"2010  Board Approved"},{"$f":"'App.2-JA_OM&A_Summary_Analys'!B$15","v":0}]
[{"$f":"'LDC Info'!$E$14","v":"Algoma Power Inc."},"EB-2019-0019",2020,2019,2015,"Billing and Collecting",{"$f":"'App.2-JA_OM&A_Summary_Analys'!$B$12","v":"2010  Board Approved"},{"$f":"'App.2-JA_OM&A_Summary_Analys'!B$19","v":0}]
[{"$f":"'LDC Info'!$E$14","v":"Algoma Power Inc."},"EB-2019-0019",2020,2019,2015,"Community Relations",{"$f":"'App.2-JA_OM&A_Summary_Analys'!$B$12","v":"2010  Board Approved"},{"$f":"'App.2-JA_OM&A_Summary_Analys'!B$20","v":0}]
[{"$f":"'LDC Info'!$E$14","v":"Algoma Power Inc."},"EB-2019-0019",2020,2019,2015,"Administrative and General",{"$f":"'App.2-JA_OM&A_Summary_Analys'!$B$12","v":"2010  Board Approved"},{"$f":"'App.2-JA_OM&A_Summary_Analys'!B$21","v":0}]
[{"$f":"'LDC Info'!$E$14","v":"Algoma Power Inc."},"EB-2019-0019",2020,2019,2015,"Operations",{"$f":"'App.2-JA_OM&A_Summary_Analys'!$C$12","v":"2010  Actuals"},{"$f":"'App.2-JA_OM&A_Summary_Analys'!C$14","v":0}]
[{"$f":"'LDC Info'!$E$14","v":"Algoma Power Inc."},"EB-2019-0019",2020,2019,2015,"Maintenance",{"$f":"'App.2-JA_OM&A_Summary_Analys'!$C$12","v":"2010  Actuals"},{"$f":"'App.2-JA_OM&A_Summary_Analys'!C$15","v":0}]
[{"$f":"'LDC Info'!$E$14","v":"Algoma Power Inc."},"EB-2019-0019",2020,2019,2015,"Billing and Collecting",{"$f":"'App.2-JA_OM&A_Summary_Analys'!$C$12","v":"2010  Actuals"},{"$f":"'App.2-JA_OM&A_Summary_Analys'!C$19","v":0}]
[{"$f":"'LDC Info'!$E$14","v":"Algoma Power Inc."},"EB-2019-0019",2020,2019,2015,"Community Relations",{"$f":"'App.2-JA_OM&A_Summary_Analys'!$C$12","v":"2010  Actuals"},{"$f":"'App.2-JA_OM&A_Summary_Analys'!C$20","v":0}]
[{"$f":"'LDC Info'!$E$14","v":"Algoma Power Inc."},"EB-2019-0019",2020,2019,2015,"Administrative and General",{"$f":"'App.2-JA_OM&A_Summary_Analys'!$C$12","v":"2010  Actuals"},{"$f":"'App.2-JA_OM&A_Summary_Analys'!C$21","v":0}]
[{"$f":"'LDC Info'!$E$14","v":"Algoma Power Inc."},"EB-2019-0019",2020,2019,2015,"Operations",{"$f":"'App.2-JA_OM&A_Summary_Analys'!$D$12","v":"2011  Board Approved"},{"$f":"'App.2-JA_OM&A_Summary_Analys'!D$14","v":0}]
[{"$f":"'LDC Info'!$E$14","v":"Algoma Power Inc."},"EB-2019-0019",2020,2019,2015,"Maintenance",{"$f":"'App.2-JA_OM&A_Summary_Analys'!$D$12","v":"2011  Board Approved"},{"$f":"'App.2-JA_OM&A_Summary_Analys'!D$15","v":0}]
[{"$f":"'LDC Info'!$E$14","v":"Algoma Power Inc."},"EB-2019-0019",2020,2019,2015,"Billing and Collecting",{"$f":"'App.2-JA_OM&A_Summary_Analys'!$D$12","v":"2011  Board Approved"},{"$f":"'App.2-JA_OM&A_Summary_Analys'!D$19","v":0}]
[{"$f":"'LDC Info'!$E$14","v":"Algoma Power Inc."},"EB-2019-0019",2020,2019,2015,"Community Relations",{"$f":"'App.2-JA_OM&A_Summary_Analys'!$D$12","v":"2011  Board Approved"},{"$f":"'App.2-JA_OM&A_Summary_Analys'!D$20","v":0}]
[{"$f":"'LDC Info'!$E$14","v":"Algoma Power Inc."},"EB-2019-0019",2020,2019,2015,"Administrative and General",{"$f":"'App.2-JA_OM&A_Summary_Analys'!$D$12","v":"2011  Board Approved"},{"$f":"'App.2-JA_OM&A_Summary_Analys'!D$21","v":0}]
[{"$f":"'LDC Info'!$E$14","v":"Algoma Power Inc."},"EB-2019-0019",2020,2019,2015,"Operations",{"$f":"'App.2-JA_OM&A_Summary_Analys'!$E$12","v":"2011  Actuals"},{"$f":"'App.2-JA_OM&A_Summary_Analys'!E$14","v":0}]
[{"$f":"'LDC Info'!$E$14","v":"Algoma Power Inc."},"EB-2019-0019",2020,2019,2015,"Maintenance",{"$f":"'App.2-JA_OM&A_Summary_Analys'!$E$12","v":"2011  Actuals"},{"$f":"'App.2-JA_OM&A_Summary_Analys'!E$15","v":0}]
[{"$f":"'LDC Info'!$E$14","v":"Algoma Power Inc."},"EB-2019-0019",2020,2019,2015,"Billing and Collecting",{"$f":"'App.2-JA_OM&A_Summary_Analys'!$E$12","v":"2011  Actuals"},{"$f":"'App.2-JA_OM&A_Summary_Analys'!E$19","v":0}]
[{"$f":"'LDC Info'!$E$14","v":"Algoma Power Inc."},"EB-2019-0019",2020,2019,2015,"Community Relations",{"$f":"'App.2-JA_OM&A_Summary_Analys'!$E$12","v":"2011  Actuals"},{"$f":"'App.2-JA_OM&A_Summary_Analys'!E$20","v":0}]
[{"$f":"'LDC Info'!$E$14","v":"Algoma Power Inc."},"EB-2019-0019",2020,2019,2015,"Administrative and General",{"$f":"'App.2-JA_OM&A_Summary_Analys'!$E$12","v":"2011  Actuals"},{"$f":"'App.2-JA_OM&A_Summary_Analys'!E$21","v":0}]
[{"$f":"'LDC Info'!$E$14","v":"Algoma Power Inc."},"EB-2019-0019",2020,2019,2015,"Operations",{"$f":"'App.2-JA_OM&A_Summary_Analys'!$F$12","v":"2012  Board Approved"},{"$f":"'App.2-JA_OM&A_Summary_Analys'!F$14","v":0}]
[{"$f":"'LDC Info'!$E$14","v":"Algoma Power Inc."},"EB-2019-0019",2020,2019,2015,"Maintenance",{"$f":"'App.2-JA_OM&A_Summary_Analys'!$F$12","v":"2012  Board Approved"},{"$f":"'App.2-JA_OM&A_Summary_Analys'!F$15","v":0}]
[{"$f":"'LDC Info'!$E$14","v":"Algoma Power Inc."},"EB-2019-0019",2020,2019,2015,"Billing and Collecting",{"$f":"'App.2-JA_OM&A_Summary_Analys'!$F$12","v":"2012  Board Approved"},{"$f":"'App.2-JA_OM&A_Summary_Analys'!F$19","v":0}]
[{"$f":"'LDC Info'!$E$14","v":"Algoma Power Inc."},"EB-2019-0019",2020,2019,2015,"Community Relations",{"$f":"'App.2-JA_OM&A_Summary_Analys'!$F$12","v":"2012  Board Approved"},{"$f":"'App.2-JA_OM&A_Summary_Analys'!F$20","v":0}]
[{"$f":"'LDC Info'!$E$14","v":"Algoma Power Inc."},"EB-2019-0019",2020,2019,2015,"Administrative and General",{"$f":"'App.2-JA_OM&A_Summary_Analys'!$F$12","v":"2012  Board Approved"},{"$f":"'App.2-JA_OM&A_Summary_Analys'!F$21","v":0}]
[{"$f":"'LDC Info'!$E$14","v":"Algoma Power Inc."},"EB-2019-0019",2020,2019,2015,"Operations",{"$f":"'App.2-JA_OM&A_Summary_Analys'!$G$12","v":"2012  Actuals"},{"$f":"'App.2-JA_OM&A_Summary_Analys'!G$14","v":0}]
[{"$f":"'LDC Info'!$E$14","v":"Algoma Power Inc."},"EB-2019-0019",2020,2019,2015,"Maintenance",{"$f":"'App.2-JA_OM&A_Summary_Analys'!$G$12","v":"2012  Actuals"},{"$f":"'App.2-JA_OM&A_Summary_Analys'!G$15","v":0}]
[{"$f":"'LDC Info'!$E$14","v":"Algoma Power Inc."},{"$f":"EBNUMBER","v":"EB-2019-0019"},{"$f":"TestYear","v":2020},{"$f":"BridgeYear","v":2019},{"$f":"RebaseYear","v":2015},"Billing and Collecting",{"$f":"'App.2-JA_OM&A_Summary_Analys'!$G$12","v":"2012  Actuals"},{"$f":"'App.2-JA_OM&A_Summary_Analys'!G$19","v":0}]
[{"$f":"'LDC Info'!$E$14","v":"Algoma Power Inc."},"EB-2019-0019",2020,2019,2015,"Community Relations",{"$f":"'App.2-JA_OM&A_Summary_Analys'!$G$12","v":"2012  Actuals"},{"$f":"'App.2-JA_OM&A_Summary_Analys'!G$20","v":0}]
[{"$f":"'LDC Info'!$E$14","v":"Algoma Power Inc."},"EB-2019-0019",2020,2019,2015,"Administrative and General",{"$f":"'App.2-JA_OM&A_Summary_Analys'!$G$12","v":"2012  Actuals"},{"$f":"'App.2-JA_OM&A_Summary_Analys'!G$21","v":0}]
[{"$f":"'LDC Info'!$E$14","v":"Algoma Power Inc."},"EB-2019-0019",2020,2019,2015,"Operations",{"$f":"'App.2-JA_OM&A_Summary_Analys'!$H$12","v":"2013  Board Approved"},{"$f":"'App.2-JA_OM&A_Summary_Analys'!H$14","v":0}]
[{"$f":"'LDC Info'!$E$14","v":"Algoma Power Inc."},"EB-2019-0019",2020,2019,2015,"Maintenance",{"$f":"'App.2-JA_OM&A_Summary_Analys'!$H$12","v":"2013  Board Approved"},{"$f":"'App.2-JA_OM&A_Summary_Analys'!H$15","v":0}]
[{"$f":"'LDC Info'!$E$14","v":"Algoma Power Inc."},"EB-2019-0019",2020,2019,2015,"Billing and Collecting",{"$f":"'App.2-JA_OM&A_Summary_Analys'!$H$12","v":"2013  Board Approved"},{"$f":"'App.2-JA_OM&A_Summary_Analys'!H$19","v":0}]
[{"$f":"'LDC Info'!$E$14","v":"Algoma Power Inc."},"EB-2019-0019",2020,2019,2015,"Community Relations",{"$f":"'App.2-JA_OM&A_Summary_Analys'!$H$12","v":"2013  Board Approved"},{"$f":"'App.2-JA_OM&A_Summary_Analys'!H$20","v":0}]
[{"$f":"'LDC Info'!$E$14","v":"Algoma Power Inc."},"EB-2019-0019",2020,2019,2015,"Administrative and General",{"$f":"'App.2-JA_OM&A_Summary_Analys'!$H$12","v":"2013  Board Approved"},{"$f":"'App.2-JA_OM&A_Summary_Analys'!H$21","v":0}]
[{"$f":"'LDC Info'!$E$14","v":"Algoma Power Inc."},"EB-2019-0019",2020,2019,2015,"Operations",{"$f":"'App.2-JA_OM&A_Summary_Analys'!$I$12","v":"2013  Actuals"},{"$f":"'App.2-JA_OM&A_Summary_Analys'!I$14","v":0}]
[{"$f":"'LDC Info'!$E$14","v":"Algoma Power Inc."},"EB-2019-0019",2020,2019,2015,"Maintenance",{"$f":"'App.2-JA_OM&A_Summary_Analys'!$I$12","v":"2013  Actuals"},{"$f":"'App.2-JA_OM&A_Summary_Analys'!I$15","v":0}]
[{"$f":"'LDC Info'!$E$14","v":"Algoma Power Inc."},"EB-2019-0019",2020,2019,2015,"Billing and Collecting",{"$f":"'App.2-JA_OM&A_Summary_Analys'!$I$12","v":"2013  Actuals"},{"$f":"'App.2-JA_OM&A_Summary_Analys'!I$19","v":0}]
[{"$f":"'LDC Info'!$E$14","v":"Algoma Power Inc."},"EB-2019-0019",2020,2019,2015,"Community Relations",{"$f":"'App.2-JA_OM&A_Summary_Analys'!$I$12","v":"2013  Actuals"},{"$f":"'App.2-JA_OM&A_Summary_Analys'!I$20","v":0}]
[{"$f":"'LDC Info'!$E$14","v":"Algoma Power Inc."},"EB-2019-0019",2020,2019,2015,"Administrative and General",{"$f":"'App.2-JA_OM&A_Summary_Analys'!$I$12","v":"2013  Actuals"},{"$f":"'App.2-JA_OM&A_Summary_Analys'!I$21","v":0}]
[{"$f":"'LDC Info'!$E$14","v":"Algoma Power Inc."},"EB-2019-0019",2020,2019,2015,"Operations",{"$f":"'App.2-JA_OM&A_Summary_Analys'!$J$12","v":"2014  Board Approved"},{"$f":"'App.2-JA_OM&A_Summary_Analys'!J$14","v":0}]
[{"$f":"'LDC Info'!$E$14","v":"Algoma Power Inc."},"EB-2019-0019",2020,2019,2015,"Maintenance",{"$f":"'App.2-JA_OM&A_Summary_Analys'!$J$12","v":"2014  Board Approved"},{"$f":"'App.2-JA_OM&A_Summary_Analys'!J$15","v":0}]
[{"$f":"'LDC Info'!$E$14","v":"Algoma Power Inc."},"EB-2019-0019",2020,2019,2015,"Billing and Collecting",{"$f":"'App.2-JA_OM&A_Summary_Analys'!$J$12","v":"2014  Board Approved"},{"$f":"'App.2-JA_OM&A_Summary_Analys'!J$19","v":0}]
[{"$f":"'LDC Info'!$E$14","v":"Algoma Power Inc."},"EB-2019-0019",2020,2019,2015,"Community Relations",{"$f":"'App.2-JA_OM&A_Summary_Analys'!$J$12","v":"2014  Board Approved"},{"$f":"'App.2-JA_OM&A_Summary_Analys'!J$20","v":0}]
[{"$f":"'LDC Info'!$E$14","v":"Algoma Power Inc."},"EB-2019-0019",2020,2019,2015,"Administrative and General",{"$f":"'App.2-JA_OM&A_Summary_Analys'!$J$12","v":"2014  Board Approved"},{"$f":"'App.2-JA_OM&A_Summary_Analys'!J$21","v":0}]
[{"$f":"'LDC Info'!$E$14","v":"Algoma Power Inc."},"EB-2019-0019",2020,2019,2015,"Operations",{"$f":"'App.2-JA_OM&A_Summary_Analys'!$K$12","v":"2014  Actuals"},{"$f":"'App.2-JA_OM&A_Summary_Analys'!K$14","v":0}]
[{"$f":"'LDC Info'!$E$14","v":"Algoma Power Inc."},"EB-2019-0019",2020,2019,2015,"Maintenance",{"$f":"'App.2-JA_OM&A_Summary_Analys'!$K$12","v":"2014  Actuals"},{"$f":"'App.2-JA_OM&A_Summary_Analys'!K$15","v":0}]
[{"$f":"'LDC Info'!$E$14","v":"Algoma Power Inc."},"EB-2019-0019",2020,2019,2015,"Billing and Collecting",{"$f":"'App.2-JA_OM&A_Summary_Analys'!$K$12","v":"2014  Actuals"},{"$f":"'App.2-JA_OM&A_Summary_Analys'!K$19","v":0}]
[{"$f":"'LDC Info'!$E$14","v":"Algoma Power Inc."},"EB-2019-0019",2020,2019,2015,"Community Relations",{"$f":"'App.2-JA_OM&A_Summary_Analys'!$K$12","v":"2014  Actuals"},{"$f":"'App.2-JA_OM&A_Summary_Analys'!K$20","v":0}]
[{"$f":"'LDC Info'!$E$14","v":"Algoma Power Inc."},{"$f":"EBNUMBER","v":"EB-2019-0019"},{"$f":"TestYear","v":2020},{"$f":"BridgeYear","v":2019},{"$f":"RebaseYear","v":2015},"Administrative and General",{"$f":"'App.2-JA_OM&A_Summary_Analys'!$K$12","v":"2014  Actuals"},{"$f":"'App.2-JA_OM&A_Summary_Analys'!K$21","v":0}]
[{"$f":"'LDC Info'!$E$14","v":"Algoma Power Inc."},"EB-2019-0019",2020,2019,2015,"Operations",{"$f":"'App.2-JA_OM&A_Summary_Analys'!$L$12","v":"2015 Last Rebasing Year  Board Approved"},{"$f":"'App.2-JA_OM&A_Summary_Analys'!L$14","v":1642392}]
[{"$f":"'LDC Info'!$E$14","v":"Algoma Power Inc."},"EB-2019-0019",2020,2019,2015,"Maintenance",{"$f":"'App.2-JA_OM&A_Summary_Analys'!$L$12","v":"2015 Last Rebasing Year  Board Approved"},{"$f":"'App.2-JA_OM&A_Summary_Analys'!L$15","v":5118954}]
[{"$f":"'LDC Info'!$E$14","v":"Algoma Power Inc."},"EB-2019-0019",2020,2019,2015,"Billing and Collecting",{"$f":"'App.2-JA_OM&A_Summary_Analys'!$L$12","v":"2015 Last Rebasing Year  Board Approved"},{"$f":"'App.2-JA_OM&A_Summary_Analys'!L$19","v":1090942}]
[{"$f":"'LDC Info'!$E$14","v":"Algoma Power Inc."},"EB-2019-0019",2020,2019,2015,"Community Relations",{"$f":"'App.2-JA_OM&A_Summary_Analys'!$L$12","v":"2015 Last Rebasing Year  Board Approved"},{"$f":"'App.2-JA_OM&A_Summary_Analys'!L$20","v":22102}]
[{"$f":"'LDC Info'!$E$14","v":"Algoma Power Inc."},"EB-2019-0019",2020,2019,2015,"Administrative and General",{"$f":"'App.2-JA_OM&A_Summary_Analys'!$L$12","v":"2015 Last Rebasing Year  Board Approved"},{"$f":"'App.2-JA_OM&A_Summary_Analys'!L$21","v":4430491}]
[{"$f":"'LDC Info'!$E$14","v":"Algoma Power Inc."},"EB-2019-0019",2020,2019,2015,"Operations",{"$f":"'App.2-JA_OM&A_Summary_Analys'!$M$12","v":"2015 Last Rebasing Year  Actuals"},{"$f":"'App.2-JA_OM&A_Summary_Analys'!M$14","v":1417406.67}]
[{"$f":"'LDC Info'!$E$14","v":"Algoma Power Inc."},"EB-2019-0019",2020,2019,2015,"Maintenance",{"$f":"'App.2-JA_OM&A_Summary_Analys'!$M$12","v":"2015 Last Rebasing Year  Actuals"},{"$f":"'App.2-JA_OM&A_Summary_Analys'!M$15","v":4879021.4200000018}]
[{"$f":"'LDC Info'!$E$14","v":"Algoma Power Inc."},"EB-2019-0019",2020,2019,2015,"Billing and Collecting",{"$f":"'App.2-JA_OM&A_Summary_Analys'!$M$12","v":"2015 Last Rebasing Year  Actuals"},{"$f":"'App.2-JA_OM&A_Summary_Analys'!M$19","v":964836.47999999986}]
[{"$f":"'LDC Info'!$E$14","v":"Algoma Power Inc."},"EB-2019-0019",2020,2019,2015,"Community Relations",{"$f":"'App.2-JA_OM&A_Summary_Analys'!$M$12","v":"2015 Last Rebasing Year  Actuals"},{"$f":"'App.2-JA_OM&A_Summary_Analys'!M$20","v":24429.71}]
[{"$f":"'LDC Info'!$E$14","v":"Algoma Power Inc."},"EB-2019-0019",2020,2019,2015,"Administrative and General",{"$f":"'App.2-JA_OM&A_Summary_Analys'!$M$12","v":"2015 Last Rebasing Year  Actuals"},{"$f":"'App.2-JA_OM&A_Summary_Analys'!M$21","v":4529864.74}]
[{"$f":"'LDC Info'!$E$14","v":"Algoma Power Inc."},"EB-2019-0019",2020,2019,2015,"Operations",{"$f":"'App.2-JA_OM&A_Summary_Analys'!$N$12","v":"2016  Board Approved"},{"$f":"'App.2-JA_OM&A_Summary_Analys'!N$14","v":0}]
[{"$f":"'LDC Info'!$E$14","v":"Algoma Power Inc."},"EB-2019-0019",2020,2019,2015,"Maintenance",{"$f":"'App.2-JA_OM&A_Summary_Analys'!$N$12","v":"2016  Board Approved"},{"$f":"'App.2-JA_OM&A_Summary_Analys'!N$15","v":0}]
[{"$f":"'LDC Info'!$E$14","v":"Algoma Power Inc."},"EB-2019-0019",2020,2019,2015,"Billing and Collecting",{"$f":"'App.2-JA_OM&A_Summary_Analys'!$N$12","v":"2016  Board Approved"},{"$f":"'App.2-JA_OM&A_Summary_Analys'!N$19","v":0}]
[{"$f":"'LDC Info'!$E$14","v":"Algoma Power Inc."},"EB-2019-0019",2020,2019,2015,"Community Relations",{"$f":"'App.2-JA_OM&A_Summary_Analys'!$N$12","v":"2016  Board Approved"},{"$f":"'App.2-JA_OM&A_Summary_Analys'!N$20","v":0}]
[{"$f":"'LDC Info'!$E$14","v":"Algoma Power Inc."},"EB-2019-0019",2020,2019,2015,"Administrative and General",{"$f":"'App.2-JA_OM&A_Summary_Analys'!$N$12","v":"2016  Board Approved"},{"$f":"'App.2-JA_OM&A_Summary_Analys'!N$21","v":0}]
[{"$f":"'LDC Info'!$E$14","v":"Algoma Power Inc."},"EB-2019-0019",2020,2019,2015,"Operations",{"$f":"'App.2-JA_OM&A_Summary_Analys'!$O$12","v":"2016  Actuals"},{"$f":"'App.2-JA_OM&A_Summary_Analys'!O$14","v":1296571.74}]
[{"$f":"'LDC Info'!$E$14","v":"Algoma Power Inc."},"EB-2019-0019",2020,2019,2015,"Maintenance",{"$f":"'App.2-JA_OM&A_Summary_Analys'!$O$12","v":"2016  Actuals"},{"$f":"'App.2-JA_OM&A_Summary_Analys'!O$15","v":5064914.8400000008}]
[{"$f":"'LDC Info'!$E$14","v":"Algoma Power Inc."},"EB-2019-0019",2020,2019,2015,"Billing and Collecting",{"$f":"'App.2-JA_OM&A_Summary_Analys'!$O$12","v":"2016  Actuals"},{"$f":"'App.2-JA_OM&A_Summary_Analys'!O$19","v":875601.71}]
[{"$f":"'LDC Info'!$E$14","v":"Algoma Power Inc."},"EB-2019-0019",2020,2019,2015,"Community Relations",{"$f":"'App.2-JA_OM&A_Summary_Analys'!$O$12","v":"2016  Actuals"},{"$f":"'App.2-JA_OM&A_Summary_Analys'!O$20","v":32308.39}]
[{"$f":"'LDC Info'!$E$14","v":"Algoma Power Inc."},"EB-2019-0019",2020,2019,2015,"Administrative and General",{"$f":"'App.2-JA_OM&A_Summary_Analys'!$O$12","v":"2016  Actuals"},{"$f":"'App.2-JA_OM&A_Summary_Analys'!O$21","v":4534507}]
[{"$f":"'LDC Info'!$E$14","v":"Algoma Power Inc."},{"$f":"EBNUMBER","v":"EB-2019-0019"},{"$f":"TestYear","v":2020},{"$f":"BridgeYear","v":2019},{"$f":"RebaseYear","v":2015},"Operations",{"$f":"'App.2-JA_OM&A_Summary_Analys'!$P$12","v":"2017  Board Approved"},{"$f":"'App.2-JA_OM&A_Summary_Analys'!P$14","v":0}]
[{"$f":"'LDC Info'!$E$14","v":"Algoma Power Inc."},"EB-2019-0019",2020,2019,2015,"Maintenance",{"$f":"'App.2-JA_OM&A_Summary_Analys'!$P$12","v":"2017  Board Approved"},{"$f":"'App.2-JA_OM&A_Summary_Analys'!P$15","v":0}]
[{"$f":"'LDC Info'!$E$14","v":"Algoma Power Inc."},"EB-2019-0019",2020,2019,2015,"Billing and Collecting",{"$f":"'App.2-JA_OM&A_Summary_Analys'!$P$12","v":"2017  Board Approved"},{"$f":"'App.2-JA_OM&A_Summary_Analys'!P$19","v":0}]
[{"$f":"'LDC Info'!$E$14","v":"Algoma Power Inc."},"EB-2019-0019",2020,2019,2015,"Community Relations",{"$f":"'App.2-JA_OM&A_Summary_Analys'!$P$12","v":"2017  Board Approved"},{"$f":"'App.2-JA_OM&A_Summary_Analys'!P$20","v":0}]
[{"$f":"'LDC Info'!$E$14","v":"Algoma Power Inc."},"EB-2019-0019",2020,2019,2015,"Administrative and General",{"$f":"'App.2-JA_OM&A_Summary_Analys'!$P$12","v":"2017  Board Approved"},{"$f":"'App.2-JA_OM&A_Summary_Analys'!P$21","v":0}]
[{"$f":"'LDC Info'!$E$14","v":"Algoma Power Inc."},"EB-2019-0019",2020,2019,2015,"Operations",{"$f":"'App.2-JA_OM&A_Summary_Analys'!$Q$12","v":"2017  Actuals"},{"$f":"'App.2-JA_OM&A_Summary_Analys'!Q$14","v":1451821.1099999999}]
[{"$f":"'LDC Info'!$E$14","v":"Algoma Power Inc."},"EB-2019-0019",2020,2019,2015,"Maintenance",{"$f":"'App.2-JA_OM&A_Summary_Analys'!$Q$12","v":"2017  Actuals"},{"$f":"'App.2-JA_OM&A_Summary_Analys'!Q$15","v":5263561.8999999994}]
[{"$f":"'LDC Info'!$E$14","v":"Algoma Power Inc."},"EB-2019-0019",2020,2019,2015,"Billing and Collecting",{"$f":"'App.2-JA_OM&A_Summary_Analys'!$Q$12","v":"2017  Actuals"},{"$f":"'App.2-JA_OM&A_Summary_Analys'!Q$19","v":874404.33000000007}]
[{"$f":"'LDC Info'!$E$14","v":"Algoma Power Inc."},"EB-2019-0019",2020,2019,2015,"Community Relations",{"$f":"'App.2-JA_OM&A_Summary_Analys'!$Q$12","v":"2017  Actuals"},{"$f":"'App.2-JA_OM&A_Summary_Analys'!Q$20","v":47552.270000000004}]
[{"$f":"'LDC Info'!$E$14","v":"Algoma Power Inc."},"EB-2019-0019",2020,2019,2015,"Administrative and General",{"$f":"'App.2-JA_OM&A_Summary_Analys'!$Q$12","v":"2017  Actuals"},{"$f":"'App.2-JA_OM&A_Summary_Analys'!Q$21","v":4494381.5999999996}]
[{"$f":"'LDC Info'!$E$14","v":"Algoma Power Inc."},"EB-2019-0019",2020,2019,2015,"Operations",{"$f":"'App.2-JA_OM&A_Summary_Analys'!$S$12","v":"2019 Bridge Year"},{"$f":"'App.2-JA_OM&A_Summary_Analys'!S$14","v":1790340.96}]
[{"$f":"'LDC Info'!$E$14","v":"Algoma Power Inc."},"EB-2019-0019",2020,2019,2015,"Maintenance",{"$f":"'App.2-JA_OM&A_Summary_Analys'!$S$12","v":"2019 Bridge Year"},{"$f":"'App.2-JA_OM&A_Summary_Analys'!S$15","v":5225959.47}]
[{"$f":"'LDC Info'!$E$14","v":"Algoma Power Inc."},"EB-2019-0019",2020,2019,2015,"Billing and Collecting",{"$f":"'App.2-JA_OM&A_Summary_Analys'!$S$12","v":"2019 Bridge Year"},{"$f":"'App.2-JA_OM&A_Summary_Analys'!S$19","v":970386.84000000008}]
[{"$f":"'LDC Info'!$E$14","v":"Algoma Power Inc."},"EB-2019-0019",2020,2019,2015,"Community Relations",{"$f":"'App.2-JA_OM&A_Summary_Analys'!$S$12","v":"2019 Bridge Year"},{"$f":"'App.2-JA_OM&A_Summary_Analys'!S$20","v":94552.320000000007}]
[{"$f":"'LDC Info'!$E$14","v":"Algoma Power Inc."},"EB-2019-0019",2020,2019,2015,"Administrative and General",{"$f":"'App.2-JA_OM&A_Summary_Analys'!$S$12","v":"2019 Bridge Year"},{"$f":"'App.2-JA_OM&A_Summary_Analys'!S$21","v":4843215.04}]
[{"$f":"'LDC Info'!$E$14","v":"Algoma Power Inc."},"EB-2019-0019",2020,2019,2015,"Operations",{"$f":"'App.2-JA_OM&A_Summary_Analys'!$T$12","v":"2020 Test Year"},{"$f":"'App.2-JA_OM&A_Summary_Analys'!T14","v":1782437.3599999999}]
[{"$f":"'LDC Info'!$E$14","v":"Algoma Power Inc."},"EB-2019-0019",2020,2019,2015,"Maintenance",{"$f":"'App.2-JA_OM&A_Summary_Analys'!$T$12","v":"2020 Test Year"},{"$f":"'App.2-JA_OM&A_Summary_Analys'!T15","v":5297809.8200000012}]
[{"$f":"'LDC Info'!$E$14","v":"Algoma Power Inc."},"EB-2019-0019",2020,2019,2015,"Billing and Collecting",{"$f":"'App.2-JA_OM&A_Summary_Analys'!$T$12","v":"2020 Test Year"},{"$f":"'App.2-JA_OM&A_Summary_Analys'!T19","v":995414.1100000001}]
[{"$f":"'LDC Info'!$E$14","v":"Algoma Power Inc."},"EB-2019-0019",2020,2019,2015,"Community Relations",{"$f":"'App.2-JA_OM&A_Summary_Analys'!$T$12","v":"2020 Test Year"},{"$f":"'App.2-JA_OM&A_Summary_Analys'!T20","v":96558}]
[{"$f":"'LDC Info'!$E$14","v":"Algoma Power Inc."},"EB-2019-0019",2020,2019,2015,"Administrative and General",{"$f":"'App.2-JA_OM&A_Summary_Analys'!$T$12","v":"2020 Test Year"},{"$f":"'App.2-JA_OM&A_Summary_Analys'!T21","v":5516062.7000000002}]

{"sheet":"App.2-JB_OM&A_Cost _Drivers","index":34,"n_rows":44,"n_cols":7,"rows_kept":44,"cut":false,"hidden":false,"merged":[[9,0,9,5],[10,0,10,5],[46,1,46,5],[41,1,41,6],[42,1,42,6],[43,1,45,6]]}
[null,null,null,null,null,"File Number:",{"$f":"EBNUMBER","v":"EB-2019-0019"}]
[null,null,null,null,null,"Exhibit:",4]
[null,null,null,null,null,"Tab:"]
[null,null,null,null,null,"Schedule:"]
[null,null,null,null,null,"Page:"]
[]
[null,null,null,null,null,"Date:","2019-05-17"]
[]
[]
["Appendix 2-JB"]
[{"$f":"\"Recoverable OM&A Cost Driver Table\" & CHAR(185)&CHAR(183)&CHAR(179)","v":"Recoverable OM&A Cost Driver Table¹·³"}]
[]
["OM&A",{"$f":"\"Last Rebasing Year (\"&RebaseYear&\" Actuals)\"","v":"Last Rebasing Year (2015 Actuals)"},{"$f":"BridgeYear -3 & \" Actuals\"","v":"2016 Actuals"},{"$f":"BridgeYear -2 & \" Actuals\"","v":"2017 Actuals"},{"$f":"BridgeYear -1 & \" Actuals\"","v":"2018 Actuals"},{"$f":"BridgeYear & \" Bridge Year\"","v":"2019 Bridge Year"},{"$f":"TestYear & \" Test Year\"","v":"2020 Test Year"}]
["Reporting Basis","MIFRS","MIFRS","MIFRS","MIFRS","MIFRS","MIFRS"]
[{"$f":"\"Opening Balance\" & CHAR(178)","v":"Opening Balance²"},12304881,{"$f":"B38","v":11815559.020000001},{"$f":"C38","v":11803903.700000003},{"$f":"D38","v":12131720.91},{"$f":"E38","v":12134596.26},{"$f":"F38","v":12924454.889999999}]
["Vehicle Depreciation Credit",258000]
["Load Dispatching",-66000]
["AMI Metering Costs",-44000,33000,38000]
["Outages",-148000,121000,147000,-273000]
["Right of Way Maintenance Program",-70000,116000,62000,207000]
["Miscellaneous Customer Accounts Expenses",-89000,-52000,-13000,77000]
["G&A Outside Services Employed",-80000,231000,-122000]
["Technical Services Supervisor Vacancy",null,-47000,47000]
["Overhead Lines and Feeders Maintenance - Labour",null,-48000,30000,23000,22000]
["Regional Manager",null,-148000,110000,25000]
["Utilityperson Hire",null,null,-60000,-60000,105000]
["Customer Engagement",null,null,null,109000,-74000]
["Maintenance on Poles, Towers and Fixtures, and Overhead Conductors and Devices",null,null,null,-44000,78000]
["Joint Use Pole Rental Paid",null,null,null,null,40000]
["Right of Way Land Fees",null,null,null,null,47000]
["Sault Ste Marie Building Rent",null,null,null,null,null,341000]
["Regulatory Expenses",null,null,null,null,null,155000]
["Shared Services Administrative Services From CNPI Distribution",null,null,116000,-214000,294000,71000]
["Dubreuilville Interim License Internal Effort ",null,null,-109000,40000,19000,50000]
["Miscellaneous",-250321.97999999858,-217655.31999999844,81817.209999997169,112875.34999999963,258858.62999999896,135732.3900000006]
[]
[]
[{"$f":"\"Closing Balance\"&CHAR(178)","v":"Closing Balance²"},{"$f":"SUM(B15:B37)","v":11815559.020000001},11803903.700000003,12131720.91,12134596.26,12924454.889999999,13677187.279999999]
[]
["Notes:"]
[]
[1,"For each year, a detailed explanation for each cost driver and associated amount is requied in Exhibit 4."]
[2,"Opening Balance for \"Last Rebasing Year\" (cell B15) should be equal to the Board-Approved amount. For purposes of assessing incremental cost drivers, the closing balance for each year becomes the opening balance for the next year."]
[3,"If it has been more than four years since the applicant last filed a cost of service application, additional years of historical actuals should be incorporated into the table, as necessary, to go back to the last cost of service application.  If the applicant last filed a cost of service application less than four years ago, a minimum of three years of actual information is required."]

{"sheet":"App.2-JC_OMA Programs","index":35,"n_rows":52,"n_cols":10,"rows_kept":52,"cut":false,"hidden":false,"merged":[[54,0,55,8],[8,0,8,7],[9,0,9,7],[11,0,11,7],[52,0,52,7],[50,0,50,8],[51,0,51,8]]}
[null,null,null,null,null,null,null,"File Number:",{"$f":"EBNUMBER","v":"EB-2019-0019"}]
[null,null,null,null,null,null,null,"Exhibit:",4]
[null,null,null,null,null,null,null,"Tab:"]
[null,null,null,null,null,null,null,"Schedule:"]
[null,null,null,null,null,null,null,"Page:"]
[]
[null,null,null,null,null,null,null,"Date:","2019-05-17"]
[]
["Appendix 2-JC"]
["OM&A Programs Table"]
[]
[]
["Programs",{"$f":"\"Last Rebasing Year (\" & RebaseYear & \" Board-Approved)\"","v":"Last Rebasing Year (2015 Board-Approved)"},{"$f":"\"Last Rebasing Year (\" & RebaseYear & \" Actuals)\"","v":"Last Rebasing Year (2015 Actuals)"},{"$f":"BridgeYear-3&\" Actuals\"","v":"2016 Actuals"},{"$f":"BridgeYear -2 & \" Actuals\"","v":"2017 Actuals"},{"$f":"BridgeYear -1 & \" Actuals\"","v":"2018 Actuals"},{"$f":"BridgeYear & \" Bridge Year\"","v":"2019 Bridge Year"},{"$f":"TestYear & \" Test Year\"","v":"2020 Test Year"},{"$f":"\"Variance \n(Test Year vs. \" & F13 &\")\"","v":"Variance \n(Test Year vs. 2018 Actuals)"},{"$f":"\"Variance \n(Test Year vs. \" & B13","v":"Variance \n(Test Year vs. Last Rebasing Year (2015 Board-Approved)"}]
["Reporting Basis","MIFRS","MIFRS","MIFRS","MIFRS","MIFRS","MIFRS","MIFRS","MIFRS","MIFRS"]
["Customer Focus"]
["Customer Service, Mailing Costs, Billing and Collections, LEAP",908819,809242.39,728128.34,721551.82000000007,779344.37,849591.39999999991,848295.71,{"$f":"H16-F16","v":68951.339999999967},{"$f":"H16-B16","v":-60523.290000000037}]
["Community Relations",22102,24429.71,32308.39,47552.270000000004,141890.12,94552.320000000007,96558,{"$f":"H17-F17","v":-45332.119999999995},74456]
["Bad Debts",100000,64250.83,62003.59,49190.36,43554.58,71000.039999999994,71000.039999999994,27445.459999999992,-28999.960000000006]
["Meter Reading",106363,115582.26,117110.78,131602.15,124975.94,77735.399999999994,104058.36,{"$f":"H19-F19","v":-20917.580000000002},{"$f":"H19-B19","v":-2304.6399999999994}]
[null,null,null,null,null,null,null,null,0,0]
[null,null,null,null,null,null,null,null,0,0]
["Sub-Total",{"$f":"SUM(B16:B21)","v":1137284},{"$f":"SUM(C16:C21)","v":1013505.19},939551.1,949896.60000000009,1089765.01,1092879.1599999999,1119912.1100000001,30147.100000000093,-17371.889999999898]
["Operational Effectiveness"]
["Stations",329020,243663.80000000002,169781.33999999997,141119.17000000001,198821.18,190271.4,201225.24,2404.0599999999977,{"$f":"H24-B24","v":-127794.76000000001}]
["Load Dispatching",106000,39765.64,40668.49,127236.97,135356.12,157586.51999999999,165702.12,30346,59702.119999999995]
["Supervision and Engineering",209996,196954.90999999997,166715.55000000002,206344.23,281939.43,300319.76,246582.48,-35356.949999999983,36586.48000000001]
["Meters Maintenance ",839470,755168.1100000001,776308.91999999993,835154.61,752356.7,844548.91999999993,846102.96,93746.260000000009,6632.9599999999627]
["Overhead Lines and Feeders",1287589,1202397.95,1307559.72,1425626.04,1157006.8500000001,1258907.92,1321533.28,164526.42999999993,33944.280000000028]
["Distribution Transformers",27197,16045.369999999999,10936.83,2775.88,3519.91,15412.56,17446.080000000002,13926.170000000002,-9750.9199999999983]
["Right of Way Maintenance Program",3301180,3231088.08,3346740.7,3409082.31,3616124.33,3578067.03,3571764.14,-44360.189999999944,270584.14000000013]
["Underground Lines, Feeders, and Services",37102,13551.82,2963.59,9926.5600000000013,10293.18,12529.68,14466.119999999999,4172.9399999999987,-22635.88]
["Poles Towers & Fixtures",174034,127827.42,150750.29,121216.64,101800.65,129055.92,130195.2,28394.550000000003,-43838.8]
["Salaries, Wages and Benefits for Administrative Services",2484276,2704652.29,2521174.56,2621314.1,2510806.8800000004,2966459.7399999998,3080167.6099999994,569360.72999999905,595891.6099999994]
["Other External Administrative Services",478490,398333.96,629515.54,507228.75,512310.02,434790.12,441193.68,-71116.340000000026,-37296.320000000007]
["Rent and Maintenance of General Plant",869183,836940.13,858253.86,868095.61,886554.05,903530.13,1287714.69,401160.6399999999,418531.68999999994]
["Other Operating and Maintenance",449758,469964.99,389061.15,436900.6,454421.55,529600.72,565229.55999999994,110808.00999999995,115471.55999999994]
["Other General and Admin",358416,324707.80000000005,295859.8,314598.89999999997,292393.67,358915.49000000005,361169.6,68775.929999999993,2753.5999999999767]
[null,null,null,null,null,null,null,null,0,0]
["Sub-Total",{"$f":"SUM(B24:B38)","v":10951711},10561062.270000003,10666290.340000002,11026620.369999999,10913704.520000001,11679995.91,12250492.76,1336788.2399999984,1298781.7599999998]
["Public and Regulatory Responsiveness"]
["Regulatory & Compliance ",215886,240991.56,198062.24,155204.24,131126.82,151579.56,306782.52,175655.7,{"$f":"H41-B41","v":90896.520000000019}]
[null,null,null,null,null,null,null,null,0,0]
[null,null,null,null,null,null,null,null,0,0]
[null,null,null,null,null,null,null,null,0,0]
[null,null,null,null,null,null,null,null,0,0]
["Miscellaneous",null,null,null,null,null,null,null,0,{"$f":"H46-B46","v":0}]
["Total",{"$f":"SUMPRODUCT(--($A15:$A46=\"Sub-Total\"), B$15:B$46)+B46+B41","v":12304881},{"$f":"SUMPRODUCT(--($A15:$A46=\"Sub-Total\"), C$15:C$46)+C46+C41","v":11815559.020000003},11803903.680000002,12131721.209999999,12134596.350000001,12924454.630000001,13677187.389999999,{"$f":"H47-F47","v":1542591.0399999972},1372306.3899999987]
[]
["Notes:"]
[]
["1   Please provide a breakdown of the major components of each OM&A Program undertaken in each year.  Please ensure that all Programs below the materiality threshold are included in the miscellaneous line.  Add more Programs as required."]
["2   The applicant should group projects appropriately and avoid presentations that result in classification of significant components of the OM&A budget in the miscellaneous category"]

{"sheet":"App.2-K_Employee Costs","index":36,"n_rows":31,"n_cols":26,"rows_kept":31,"cut":false,"hidden":false,"merged":[[3,0,3,23],[31,0,31,25],[24,0,24,25],[8,0,8,25],[9,0,9,25],[12,0,12,25],[16,0,16,25],[20,0,20,25],[29,0,29,25],[30,0,30,25]]}
[null,null,null,null,null,null,null,null,null,null,null,null,null,null,null,null,null,null,null,null,null,null,null,null,"File Number:",{"$f":"EBNUMBER","v":"EB-2019-0019"}]
[null,null,null,null,null,null,null,null,null,null,null,null,null,null,null,null,null,null,null,null,null,null,null,null,"Exhibit:",4]
[null,null,null,null,null,null,null,null,null,null,null,null,null,null,null,null,null,null,null,null,null,null,null,null,"Tab:"]
["TO BE UPDATED AT THE DRAFT RATE ORDER STAGE",null,null,null,null,null,null,null,null,null,null,null,null,null,null,null,null,null,null,null,null,null,null,null,"Schedule:"]
[null,null,null,null,null,null,null,null,null,null,null,null,null,null,null,null,null,null,null,null,null,null,null,null,"Page:"]
[]
[null,null,null,null,null,null,null,null,null,null,null,null,null,null,null,null,null,null,null,null,null,null,null,null,"Date:","2019-09-24"]
[]
["Appendix 2-K"]
["Employee Costs"]
[]
[null,"Last Rebasing Year (2010 Board Approved)","Last Rebasing Year (2010 Actuals)","Last Rebasing Year (2011 Board Approved)","Last Rebasing Year (2011 Actuals)","2011 Actuals","Last Rebasing Year (2012 Board Approved)","Last Rebasing Year (2012 Actuals)","2012 Actuals","Last Rebasing Year (2013 Board Approved)","Last Rebasing Year (2013 Actuals)","2013 Actuals","Last Rebasing Year (2014 Board Approved)","Last Rebasing Year (2014 Actuals)","2014 Actuals","Last Rebasing Year (2015 Board Approved)","Last Rebasing Year (2015 Board Approved Restated)","2015 Actuals","Last Rebasing Year (2016 Board Approved)","2016 Actuals",{"$f":"BridgeYear -2 & \" Actuals\"","v":"2017 Actuals"},"Last Rebasing Year (2017 Board Approved)","Last Rebasing Year (2017 Actuals)",{"$f":"BridgeYear -1 & \" Actuals\"","v":"2018 Actuals"},{"$f":"BridgeYear & \" Bridge Year\"","v":"2019 Bridge Year"},{"$f":"TestYear & \" Test Year\"","v":"2020 Test Year"}]
["Number of Employees (FTEs including Part-Time)1"]
["Management (including executive)",null,null,null,null,null,null,null,null,null,null,null,null,null,null,15,15,12,null,11,10,null,null,11,11,11]
["Non-Management (union and non-union)",null,null,null,null,null,null,null,null,null,null,null,null,null,null,66,59,59,null,59,59,null,null,58,60,59]
["Total",{"$f":"SUM(B14:B15)","v":0},0,0,0,0,0,0,0,0,0,0,0,0,0,81,74,71,0,70,69,0,0,69,71,70]
["Total Salary and Wages including ovetime and incentive pay"]
["Management (including executive)",null,null,null,null,null,null,null,null,null,null,null,null,null,null,1663095,1663095,1593050.2012253248,null,1527913.1889547636,1365026.0669289236,null,null,1464209.3714341638,1560527.0930407401,1608678.8812580835]
["Non-Management (union and non-union)",null,null,null,null,null,null,null,null,null,null,null,null,null,null,4722845,4722845,5066717.6711354572,null,5078369.445901759,5090533.3508459125,null,null,5427380.9873799067,5671375.5539703192,5843490.4575412571]
["Total",{"$f":"SUM(B18:B19)","v":0},0,0,0,0,0,0,0,0,0,0,0,0,0,6385940,6385940,6659767.8723607818,0,6606282.6348565221,6455559.4177748356,0,0,6891590.35881407,7231902.6470110593,7452169.3387993407]
["Total Benefits (Current + Accrued)"]
["Management (including executive)",null,null,null,null,null,null,null,null,null,null,null,null,null,null,645642,645642,446203.94552303449,null,359625.32552192273,358613.55575603596,null,null,388910.39416834095,403537.91390887671,371197.39520397998]
["Non-Management (union and non-union)",null,null,null,null,null,null,null,null,null,null,null,null,null,null,2112645,2112645,2106901.3381262948,null,1687038.8717256307,1888382.6856609555,null,null,1966520.6191986043,2080048.6199961351,1778794.436240989]
["Total",{"$f":"SUM(B22:B23)","v":0},{"$f":"SUM(C22:C23)","v":0},0,0,0,0,0,0,0,0,0,0,0,0,2758287,2758287,2553105.2836493291,0,2046664.1972475534,2246996.2414169917,0,0,2355431.0133669451,2483586.5339050116,2149991.8314449689]
["Total Compensation (Salary, Wages, & Benefits)"]
["Management (including executive)",{"$f":"B18+B22","v":0},0,0,0,0,0,0,0,0,0,0,0,0,0,2308737,2308737,{"$f":"R18+R22","v":2039254.1467483593},0,1887538.5144766863,1723639.6226849596,0,0,1853119.7656025048,1964065.0069496168,1979876.2764620634]
["Non-Management (union and non-union)",0,0,0,0,0,0,0,0,0,0,0,0,0,0,6835490,6835490,{"$f":"R19+R23","v":7173619.0092617515},0,6765408.3176273899,6978916.036506868,0,0,7393901.6065785112,7751424.1739664543,7622284.8937822459]
["Total",0,0,0,0,0,0,0,0,0,0,0,0,0,0,9144227,9144227,{"$f":"R20+R24","v":9212873.1560101099},0,8652946.8321040757,8702555.6591918282,0,0,9247021.3721810151,9715489.1809160709,9602161.1702443101]
[]
["Note:"]
["1 If an applicant wishes to use headcount, it must also file the same schedule on an FTE basis."]

{"sheet":"Hidden_Employee Costs","index":37,"n_rows":201,"n_cols":9,"rows_kept":201,"cut":false,"hidden":true,"merged":[]}
["Utility Name","EB Number","Test Year","Bridge Year","Last Rebasing Year","Employee Cost Info","Heading","Year","Amount"]
[{"$f":"'LDC Info'!$E$14","v":"Algoma Power Inc."},{"$f":"EBNUMBER","v":"EB-2019-0019"},{"$f":"TestYear","v":2020},{"$f":"BridgeYear","v":2019},{"$f":"RebaseYear","v":2015},"Management (including executive)","Number of Employees (FTEs including Part-Time)","2010 Board Approved",{"$f":"'App.2-K_Employee Costs'!B$14","v":0}]
[{"$f":"'LDC Info'!$E$14","v":"Algoma Power Inc."},"EB-2019-0019",2020,2019,2015,"Non-Management (union and non-union)","Number of Employees (FTEs including Part-Time)","2010 Board Approved",{"$f":"'App.2-K_Employee Costs'!B$15","v":0}]
[{"$f":"'LDC Info'!$E$14","v":"Algoma Power Inc."},"EB-2019-0019",2020,2019,2015,"Management (including executive)","Total Salary and Wages including ovetime and incentive pay","2010 Board Approved",{"$f":"'App.2-K_Employee Costs'!B$18","v":0}]
[{"$f":"'LDC Info'!$E$14","v":"Algoma Power Inc."},"EB-2019-0019",2020,2019,2015,"Non-Management (union and non-union)","Total Salary and Wages including ovetime and incentive pay","2010 Board Approved",{"$f":"'App.2-K_Employee Costs'!B$19","v":0}]
[{"$f":"'LDC Info'!$E$14","v":"Algoma Power Inc."},"EB-2019-0019",2020,2019,2015,"Management (including executive)","Total Benefits (Current + Accrued)","2010 Board Approved",{"$f":"'App.2-K_Employee Costs'!B$22","v":0}]
[{"$f":"'LDC Info'!$E$14","v":"Algoma Power Inc."},"EB-2019-0019",2020,2019,2015,"Non-Management (union and non-union)","Total Benefits (Current + Accrued)","2010 Board Approved",{"$f":"'App.2-K_Employee Costs'!B$23","v":0}]
[{"$f":"'LDC Info'!$E$14","v":"Algoma Power Inc."},"EB-2019-0019",2020,2019,2015,"Management (including executive)","Total Compensation (Salary, Wages, & Benefits)","2010 Board Approved",{"$f":"'App.2-K_Employee Costs'!B$26","v":0}]
[{"$f":"'LDC Info'!$E$14","v":"Algoma Power Inc."},"EB-2019-0019",2020,2019,2015,"Non-Management (union and non-union)","Total Compensation (Salary, Wages, & Benefits)","2010 Board Approved",{"$f":"'App.2-K_Employee Costs'!B$27","v":0}]
[{"$f":"'LDC Info'!$E$14","v":"Algoma Power Inc."},"EB-2019-0019",2020,2019,2015,"Management (including executive)","Number of Employees (FTEs including Part-Time)","2010 Last Rebasing Actuals",{"$f":"'App.2-K_Employee Costs'!C$14","v":0}]
[{"$f":"'LDC Info'!$E$14","v":"Algoma Power Inc."},"EB-2019-0019",2020,2019,2015,"Non-Management (union and non-union)","Number of Employees (FTEs including Part-Time)","2010 Last Rebasing Actuals",{"$f":"'App.2-K_Employee Costs'!C$15","v":0}]
[{"$f":"'LDC Info'!$E$14","v":"Algoma Power Inc."},"EB-2019-0019",2020,2019,2015,"Management (including executive)","Total Salary and Wages including ovetime and incentive pay","2010 Last Rebasing Actuals",{"$f":"'App.2-K_Employee Costs'!C$18","v":0}]
[{"$f":"'LDC Info'!$E$14","v":"Algoma Power Inc."},"EB-2019-0019",2020,2019,2015,"Non-Management (union and non-union)","Total Salary and Wages including ovetime and incentive pay","2010 Last Rebasing Actuals",{"$f":"'App.2-K_Employee Costs'!C$19","v":0}]
[{"$f":"'LDC Info'!$E$14","v":"Algoma Power Inc."},"EB-2019-0019",2020,2019,2015,"Management (including executive)","Total Benefits (Current + Accrued)","2010 Last Rebasing Actuals",{"$f":"'App.2-K_Employee Costs'!C$22","v":0}]
[{"$f":"'LDC Info'!$E$14","v":"Algoma Power Inc."},"EB-2019-0019",2020,2019,2015,"Non-Management (union and non-union)","Total Benefits (Current + Accrued)","2010 Last Rebasing Actuals",{"$f":"'App.2-K_Employee Costs'!C$23","v":0}]
[{"$f":"'LDC Info'!$E$14","v":"Algoma Power Inc."},"EB-2019-0019",2020,2019,2015,"Management (including executive)","Total Compensation (Salary, Wages, & Benefits)","2010 Last Rebasing Actuals",{"$f":"'App.2-K_Employee Costs'!C$26","v":0}]
[{"$f":"'LDC Info'!$E$14","v":"Algoma Power Inc."},"EB-2019-0019",2020,2019,2015,"Non-Management (union and non-union)","Total Compensation (Salary, Wages, & Benefits)","2010 Last Rebasing Actuals",{"$f":"'App.2-K_Employee Costs'!C$27","v":0}]
[{"$f":"'LDC Info'!$E$14","v":"Algoma Power Inc."},"EB-2019-0019",2020,2019,2015,"Management (including executive)","Number of Employees (FTEs including Part-Time)","2011 Board Approved",{"$f":"'App.2-K_Employee Costs'!D$14","v":0}]
[{"$f":"'LDC Info'!$E$14","v":"Algoma Power Inc."},"EB-2019-0019",2020,2019,2015,"Non-Management (union and non-union)","Number of Employees (FTEs including Part-Time)","2011 Board Approved",{"$f":"'App.2-K_Employee Costs'!D$15","v":0}]
[{"$f":"'LDC Info'!$E$14","v":"Algoma Power Inc."},"EB-2019-0019",2020,2019,2015,"Management (including executive)","Total Salary and Wages including ovetime and incentive pay","2011 Board Approved",{"$f":"'App.2-K_Employee Costs'!D$18","v":0}]
[{"$f":"'LDC Info'!$E$14","v":"Algoma Power Inc."},"EB-2019-0019",2020,2019,2015,"Non-Management (union and non-union)","Total Salary and Wages including ovetime and incentive pay","2011 Board Approved",{"$f":"'App.2-K_Employee Costs'!D$19","v":0}]
[{"$f":"'LDC Info'!$E$14","v":"Algoma Power Inc."},"EB-2019-0019",2020,2019,2015,"Management (including executive)","Total Benefits (Current + Accrued)","2011 Board Approved",{"$f":"'App.2-K_Employee Costs'!D$22","v":0}]
[{"$f":"'LDC Info'!$E$14","v":"Algoma Power Inc."},"EB-2019-0019",2020,2019,2015,"Non-Management (union and non-union)","Total Benefits (Current + Accrued)","2011 Board Approved",{"$f":"'App.2-K_Employee Costs'!D$23","v":0}]
[{"$f":"'LDC Info'!$E$14","v":"Algoma Power Inc."},"EB-2019-0019",2020,2019,2015,"Management (including executive)","Total Compensation (Salary, Wages, & Benefits)","2011 Board Approved",{"$f":"'App.2-K_Employee Costs'!D$26","v":0}]
[{"$f":"'LDC Info'!$E$14","v":"Algoma Power Inc."},"EB-2019-0019",2020,2019,2015,"Non-Management (union and non-union)","Total Compensation (Salary, Wages, & Benefits)","2011 Board Approved",{"$f":"'App.2-K_Employee Costs'!D$27","v":0}]
[{"$f":"'LDC Info'!$E$14","v":"Algoma Power Inc."},"EB-2019-0019",2020,2019,2015,"Management (including executive)","Number of Employees (FTEs including Part-Time)","2011 Last Rebasing Actuals",{"$f":"'App.2-K_Employee Costs'!E$14","v":0}]
[{"$f":"'LDC Info'!$E$14","v":"Algoma Power Inc."},"EB-2019-0019",2020,2019,2015,"Non-Management (union and non-union)","Number of Employees (FTEs including Part-Time)","2011 Last Rebasing Actuals",{"$f":"'App.2-K_Employee Costs'!E$15","v":0}]
[{"$f":"'LDC Info'!$E$14","v":"Algoma Power Inc."},"EB-2019-0019",2020,2019,2015,"Management (including executive)","Total Salary and Wages including ovetime and incentive pay","2011 Last Rebasing Actuals",{"$f":"'App.2-K_Employee Costs'!E$18","v":0}]
[{"$f":"'LDC Info'!$E$14","v":"Algoma Power Inc."},"EB-2019-0019",2020,2019,2015,"Non-Management (union and non-union)","Total Salary and Wages including ovetime and incentive pay","2011 Last Rebasing Actuals",{"$f":"'App.2-K_Employee Costs'!E$19","v":0}]
[{"$f":"'LDC Info'!$E$14","v":"Algoma Power Inc."},"EB-2019-0019",2020,2019,2015,"Management (including executive)","Total Benefits (Current + Accrued)","2011 Last Rebasing Actuals",{"$f":"'App.2-K_Employee Costs'!E$22","v":0}]
[{"$f":"'LDC Info'!$E$14","v":"Algoma Power Inc."},"EB-2019-0019",2020,2019,2015,"Non-Management (union and non-union)","Total Benefits (Current + Accrued)","2011 Last Rebasing Actuals",{"$f":"'App.2-K_Employee Costs'!E$23","v":0}]
[{"$f":"'LDC Info'!$E$14","v":"Algoma Power Inc."},"EB-2019-0019",2020,2019,2015,"Management (including executive)","Total Compensation (Salary, Wages, & Benefits)","2011 Last Rebasing Actuals",{"$f":"'App.2-K_Employee Costs'!E$26","v":0}]
[{"$f":"'LDC Info'!$E$14","v":"Algoma Power Inc."},"EB-2019-0019",2020,2019,2015,"Non-Management (union and non-union)","Total Compensation (Salary, Wages, & Benefits)","2011 Last Rebasing Actuals",{"$f":"'App.2-K_Employee Costs'!E$27","v":0}]
[{"$f":"'LDC Info'!$E$14","v":"Algoma Power Inc."},{"$f":"EBNUMBER","v":"EB-2019-0019"},{"$f":"TestYear","v":2020},{"$f":"BridgeYear","v":2019},{"$f":"RebaseYear","v":2015},"Management (including executive)","Number of Employees (FTEs including Part-Time)","2011 Actuals",{"$f":"'App.2-K_Employee Costs'!F$14","v":0}]
[{"$f":"'LDC Info'!$E$14","v":"Algoma Power Inc."},"EB-2019-0019",2020,2019,2015,"Non-Management (union and non-union)","Number of Employees (FTEs including Part-Time)","2011 Actuals",{"$f":"'App.2-K_Employee Costs'!F$15","v":0}]
[{"$f":"'LDC Info'!$E$14","v":"Algoma Power Inc."},"EB-2019-0019",2020,2019,2015,"Management (including executive)","Total Salary and Wages including ovetime and incentive pay","2011 Actuals",{"$f":"'App.2-K_Employee Costs'!F$18","v":0}]
[{"$f":"'LDC Info'!$E$14","v":"Algoma Power Inc."},"EB-2019-0019",2020,2019,2015,"Non-Management (union and non-union)","Total Salary and Wages including ovetime and incentive pay","2011 Actuals",{"$f":"'App.2-K_Employee Costs'!F$19","v":0}]
[{"$f":"'LDC Info'!$E$14","v":"Algoma Power Inc."},"EB-2019-0019",2020,2019,2015,"Management (including executive)","Total Benefits (Current + Accrued)","2011 Actuals",{"$f":"'App.2-K_Employee Costs'!F$22","v":0}]
[{"$f":"'LDC Info'!$E$14","v":"Algoma Power Inc."},"EB-2019-0019",2020,2019,2015,"Non-Management (union and non-union)","Total Benefits (Current + Accrued)","2011 Actuals",{"$f":"'App.2-K_Employee Costs'!F$23","v":0}]
[{"$f":"'LDC Info'!$E$14","v":"Algoma Power Inc."},"EB-2019-0019",2020,2019,2015,"Management (including executive)","Total Compensation (Salary, Wages, & Benefits)","2011 Actuals",{"$f":"'App.2-K_Employee Costs'!F$26","v":0}]
[{"$f":"'LDC Info'!$E$14","v":"Algoma Power Inc."},"EB-2019-0019",2020,2019,2015,"Non-Management (union and non-union)","Total Compensation (Salary, Wages, & Benefits)","2011 Actuals",{"$f":"'App.2-K_Employee Costs'!F$27","v":0}]
[{"$f":"'LDC Info'!$E$14","v":"Algoma Power Inc."},"EB-2019-0019",2020,2019,2015,"Management (including executive)","Number of Employees (FTEs including Part-Time)","2012 Board Approved",{"$f":"'App.2-K_Employee Costs'!G$14","v":0}]
[{"$f":"'LDC Info'!$E$14","v":"Algoma Power Inc."},"EB-2019-0019",2020,2019,2015,"Non-Management (union and non-union)","Number of Employees (FTEs including Part-Time)","2012 Board Approved",{"$f":"'App.2-K_Employee Costs'!G$15","v":0}]
[{"$f":"'LDC Info'!$E$14","v":"Algoma Power Inc."},"EB-2019-0019",2020,2019,2015,"Management (including executive)","Total Salary and Wages including ovetime and incentive pay","2012 Board Approved",{"$f":"'App.2-K_Employee Costs'!G$18","v":0}]
[{"$f":"'LDC Info'!$E$14","v":"Algoma Power Inc."},"EB-2019-0019",2020,2019,2015,"Non-Management (union and non-union)","Total Salary and Wages including ovetime and incentive pay","2012 Board Approved",{"$f":"'App.2-K_Employee Costs'!G$19","v":0}]
[{"$f":"'LDC Info'!$E$14","v":"Algoma Power Inc."},"EB-2019-0019",2020,2019,2015,"Management (including executive)","Total Benefits (Current + Accrued)","2012 Board Approved",{"$f":"'App.2-K_Employee Costs'!G$22","v":0}]
[{"$f":"'LDC Info'!$E$14","v":"Algoma Power Inc."},"EB-2019-0019",2020,2019,2015,"Non-Management (union and non-union)","Total Benefits (Current + Accrued)","2012 Board Approved",{"$f":"'App.2-K_Employee Costs'!G$23","v":0}]
[{"$f":"'LDC Info'!$E$14","v":"Algoma Power Inc."},"EB-2019-0019",2020,2019,2015,"Management (including executive)","Total Compensation (Salary, Wages, & Benefits)","2012 Board Approved",{"$f":"'App.2-K_Employee Costs'!G$26","v":0}]
[{"$f":"'LDC Info'!$E$14","v":"Algoma Power Inc."},"EB-2019-0019",2020,2019,2015,"Non-Management (union and non-union)","Total Compensation (Salary, Wages, & Benefits)","2012 Board Approved",{"$f":"'App.2-K_Employee Costs'!G$27","v":0}]
[{"$f":"'LDC Info'!$E$14","v":"Algoma Power Inc."},"EB-2019-0019",2020,2019,2015,"Management (including executive)","Number of Employees (FTEs including Part-Time)","2012 Last Rebasing Actuals",{"$f":"'App.2-K_Employee Costs'!H$14","v":0}]
[{"$f":"'LDC Info'!$E$14","v":"Algoma Power Inc."},"EB-2019-0019",2020,2019,2015,"Non-Management (union and non-union)","Number of Employees (FTEs including Part-Time)","2012 Last Rebasing Actuals",{"$f":"'App.2-K_Employee Costs'!H$15","v":0}]
[{"$f":"'LDC Info'!$E$14","v":"Algoma Power Inc."},"EB-2019-0019",2020,2019,2015,"Management (including executive)","Total Salary and Wages including ovetime and incentive pay","2012 Last Rebasing Actuals",{"$f":"'App.2-K_Employee Costs'!H$18","v":0}]
[{"$f":"'LDC Info'!$E$14","v":"Algoma Power Inc."},"EB-2019-0019",2020,2019,2015,"Non-Management (union and non-union)","Total Salary and Wages including ovetime and incentive pay","2012 Last Rebasing Actuals",{"$f":"'App.2-K_Employee Costs'!H$19","v":0}]
[{"$f":"'LDC Info'!$E$14","v":"Algoma Power Inc."},"EB-2019-0019",2020,2019,2015,"Management (including executive)","Total Benefits (Current + Accrued)","2012 Last Rebasing Actuals",{"$f":"'App.2-K_Employee Costs'!H$22","v":0}]
[{"$f":"'LDC Info'!$E$14","v":"Algoma Power Inc."},"EB-2019-0019",2020,2019,2015,"Non-Management (union and non-union)","Total Benefits (Current + Accrued)","2012 Last Rebasing Actuals",{"$f":"'App.2-K_Employee Costs'!H$23","v":0}]
[{"$f":"'LDC Info'!$E$14","v":"Algoma Power Inc."},"EB-2019-0019",2020,2019,2015,"Management (including executive)","Total Compensation (Salary, Wages, & Benefits)","2012 Last Rebasing Actuals",{"$f":"'App.2-K_Employee Costs'!H$26","v":0}]
[{"$f":"'LDC Info'!$E$14","v":"Algoma Power Inc."},"EB-2019-0019",2020,2019,2015,"Non-Management (union and non-union)","Total Compensation (Salary, Wages, & Benefits)","2012 Last Rebasing Actuals",{"$f":"'App.2-K_Employee Costs'!H$27","v":0}]
[{"$f":"'LDC Info'!$E$14","v":"Algoma Power Inc."},"EB-2019-0019",2020,2019,2015,"Management (including executive)","Number of Employees (FTEs including Part-Time)","2012 Actuals",{"$f":"'App.2-K_Employee Costs'!I$14","v":0}]
[{"$f":"'LDC Info'!$E$14","v":"Algoma Power Inc."},"EB-2019-0019",2020,2019,2015,"Non-Management (union and non-union)","Number of Employees (FTEs including Part-Time)","2012 Actuals",{"$f":"'App.2-K_Employee Costs'!I$15","v":0}]
[{"$f":"'LDC Info'!$E$14","v":"Algoma Power Inc."},"EB-2019-0019",2020,2019,2015,"Management (including executive)","Total Salary and Wages including ovetime and incentive pay","2012 Actuals",{"$f":"'App.2-K_Employee Costs'!I$18","v":0}]
[{"$f":"'LDC Info'!$E$14","v":"Algoma Power Inc."},"EB-2019-0019",2020,2019,2015,"Non-Management (union and non-union)","Total Salary and Wages including ovetime and incentive pay","2012 Actuals",{"$f":"'App.2-K_Employee Costs'!I$19","v":0}]
[{"$f":"'LDC Info'!$E$14","v":"Algoma Power Inc."},"EB-2019-0019",2020,2019,2015,"Management (including executive)","Total Benefits (Current + Accrued)","2012 Actuals",{"$f":"'App.2-K_Employee Costs'!I$22","v":0}]
[{"$f":"'LDC Info'!$E$14","v":"Algoma Power Inc."},"EB-2019-0019",2020,2019,2015,"Non-Management (union and non-union)","Total Benefits (Current + Accrued)","2012 Actuals",{"$f":"'App.2-K_Employee Costs'!I$23","v":0}]
[{"$f":"'LDC Info'!$E$14","v":"Algoma Power Inc."},"EB-2019-0019",2020,2019,2015,"Management (including executive)","Total Compensation (Salary, Wages, & Benefits)","2012 Actuals",{"$f":"'App.2-K_Employee Costs'!I$26","v":0}]
[{"$f":"'LDC Info'!$E$14","v":"Algoma Power Inc."},"EB-2019-0019",2020,2019,2015,"Non-Management (union and non-union)","Total Compensation (Salary, Wages, & Benefits)","2012 Actuals",{"$f":"'App.2-K_Employee Costs'!I$27","v":0}]
[{"$f":"'LDC Info'!$E$14","v":"Algoma Power Inc."},{"$f":"EBNUMBER","v":"EB-2019-0019"},{"$f":"TestYear","v":2020},{"$f":"BridgeYear","v":2019},{"$f":"RebaseYear","v":2015},"Management (including executive)","Number of Employees (FTEs including Part-Time)","2013 Board Approved",{"$f":"'App.2-K_Employee Costs'!J$14","v":0}]
[{"$f":"'LDC Info'!$E$14","v":"Algoma Power Inc."},"EB-2019-0019",2020,2019,2015,"Non-Management (union and non-union)","Number of Employees (FTEs including Part-Time)","2013 Board Approved",{"$f":"'App.2-K_Employee Costs'!J$15","v":0}]
[{"$f":"'LDC Info'!$E$14","v":"Algoma Power Inc."},"EB-2019-0019",2020,2019,2015,"Management (including executive)","Total Salary and Wages including ovetime and incentive pay","2013 Board Approved",{"$f":"'App.2-K_Employee Costs'!J$18","v":0}]
[{"$f":"'LDC Info'!$E$14","v":"Algoma Power Inc."},"EB-2019-0019",2020,2019,2015,"Non-Management (union and non-union)","Total Salary and Wages including ovetime and incentive pay","2013 Board Approved",{"$f":"'App.2-K_Employee Costs'!J$19","v":0}]
[{"$f":"'LDC Info'!$E$14","v":"Algoma Power Inc."},"EB-2019-0019",2020,2019,2015,"Management (including executive)","Total Benefits (Current + Accrued)","2013 Board Approved",{"$f":"'App.2-K_Employee Costs'!J$22","v":0}]
[{"$f":"'LDC Info'!$E$14","v":"Algoma Power Inc."},"EB-2019-0019",2020,2019,2015,"Non-Management (union and non-union)","Total Benefits (Current + Accrued)","2013 Board Approved",{"$f":"'App.2-K_Employee Costs'!J$23","v":0}]
[{"$f":"'LDC Info'!$E$14","v":"Algoma Power Inc."},"EB-2019-0019",2020,2019,2015,"Management (including executive)","Total Compensation (Salary, Wages, & Benefits)","2013 Board Approved",{"$f":"'App.2-K_Employee Costs'!J$26","v":0}]
[{"$f":"'LDC Info'!$E$14","v":"Algoma Power Inc."},"EB-2019-0019",2020,2019,2015,"Non-Management (union and non-union)","Total Compensation (Salary, Wages, & Benefits)","2013 Board Approved",{"$f":"'App.2-K_Employee Costs'!J$27","v":0}]
[{"$f":"'LDC Info'!$E$14","v":"Algoma Power Inc."},"EB-2019-0019",2020,2019,2015,"Management (including executive)","Number of Employees (FTEs including Part-Time)","2013 Last Rebasing Actuals",{"$f":"'App.2-K_Employee Costs'!K$14","v":0}]
[{"$f":"'LDC Info'!$E$14","v":"Algoma Power Inc."},"EB-2019-0019",2020,2019,2015,"Non-Management (union and non-union)","Number of Employees (FTEs including Part-Time)","2013 Last Rebasing Actuals",{"$f":"'App.2-K_Employee Costs'!K$15","v":0}]
[{"$f":"'LDC Info'!$E$14","v":"Algoma Power Inc."},"EB-2019-0019",2020,2019,2015,"Management (including executive)","Total Salary and Wages including ovetime and incentive pay","2013 Last Rebasing Actuals",{"$f":"'App.2-K_Employee Costs'!K$18","v":0}]
[{"$f":"'LDC Info'!$E$14","v":"Algoma Power Inc."},"EB-2019-0019",2020,2019,2015,"Non-Management (union and non-union)","Total Salary and Wages including ovetime and incentive pay","2013 Last Rebasing Actuals",{"$f":"'App.2-K_Employee Costs'!K$19","v":0}]
[{"$f":"'LDC Info'!$E$14","v":"Algoma Power Inc."},"EB-2019-0019",2020,2019,2015,"Management (including executive)","Total Benefits (Current + Accrued)","2013 Last Rebasing Actuals",{"$f":"'App.2-K_Employee Costs'!K$22","v":0}]
[{"$f":"'LDC Info'!$E$14","v":"Algoma Power Inc."},"EB-2019-0019",2020,2019,2015,"Non-Management (union and non-union)","Total Benefits (Current + Accrued)","2013 Last Rebasing Actuals",{"$f":"'App.2-K_Employee Costs'!K$23","v":0}]
[{"$f":"'LDC Info'!$E$14","v":"Algoma Power Inc."},"EB-2019-0019",2020,2019,2015,"Management (including executive)","Total Compensation (Salary, Wages, & Benefits)","2013 Last Rebasing Actuals",{"$f":"'App.2-K_Employee Costs'!K$26","v":0}]
[{"$f":"'LDC Info'!$E$14","v":"Algoma Power Inc."},"EB-2019-0019",2020,2019,2015,"Non-Management (union and non-union)","Total Compensation (Salary, Wages, & Benefits)","2013 Last Rebasing Actuals",{"$f":"'App.2-K_Employee Costs'!K$27","v":0}]
[{"$f":"'LDC Info'!$E$14","v":"Algoma Power Inc."},"EB-2019-0019",2020,2019,2015,"Management (including executive)","Number of Employees (FTEs including Part-Time)","2013 Actuals",{"$f":"'App.2-K_Employee Costs'!L$14","v":0}]
[{"$f":"'LDC Info'!$E$14","v":"Algoma Power Inc."},"EB-2019-0019",2020,2019,2015,"Non-Management (union and non-union)","Number of Employees (FTEs including Part-Time)","2013 Actuals",{"$f":"'App.2-K_Employee Costs'!L$15","v":0}]
[{"$f":"'LDC Info'!$E$14","v":"Algoma Power Inc."},"EB-2019-0019",2020,2019,2015,"Management (including executive)","Total Salary and Wages including ovetime and incentive pay","2013 Actuals",{"$f":"'App.2-K_Employee Costs'!L$18","v":0}]
[{"$f":"'LDC Info'!$E$14","v":"Algoma Power Inc."},"EB-2019-0019",2020,2019,2015,"Non-Management (union and non-union)","Total Salary and Wages including ovetime and incentive pay","2013 Actuals",{"$f":"'App.2-K_Employee Costs'!L$19","v":0}]
[{"$f":"'LDC Info'!$E$14","v":"Algoma Power Inc."},"EB-2019-0019",2020,2019,2015,"Management (including executive)","Total Benefits (Current + Accrued)","2013 Actuals",{"$f":"'App.2-K_Employee Costs'!L$22","v":0}]
[{"$f":"'LDC Info'!$E$14","v":"Algoma Power Inc."},"EB-2019-0019",2020,2019,2015,"Non-Management (union and non-union)","Total Benefits (Current + Accrued)","2013 Actuals",{"$f":"'App.2-K_Employee Costs'!L$23","v":0}]
[{"$f":"'LDC Info'!$E$14","v":"Algoma Power Inc."},"EB-2019-0019",2020,2019,2015,"Management (including executive)","Total Compensation (Salary, Wages, & Benefits)","2013 Actuals",{"$f":"'App.2-K_Employee Costs'!L$26","v":0}]
[{"$f":"'LDC Info'!$E$14","v":"Algoma Power Inc."},"EB-2019-0019",2020,2019,2015,"Non-Management (union and non-union)","Total Compensation (Salary, Wages, & Benefits)","2013 Actuals",{"$f":"'App.2-K_Employee Costs'!L$27","v":0}]
[{"$f":"'LDC Info'!$E$14","v":"Algoma Power Inc."},"EB-2019-0019",2020,2019,2015,"Management (including executive)","Number of Employees (FTEs including Part-Time)","2014 Board Approved",{"$f":"'App.2-K_Employee Costs'!M$14","v":0}]
[{"$f":"'LDC Info'!$E$14","v":"Algoma Power Inc."},"EB-2019-0019",2020,2019,2015,"Non-Management (union and non-union)","Number of Employees (FTEs including Part-Time)","2014 Board Approved",{"$f":"'App.2-K_Employee Costs'!M$15","v":0}]
[{"$f":"'LDC Info'!$E$14","v":"Algoma Power Inc."},"EB-2019-0019",2020,2019,2015,"Management (including executive)","Total Salary and Wages including ovetime and incentive pay","2014 Board Approved",{"$f":"'App.2-K_Employee Costs'!M$18","v":0}]
[{"$f":"'LDC Info'!$E$14","v":"Algoma Power Inc."},"EB-2019-0019",2020,2019,2015,"Non-Management (union and non-union)","Total Salary and Wages including ovetime and incentive pay","2014 Board Approved",{"$f":"'App.2-K_Employee Costs'!M$19","v":0}]
[{"$f":"'LDC Info'!$E$14","v":"Algoma Power Inc."},"EB-2019-0019",2020,2019,2015,"Management (including executive)","Total Benefits (Current + Accrued)","2014 Board Approved",{"$f":"'App.2-K_Employee Costs'!M$22","v":0}]
[{"$f":"'LDC Info'!$E$14","v":"Algoma Power Inc."},"EB-2019-0019",2020,2019,2015,"Non-Management (union and non-union)","Total Benefits (Current + Accrued)","2014 Board Approved",{"$f":"'App.2-K_Employee Costs'!M$23","v":0}]
[{"$f":"'LDC Info'!$E$14","v":"Algoma Power Inc."},"EB-2019-0019",2020,2019,2015,"Management (including executive)","Total Compensation (Salary, Wages, & Benefits)","2014 Board Approved",{"$f":"'App.2-K_Employee Costs'!M$26","v":0}]
[{"$f":"'LDC Info'!$E$14","v":"Algoma Power Inc."},"EB-2019-0019",2020,2019,2015,"Non-Management (union and non-union)","Total Compensation (Salary, Wages, & Benefits)","2014 Board Approved",{"$f":"'App.2-K_Employee Costs'!M$27","v":0}]
[{"$f":"'LDC Info'!$E$14","v":"Algoma Power Inc."},{"$f":"EBNUMBER","v":"EB-2019-0019"},{"$f":"TestYear","v":2020},{"$f":"BridgeYear","v":2019},{"$f":"RebaseYear","v":2015},"Management (including executive)","Number of Employees (FTEs including Part-Time)","2014 Last Rebasing Actuals",{"$f":"'App.2-K_Employee Costs'!N$14","v":0}]
[{"$f":"'LDC Info'!$E$14","v":"Algoma Power Inc."},"EB-2019-0019",2020,2019,2015,"Non-Management (union and non-union)","Number of Employees (FTEs including Part-Time)","2014 Last Rebasing Actuals",{"$f":"'App.2-K_Employee Costs'!N$15","v":0}]
[{"$f":"'LDC Info'!$E$14","v":"Algoma Power Inc."},"EB-2019-0019",2020,2019,2015,"Management (including executive)","Total Salary and Wages including ovetime and incentive pay","2014 Last Rebasing Actuals",{"$f":"'App.2-K_Employee Costs'!N$18","v":0}]
[{"$f":"'LDC Info'!$E$14","v":"Algoma Power Inc."},"EB-2019-0019",2020,2019,2015,"Non-Management (union and non-union)","Total Salary and Wages including ovetime and incentive pay","2014 Last Rebasing Actuals",{"$f":"'App.2-K_Employee Costs'!N$19","v":0}]
[{"$f":"'LDC Info'!$E$14","v":"Algoma Power Inc."},"EB-2019-0019",2020,2019,2015,"Management (including executive)","Total Benefits (Current + Accrued)","2014 Last Rebasing Actuals",{"$f":"'App.2-K_Employee Costs'!N$22","v":0}]
[{"$f":"'LDC Info'!$E$14","v":"Algoma Power Inc."},"EB-2019-0019",2020,2019,2015,"Non-Management (union and non-union)","Total Benefits (Current + Accrued)","2014 Last Rebasing Actuals",{"$f":"'App.2-K_Employee Costs'!N$23","v":0}]
[{"$f":"'LDC Info'!$E$14","v":"Algoma Power Inc."},"EB-2019-0019",2020,2019,2015,"Management (including executive)","Total Compensation (Salary, Wages, & Benefits)","2014 Last Rebasing Actuals",{"$f":"'App.2-K_Employee Costs'!N$26","v":0}]
[{"$f":"'LDC Info'!$E$14","v":"Algoma Power Inc."},"EB-2019-0019",2020,2019,2015,"Non-Management (union and non-union)","Total Compensation (Salary, Wages, & Benefits)","2014 Last Rebasing Actuals",{"$f":"'App.2-K_Employee Costs'!N$27","v":0}]
[{"$f":"'LDC Info'!$E$14","v":"Algoma Power Inc."},"EB-2019-0019",2020,2019,2015,"Management (including executive)","Number of Employees (FTEs including Part-Time)","2014 Actuals",{"$f":"'App.2-K_Employee Costs'!O$14","v":0}]
[{"$f":"'LDC Info'!$E$14","v":"Algoma Power Inc."},"EB-2019-0019",2020,2019,2015,"Non-Management (union and non-union)","Number of Employees (FTEs including Part-Time)","2014 Actuals",{"$f":"'App.2-K_Employee Costs'!O$15","v":0}]
[{"$f":"'LDC Info'!$E$14","v":"Algoma Power Inc."},"EB-2019-0019",2020,2019,2015,"Management (including executive)","Total Salary and Wages including ovetime and incentive pay","2014 Actuals",{"$f":"'App.2-K_Employee Costs'!O$18","v":0}]
[{"$f":"'LDC Info'!$E$14","v":"Algoma Power Inc."},"EB-2019-0019",2020,2019,2015,"Non-Management (union and non-union)","Total Salary and Wages including ovetime and incentive pay","2014 Actuals",{"$f":"'App.2-K_Employee Costs'!O$19","v":0}]
[{"$f":"'LDC Info'!$E$14","v":"Algoma Power Inc."},"EB-2019-0019",2020,2019,2015,"Management (including executive)","Total Benefits (Current + Accrued)","2014 Actuals",{"$f":"'App.2-K_Employee Costs'!O$22","v":0}]
[{"$f":"'LDC Info'!$E$14","v":"Algoma Power Inc."},"EB-2019-0019",2020,2019,2015,"Non-Management (union and non-union)","Total Benefits (Current + Accrued)","2014 Actuals",{"$f":"'App.2-K_Employee Costs'!O$23","v":0}]
[{"$f":"'LDC Info'!$E$14","v":"Algoma Power Inc."},"EB-2019-0019",2020,2019,2015,"Management (including executive)","Total Compensation (Salary, Wages, & Benefits)","2014 Actuals",{"$f":"'App.2-K_Employee Costs'!O$26","v":0}]
[{"$f":"'LDC Info'!$E$14","v":"Algoma Power Inc."},"EB-2019-0019",2020,2019,2015,"Non-Management (union and non-union)","Total Compensation (Salary, Wages, & Benefits)","2014 Actuals",{"$f":"'App.2-K_Employee Costs'!O$27","v":0}]
[{"$f":"'LDC Info'!$E$14","v":"Algoma Power Inc."},"EB-2019-0019",2020,2019,2015,"Management (including executive)","Number of Employees (FTEs including Part-Time)","2015 Board Approved",{"$f":"'App.2-K_Employee Costs'!P$14","v":15}]
[{"$f":"'LDC Info'!$E$14","v":"Algoma Power Inc."},"EB-2019-0019",2020,2019,2015,"Non-Management (union and non-union)","Number of Employees (FTEs including Part-Time)","2015 Board Approved",{"$f":"'App.2-K_Employee Costs'!P$15","v":66}]
[{"$f":"'LDC Info'!$E$14","v":"Algoma Power Inc."},"EB-2019-0019",2020,2019,2015,"Management (including executive)","Total Salary and Wages including ovetime and incentive pay","2015 Board Approved",{"$f":"'App.2-K_Employee Costs'!P$18","v":1663095}]
[{"$f":"'LDC Info'!$E$14","v":"Algoma Power Inc."},"EB-2019-0019",2020,2019,2015,"Non-Management (union and non-union)","Total Salary and Wages including ovetime and incentive pay","2015 Board Approved",{"$f":"'App.2-K_Employee Costs'!P$19","v":4722845}]
[{"$f":"'LDC Info'!$E$14","v":"Algoma Power Inc."},"EB-2019-0019",2020,2019,2015,"Management (including executive)","Total Benefits (Current + Accrued)","2015 Board Approved",{"$f":"'App.2-K_Employee Costs'!P$22","v":645642}]
[{"$f":"'LDC Info'!$E$14","v":"Algoma Power Inc."},"EB-2019-0019",2020,2019,2015,"Non-Management (union and non-union)","Total Benefits (Current + Accrued)","2015 Board Approved",{"$f":"'App.2-K_Employee Costs'!P$23","v":2112645}]
[{"$f":"'LDC Info'!$E$14","v":"Algoma Power Inc."},"EB-2019-0019",2020,2019,2015,"Management (including executive)","Total Compensation (Salary, Wages, & Benefits)","2015 Board Approved",{"$f":"'App.2-K_Employee Costs'!P$26","v":2308737}]
[{"$f":"'LDC Info'!$E$14","v":"Algoma Power Inc."},"EB-2019-0019",2020,2019,2015,"Non-Management (union and non-union)","Total Compensation (Salary, Wages, & Benefits)","2015 Board Approved",{"$f":"'App.2-K_Employee Costs'!P$27","v":6835490}]
[{"$f":"'LDC Info'!$E$14","v":"Algoma Power Inc."},"EB-2019-0019",2020,2019,2015,"Management (including executive)","Number of Employees (FTEs including Part-Time)","2015 Last Rebasing Actuals",{"$f":"'App.2-K_Employee Costs'!Q$14","v":15}]
[{"$f":"'LDC Info'!$E$14","v":"Algoma Power Inc."},"EB-2019-0019",2020,2019,2015,"Non-Management (union and non-union)","Number of Employees (FTEs including Part-Time)","2015 Last Rebasing Actuals",{"$f":"'App.2-K_Employee Costs'!Q$15","v":59}]
[{"$f":"'LDC Info'!$E$14","v":"Algoma Power Inc."},"EB-2019-0019",2020,2019,2015,"Management (including executive)","Total Salary and Wages including ovetime and incentive pay","2015 Last Rebasing Actuals",{"$f":"'App.2-K_Employee Costs'!Q$18","v":1663095}]
[{"$f":"'LDC Info'!$E$14","v":"Algoma Power Inc."},"EB-2019-0019",2020,2019,2015,"Non-Management (union and non-union)","Total Salary and Wages including ovetime and incentive pay","2015 Last Rebasing Actuals",{"$f":"'App.2-K_Employee Costs'!Q$19","v":4722845}]
[{"$f":"'LDC Info'!$E$14","v":"Algoma Power Inc."},"EB-2019-0019",2020,2019,2015,"Management (including executive)","Total Benefits (Current + Accrued)","2015 Last Rebasing Actuals",{"$f":"'App.2-K_Employee Costs'!Q$22","v":645642}]
[{"$f":"'LDC Info'!$E$14","v":"Algoma Power Inc."},"EB-2019-0019",2020,2019,2015,"Non-Management (union and non-union)","Total Benefits (Current + Accrued)","2015 Last Rebasing Actuals",{"$f":"'App.2-K_Employee Costs'!Q$23","v":2112645}]
[{"$f":"'LDC Info'!$E$14","v":"Algoma Power Inc."},"EB-2019-0019",2020,2019,2015,"Management (including executive)","Total Compensation (Salary, Wages, & Benefits)","2015 Last Rebasing Actuals",{"$f":"'App.2-K_Employee Costs'!Q$26","v":2308737}]
[{"$f":"'LDC Info'!$E$14","v":"Algoma Power Inc."},"EB-2019-0019",2020,2019,2015,"Non-Management (union and non-union)","Total Compensation (Salary, Wages, & Benefits)","2015 Last Rebasing Actuals",{"$f":"'App.2-K_Employee Costs'!Q$27","v":6835490}]
[{"$f":"'LDC Info'!$E$14","v":"Algoma Power Inc."},{"$f":"EBNUMBER","v":"EB-2019-0019"},{"$f":"TestYear","v":2020},{"$f":"BridgeYear","v":2019},{"$f":"RebaseYear","v":2015},"Management (including executive)","Number of Employees (FTEs including Part-Time)","2015 Actuals",{"$f":"'App.2-K_Employee Costs'!#REF!","v":{"$error":"#REF!"}}]
[{"$f":"'LDC Info'!$E$14","v":"Algoma Power Inc."},"EB-2019-0019",2020,2019,2015,"Non-Management (union and non-union)","Number of Employees (FTEs including Part-Time)","2015 Actuals",{"$f":"'App.2-K_Employee Costs'!#REF!","v":{"$error":"#REF!"}}]
[{"$f":"'LDC Info'!$E$14","v":"Algoma Power Inc."},"EB-2019-0019",2020,2019,2015,"Management (including executive)","Total Salary and Wages including ovetime and incentive pay","2015 Actuals",{"$f":"'App.2-K_Employee Costs'!#REF!","v":{"$error":"#REF!"}}]
[{"$f":"'LDC Info'!$E$14","v":"Algoma Power Inc."},"EB-2019-0019",2020,2019,2015,"Non-Management (union and non-union)","Total Salary and Wages including ovetime and incentive pay","2015 Actuals",{"$f":"'App.2-K_Employee Costs'!#REF!","v":{"$error":"#REF!"}}]
[{"$f":"'LDC Info'!$E$14","v":"Algoma Power Inc."},"EB-2019-0019",2020,2019,2015,"Management (including executive)","Total Benefits (Current + Accrued)","2015 Actuals",{"$f":"'App.2-K_Employee Costs'!#REF!","v":{"$error":"#REF!"}}]
[{"$f":"'LDC Info'!$E$14","v":"Algoma Power Inc."},"EB-2019-0019",2020,2019,2015,"Non-Management (union and non-union)","Total Benefits (Current + Accrued)","2015 Actuals",{"$f":"'App.2-K_Employee Costs'!#REF!","v":{"$error":"#REF!"}}]
[{"$f":"'LDC Info'!$E$14","v":"Algoma Power Inc."},"EB-2019-0019",2020,2019,2015,"Management (including executive)","Total Compensation (Salary, Wages, & Benefits)","2015 Actuals",{"$f":"'App.2-K_Employee Costs'!#REF!","v":{"$error":"#REF!"}}]
[{"$f":"'LDC Info'!$E$14","v":"Algoma Power Inc."},"EB-2019-0019",2020,2019,2015,"Non-Management (union and non-union)","Total Compensation (Salary, Wages, & Benefits)","2015 Actuals",{"$f":"'App.2-K_Employee Costs'!#REF!","v":{"$error":"#REF!"}}]
[{"$f":"'LDC Info'!$E$14","v":"Algoma Power Inc."},"EB-2019-0019",2020,2019,2015,"Management (including executive)","Number of Employees (FTEs including Part-Time)","2016 Board Approved",{"$f":"'App.2-K_Employee Costs'!S$14","v":0}]
[{"$f":"'LDC Info'!$E$14","v":"Algoma Power Inc."},"EB-2019-0019",2020,2019,2015,"Non-Management (union and non-union)","Number of Employees (FTEs including Part-Time)","2016 Board Approved",{"$f":"'App.2-K_Employee Costs'!S$15","v":0}]
[{"$f":"'LDC Info'!$E$14","v":"Algoma Power Inc."},"EB-2019-0019",2020,2019,2015,"Management (including executive)","Total Salary and Wages including ovetime and incentive pay","2016 Board Approved",{"$f":"'App.2-K_Employee Costs'!S$18","v":0}]
[{"$f":"'LDC Info'!$E$14","v":"Algoma Power Inc."},"EB-2019-0019",2020,2019,2015,"Non-Management (union and non-union)","Total Salary and Wages including ovetime and incentive pay","2016 Board Approved",{"$f":"'App.2-K_Employee Costs'!S$19","v":0}]
[{"$f":"'LDC Info'!$E$14","v":"Algoma Power Inc."},"EB-2019-0019",2020,2019,2015,"Management (including executive)","Total Benefits (Current + Accrued)","2016 Board Approved",{"$f":"'App.2-K_Employee Costs'!S$22","v":0}]
[{"$f":"'LDC Info'!$E$14","v":"Algoma Power Inc."},"EB-2019-0019",2020,2019,2015,"Non-Management (union and non-union)","Total Benefits (Current + Accrued)","2016 Board Approved",{"$f":"'App.2-K_Employee Costs'!S$23","v":0}]
[{"$f":"'LDC Info'!$E$14","v":"Algoma Power Inc."},"EB-2019-0019",2020,2019,2015,"Management (including executive)","Total Compensation (Salary, Wages, & Benefits)","2016 Board Approved",{"$f":"'App.2-K_Employee Costs'!S$26","v":0}]
[{"$f":"'LDC Info'!$E$14","v":"Algoma Power Inc."},"EB-2019-0019",2020,2019,2015,"Non-Management (union and non-union)","Total Compensation (Salary, Wages, & Benefits)","2016 Board Approved",{"$f":"'App.2-K_Employee Costs'!S$27","v":0}]
[{"$f":"'LDC Info'!$E$14","v":"Algoma Power Inc."},"EB-2019-0019",2020,2019,2015,"Management (including executive)","Number of Employees (FTEs including Part-Time)","2016 Last Rebasing Actuals",{"$f":"'App.2-K_Employee Costs'!T$14","v":11}]
[{"$f":"'LDC Info'!$E$14","v":"Algoma Power Inc."},"EB-2019-0019",2020,2019,2015,"Non-Management (union and non-union)","Number of Employees (FTEs including Part-Time)","2016 Last Rebasing Actuals",{"$f":"'App.2-K_Employee Costs'!T$15","v":59}]
[{"$f":"'LDC Info'!$E$14","v":"Algoma Power Inc."},"EB-2019-0019",2020,2019,2015,"Management (including executive)","Total Salary and Wages including ovetime and incentive pay","2016 Last Rebasing Actuals",{"$f":"'App.2-K_Employee Costs'!T$18","v":1527913.1889547636}]
[{"$f":"'LDC Info'!$E$14","v":"Algoma Power Inc."},"EB-2019-0019",2020,2019,2015,"Non-Management (union and non-union)","Total Salary and Wages including ovetime and incentive pay","2016 Last Rebasing Actuals",{"$f":"'App.2-K_Employee Costs'!T$19","v":5078369.445901759}]
[{"$f":"'LDC Info'!$E$14","v":"Algoma Power Inc."},"EB-2019-0019",2020,2019,2015,"Management (including executive)","Total Benefits (Current + Accrued)","2016 Last Rebasing Actuals",{"$f":"'App.2-K_Employee Costs'!T$22","v":359625.32552192273}]
[{"$f":"'LDC Info'!$E$14","v":"Algoma Power Inc."},"EB-2019-0019",2020,2019,2015,"Non-Management (union and non-union)","Total Benefits (Current + Accrued)","2016 Last Rebasing Actuals",{"$f":"'App.2-K_Employee Costs'!T$23","v":1687038.8717256307}]
[{"$f":"'LDC Info'!$E$14","v":"Algoma Power Inc."},"EB-2019-0019",2020,2019,2015,"Management (including executive)","Total Compensation (Salary, Wages, & Benefits)","2016 Last Rebasing Actuals",{"$f":"'App.2-K_Employee Costs'!T$26","v":1887538.5144766863}]
[{"$f":"'LDC Info'!$E$14","v":"Algoma Power Inc."},"EB-2019-0019",2020,2019,2015,"Non-Management (union and non-union)","Total Compensation (Salary, Wages, & Benefits)","2016 Last Rebasing Actuals",{"$f":"'App.2-K_Employee Costs'!T$27","v":6765408.3176273899}]
[{"$f":"'LDC Info'!$E$14","v":"Algoma Power Inc."},"EB-2019-0019",2020,2019,2015,"Management (including executive)","Number of Employees (FTEs including Part-Time)","2016 Actuals",{"$f":"'App.2-K_Employee Costs'!U$14","v":10}]
[{"$f":"'LDC Info'!$E$14","v":"Algoma Power Inc."},"EB-2019-0019",2020,2019,2015,"Non-Management (union and non-union)","Number of Employees (FTEs including Part-Time)","2016 Actuals",{"$f":"'App.2-K_Employee Costs'!U$15","v":59}]
[{"$f":"'LDC Info'!$E$14","v":"Algoma Power Inc."},"EB-2019-0019",2020,2019,2015,"Management (including executive)","Total Salary and Wages including ovetime and incentive pay","2016 Actuals",{"$f":"'App.2-K_Employee Costs'!U$18","v":1365026.0669289236}]
[{"$f":"'LDC Info'!$E$14","v":"Algoma Power Inc."},"EB-2019-0019",2020,2019,2015,"Non-Management (union and non-union)","Total Salary and Wages including ovetime and incentive pay","2016 Actuals",{"$f":"'App.2-K_Employee Costs'!U$19","v":5090533.3508459125}]
[{"$f":"'LDC Info'!$E$14","v":"Algoma Power Inc."},"EB-2019-0019",2020,2019,2015,"Management (including executive)","Total Benefits (Current + Accrued)","2016 Actuals",{"$f":"'App.2-K_Employee Costs'!U$22","v":358613.55575603596}]
[{"$f":"'LDC Info'!$E$14","v":"Algoma Power Inc."},"EB-2019-0019",2020,2019,2015,"Non-Management (union and non-union)","Total Benefits (Current + Accrued)","2016 Actuals",{"$f":"'App.2-K_Employee Costs'!U$23","v":1888382.6856609555}]
[{"$f":"'LDC Info'!$E$14","v":"Algoma Power Inc."},"EB-2019-0019",2020,2019,2015,"Management (including executive)","Total Compensation (Salary, Wages, & Benefits)","2016 Actuals",{"$f":"'App.2-K_Employee Costs'!U$26","v":1723639.6226849596}]
[{"$f":"'LDC Info'!$E$14","v":"Algoma Power Inc."},"EB-2019-0019",2020,2019,2015,"Non-Management (union and non-union)","Total Compensation (Salary, Wages, & Benefits)","2016 Actuals",{"$f":"'App.2-K_Employee Costs'!U$27","v":6978916.036506868}]
[{"$f":"'LDC Info'!$E$14","v":"Algoma Power Inc."},{"$f":"EBNUMBER","v":"EB-2019-0019"},{"$f":"TestYear","v":2020},{"$f":"BridgeYear","v":2019},{"$f":"RebaseYear","v":2015},"Management (including executive)","Number of Employees (FTEs including Part-Time)","2017 Board Approved",{"$f":"'App.2-K_Employee Costs'!V$14","v":0}]
[{"$f":"'LDC Info'!$E$14","v":"Algoma Power Inc."},"EB-2019-0019",2020,2019,2015,"Non-Management (union and non-union)","Number of Employees (FTEs including Part-Time)","2017 Board Approved",{"$f":"'App.2-K_Employee Costs'!V$15","v":0}]
[{"$f":"'LDC Info'!$E$14","v":"Algoma Power Inc."},"EB-2019-0019",2020,2019,2015,"Management (including executive)","Total Salary and Wages including ovetime and incentive pay","2017 Board Approved",{"$f":"'App.2-K_Employee Costs'!V$18","v":0}]
[{"$f":"'LDC Info'!$E$14","v":"Algoma Power Inc."},"EB-2019-0019",2020,2019,2015,"Non-Management (union and non-union)","Total Salary and Wages including ovetime and incentive pay","2017 Board Approved",{"$f":"'App.2-K_Employee Costs'!V$19","v":0}]
[{"$f":"'LDC Info'!$E$14","v":"Algoma Power Inc."},"EB-2019-0019",2020,2019,2015,"Management (including executive)","Total Benefits (Current + Accrued)","2017 Board Approved",{"$f":"'App.2-K_Employee Costs'!V$22","v":0}]
[{"$f":"'LDC Info'!$E$14","v":"Algoma Power Inc."},"EB-2019-0019",2020,2019,2015,"Non-Management (union and non-union)","Total Benefits (Current + Accrued)","2017 Board Approved",{"$f":"'App.2-K_Employee Costs'!V$23","v":0}]
[{"$f":"'LDC Info'!$E$14","v":"Algoma Power Inc."},"EB-2019-0019",2020,2019,2015,"Management (including executive)","Total Compensation (Salary, Wages, & Benefits)","2017 Board Approved",{"$f":"'App.2-K_Employee Costs'!V$26","v":0}]
[{"$f":"'LDC Info'!$E$14","v":"Algoma Power Inc."},"EB-2019-0019",2020,2019,2015,"Non-Management (union and non-union)","Total Compensation (Salary, Wages, & Benefits)","2017 Board Approved",{"$f":"'App.2-K_Employee Costs'!V$27","v":0}]
[{"$f":"'LDC Info'!$E$14","v":"Algoma Power Inc."},"EB-2019-0019",2020,2019,2015,"Management (including executive)","Number of Employees (FTEs including Part-Time)","2017 Last Rebasing Actuals",{"$f":"'App.2-K_Employee Costs'!W$14","v":0}]
[{"$f":"'LDC Info'!$E$14","v":"Algoma Power Inc."},"EB-2019-0019",2020,2019,2015,"Non-Management (union and non-union)","Number of Employees (FTEs including Part-Time)","2017 Last Rebasing Actuals",{"$f":"'App.2-K_Employee Costs'!W$15","v":0}]
[{"$f":"'LDC Info'!$E$14","v":"Algoma Power Inc."},"EB-2019-0019",2020,2019,2015,"Management (including executive)","Total Salary and Wages including ovetime and incentive pay","2017 Last Rebasing Actuals",{"$f":"'App.2-K_Employee Costs'!W$18","v":0}]
[{"$f":"'LDC Info'!$E$14","v":"Algoma Power Inc."},"EB-2019-0019",2020,2019,2015,"Non-Management (union and non-union)","Total Salary and Wages including ovetime and incentive pay","2017 Last Rebasing Actuals",{"$f":"'App.2-K_Employee Costs'!W$19","v":0}]
[{"$f":"'LDC Info'!$E$14","v":"Algoma Power Inc."},"EB-2019-0019",2020,2019,2015,"Management (including executive)","Total Benefits (Current + Accrued)","2017 Last Rebasing Actuals",{"$f":"'App.2-K_Employee Costs'!W$22","v":0}]
[{"$f":"'LDC Info'!$E$14","v":"Algoma Power Inc."},"EB-2019-0019",2020,2019,2015,"Non-Management (union and non-union)","Total Benefits (Current + Accrued)","2017 Last Rebasing Actuals",{"$f":"'App.2-K_Employee Costs'!W$23","v":0}]
[{"$f":"'LDC Info'!$E$14","v":"Algoma Power Inc."},"EB-2019-0019",2020,2019,2015,"Management (including executive)","Total Compensation (Salary, Wages, & Benefits)","2017 Last Rebasing Actuals",{"$f":"'App.2-K_Employee Costs'!W$26","v":0}]
[{"$f":"'LDC Info'!$E$14","v":"Algoma Power Inc."},"EB-2019-0019",2020,2019,2015,"Non-Management (union and non-union)","Total Compensation (Salary, Wages, & Benefits)","2017 Last Rebasing Actuals",{"$f":"'App.2-K_Employee Costs'!W$27","v":0}]
[{"$f":"'LDC Info'!$E$14","v":"Algoma Power Inc."},"EB-2019-0019",2020,2019,2015,"Management (including executive)","Number of Employees (FTEs including Part-Time)","2017 Actuals",{"$f":"'App.2-K_Employee Costs'!X$14","v":11}]
[{"$f":"'LDC Info'!$E$14","v":"Algoma Power Inc."},"EB-2019-0019",2020,2019,2015,"Non-Management (union and non-union)","Number of Employees (FTEs including Part-Time)","2017 Actuals",{"$f":"'App.2-K_Employee Costs'!X$15","v":58}]
[{"$f":"'LDC Info'!$E$14","v":"Algoma Power Inc."},"EB-2019-0019",2020,2019,2015,"Management (including executive)","Total Salary and Wages including ovetime and incentive pay","2017 Actuals",{"$f":"'App.2-K_Employee Costs'!X$18","v":1464209.3714341638}]
[{"$f":"'LDC Info'!$E$14","v":"Algoma Power Inc."},"EB-2019-0019",2020,2019,2015,"Non-Management (union and non-union)","Total Salary and Wages including ovetime and incentive pay","2017 Actuals",{"$f":"'App.2-K_Employee Costs'!X$19","v":5427380.9873799067}]
[{"$f":"'LDC Info'!$E$14","v":"Algoma Power Inc."},"EB-2019-0019",2020,2019,2015,"Management (including executive)","Total Benefits (Current + Accrued)","2017 Actuals",{"$f":"'App.2-K_Employee Costs'!X$22","v":388910.39416834095}]
[{"$f":"'LDC Info'!$E$14","v":"Algoma Power Inc."},"EB-2019-0019",2020,2019,2015,"Non-Management (union and non-union)","Total Benefits (Current + Accrued)","2017 Actuals",{"$f":"'App.2-K_Employee Costs'!X$23","v":1966520.6191986043}]
[{"$f":"'LDC Info'!$E$14","v":"Algoma Power Inc."},"EB-2019-0019",2020,2019,2015,"Management (including executive)","Total Compensation (Salary, Wages, & Benefits)","2017 Actuals",{"$f":"'App.2-K_Employee Costs'!X$26","v":1853119.7656025048}]
[{"$f":"'LDC Info'!$E$14","v":"Algoma Power Inc."},"EB-2019-0019",2020,2019,2015,"Non-Management (union and non-union)","Total Compensation (Salary, Wages, & Benefits)","2017 Actuals",{"$f":"'App.2-K_Employee Costs'!X$27","v":7393901.6065785112}]
[{"$f":"'LDC Info'!$E$14","v":"Algoma Power Inc."},"EB-2019-0019",2020,2019,2015,"Management (including executive)","Number of Employees (FTEs including Part-Time)","2018 Bridge Year",{"$f":"'App.2-K_Employee Costs'!Y$14","v":11}]
[{"$f":"'LDC Info'!$E$14","v":"Algoma Power Inc."},"EB-2019-0019",2020,2019,2015,"Non-Management (union and non-union)","Number of Employees (FTEs including Part-Time)","2018 Bridge Year",{"$f":"'App.2-K_Employee Costs'!Y$15","v":60}]
[{"$f":"'LDC Info'!$E$14","v":"Algoma Power Inc."},"EB-2019-0019",2020,2019,2015,"Management (including executive)","Total Salary and Wages including ovetime and incentive pay","2018 Bridge Year",{"$f":"'App.2-K_Employee Costs'!Y$18","v":1560527.0930407401}]
[{"$f":"'LDC Info'!$E$14","v":"Algoma Power Inc."},"EB-2019-0019",2020,2019,2015,"Non-Management (union and non-union)","Total Salary and Wages including ovetime and incentive pay","2018 Bridge Year",{"$f":"'App.2-K_Employee Costs'!Y$19","v":5671375.5539703192}]
[{"$f":"'LDC Info'!$E$14","v":"Algoma Power Inc."},"EB-2019-0019",2020,2019,2015,"Management (including executive)","Total Benefits (Current + Accrued)","2018 Bridge Year",{"$f":"'App.2-K_Employee Costs'!Y$22","v":403537.91390887671}]
[{"$f":"'LDC Info'!$E$14","v":"Algoma Power Inc."},"EB-2019-0019",2020,2019,2015,"Non-Management (union and non-union)","Total Benefits (Current + Accrued)","2018 Bridge Year",{"$f":"'App.2-K_Employee Costs'!Y$23","v":2080048.6199961351}]
[{"$f":"'LDC Info'!$E$14","v":"Algoma Power Inc."},"EB-2019-0019",2020,2019,2015,"Management (including executive)","Total Compensation (Salary, Wages, & Benefits)","2018 Bridge Year",{"$f":"'App.2-K_Employee Costs'!Y$26","v":1964065.0069496168}]
[{"$f":"'LDC Info'!$E$14","v":"Algoma Power Inc."},"EB-2019-0019",2020,2019,2015,"Non-Management (union and non-union)","Total Compensation (Salary, Wages, & Benefits)","2018 Bridge Year",{"$f":"'App.2-K_Employee Costs'!Y$27","v":7751424.1739664543}]
[{"$f":"'LDC Info'!$E$14","v":"Algoma Power Inc."},{"$f":"EBNUMBER","v":"EB-2019-0019"},{"$f":"TestYear","v":2020},{"$f":"BridgeYear","v":2019},{"$f":"RebaseYear","v":2015},"Management (including executive)","Number of Employees (FTEs including Part-Time)","2019 Test Year",{"$f":"'App.2-K_Employee Costs'!Z$14","v":11}]
[{"$f":"'LDC Info'!$E$14","v":"Algoma Power Inc."},"EB-2019-0019",2020,2019,2015,"Non-Management (union and non-union)","Number of Employees (FTEs including Part-Time)","2019 Test Year",{"$f":"'App.2-K_Employee Costs'!Z$15","v":59}]
[{"$f":"'LDC Info'!$E$14","v":"Algoma Power Inc."},"EB-2019-0019",2020,2019,2015,"Management (including executive)","Total Salary and Wages including ovetime and incentive pay","2019 Test Year",{"$f":"'App.2-K_Employee Costs'!Z$18","v":1608678.8812580835}]
[{"$f":"'LDC Info'!$E$14","v":"Algoma Power Inc."},"EB-2019-0019",2020,2019,2015,"Non-Management (union and non-union)","Total Salary and Wages including ovetime and incentive pay","2019 Test Year",{"$f":"'App.2-K_Employee Costs'!Z$19","v":5843490.4575412571}]
[{"$f":"'LDC Info'!$E$14","v":"Algoma Power Inc."},"EB-2019-0019",2020,2019,2015,"Management (including executive)","Total Benefits (Current + Accrued)","2019 Test Year",{"$f":"'App.2-K_Employee Costs'!Z$22","v":371197.39520397998}]
[{"$f":"'LDC Info'!$E$14","v":"Algoma Power Inc."},"EB-2019-0019",2020,2019,2015,"Non-Management (union and non-union)","Total Benefits (Current + Accrued)","2019 Test Year",{"$f":"'App.2-K_Employee Costs'!Z$23","v":1778794.436240989}]
[{"$f":"'LDC Info'!$E$14","v":"Algoma Power Inc."},"EB-2019-0019",2020,2019,2015,"Management (including executive)","Total Compensation (Salary, Wages, & Benefits)","2019 Test Year",{"$f":"'App.2-K_Employee Costs'!Z$26","v":1979876.2764620634}]
[{"$f":"'LDC Info'!$E$14","v":"Algoma Power Inc."},"EB-2019-0019",2020,2019,2015,"Non-Management (union and non-union)","Total Compensation (Salary, Wages, & Benefits)","2019 Test Year",{"$f":"'App.2-K_Employee Costs'!Z$27","v":7622284.8937822459}]

{"sheet":"App.2-L_OM&A_per_Cust_FTE","index":38,"n_rows":38,"n_cols":10,"rows_kept":38,"cut":false,"hidden":false,"merged":[[13,1,13,2],[14,1,14,2],[15,1,15,2],[8,1,8,9],[9,1,9,9],[22,1,22,2],[25,1,25,2],[26,1,26,2],[16,1,16,2],[17,1,17,2],[18,1,18,2],[19,1,19,2],[20,1,20,2],[21,1,21,2],[37,2,37,9],[34,2,34,9],[35,2,35,9],[36,2,36,9],[32,2,33,9]]}
[null,null,null,null,null,null,null,null,"File Number:",{"$f":"EBNUMBER","v":"EB-2019-0019"}]
[null,null,null,null,null,null,null,null,"Exhibit:",4]
[null,null,null,null,null,null,null,null,"Tab:"]
[null,null,null,null,null,null,null,null,"Schedule:"]
[null,null,null,null,null,null,null,null,"Page:"]
[]
[null,null,null,null,null,null,null,null,"Date:","2019-05-17"]
[]
[null,"Appendix 2-L"]
[null,"Recoverable OM&A Cost per Customer and per FTE 1"]
[]
[]
[null,null,null,{"$f":"\"Last Rebasing Year - \"&RebaseYear&\"- Board Approved\"","v":"Last Rebasing Year - 2015- Board Approved"},{"$f":"\"Last Rebasing Year - \"&RebaseYear&\"-  Actual\"","v":"Last Rebasing Year - 2015-  Actual"},{"$f":"BridgeYear -3 & \" Actuals\"","v":"2016 Actuals"},{"$f":"BridgeYear -2 & \" Actuals\"","v":"2017 Actuals"},{"$f":"BridgeYear -1 & \" Actuals\"","v":"2018 Actuals"},{"$f":"BridgeYear & \" Bridge Year\"","v":"2019 Bridge Year"},{"$f":"TestYear & \" Test Year\"","v":"2020 Test Year"}]
[null,"Reporting Basis",null,"MIFRS","MIFRS","MIFRS","MIFRS","MIFRS","MIFRS","MIFRS"]
[null,"OM&A Costs"]
[null,"     O&M",null,6761346,6296428.0900000017,6361486.580000001,6715383.0099999998,6711639.9000000004,7016300.4299999997,7080247.1800000016]
[null,"     Admin Expenses",null,5543535,5519130.9299999997,5442417.0999999996,5416338.1999999993,5422956.4499999993,5908154.2000000002,6596940.2100000009]
[null,"Total Recoverable OM&A from Appendix 2-JB 5",null,{"$f":"SUM(D16:D17)","v":12304881},{"$f":"SUM(E16:E17)","v":11815559.020000001},11803903.68,12131721.209999999,12134596.35,12924454.629999999,13677187.390000002]
[null,"Number of Customers 2,4",null,11684,11651.833333333332,11676.916666666666,11703.833333333334,11716.833333333332,11734.555232534187,12110.313178531684]
[null,"Number of FTEs 3,4",null,74,71,70,69,69,71,70]
[null,"Customers/FTEs",null,{"$f":"IF(D20=0,\"\",D19/D20)","v":157.8918918918919},{"$f":"IF(E20=0,\"\",E19/E20)","v":164.11032863849763},{"$f":"IF(F20=0,\"\",F19/F20)","v":166.81309523809523},169.62077294685992,169.80917874396133,165.27542581034066,173.00447397902406]
[null,"OM&A cost per customer"]
[null,"     O&M per customer",null,{"$f":"IF(D19=0,\"\",D16/D19)","v":578.68418349880176},{"$f":"IF(E19=0,\"\",E16/E19)","v":540.38089199124624},{"$f":"IF(F19=0,\"\",F16/F19)","v":544.79163991635926},573.77637041994785,572.82029274121282,597.91788363202954,584.64608434333218]
[null,"     Admin per customer",null,{"$f":"IF(D19=0,\"\",D17/D19)","v":474.45523793221497},{"$f":"IF(E19=0,\"\",E17/E19)","v":473.67060376764744},{"$f":"IF(F19=0,\"\",F17/F19)","v":466.08340672123774},462.7832647423208,462.83464957824214,503.4834369878439,544.73737489254984]
[null,"     Total OM&A per customer",null,{"$f":"IF(D19=0,\"\",D18/D19)","v":1053.1394214310167},{"$f":"IF(E19=0,\"\",E18/E19)","v":1014.0514957588937},{"$f":"IF(F19=0,\"\",F18/F19)","v":1010.8750466375971},1036.5596351622687,1035.6549423194549,1101.4013206198733,1129.3834592358819]
[null,"OM&A cost per FTE"]
[null,"     O&M per FTE",null,{"$f":"IF(D20=0,\"\",D16/D20)","v":91369.540540540547},{"$f":"IF(E20=0,\"\",E16/E20)","v":88682.085774647916},{"$f":"IF(F20=0,\"\",F16/F20)","v":90878.379714285722},97324.391449275354,97270.14347826087,98821.132816901401,101146.3882857143]
[null,"     Admin per FTE",null,{"$f":"IF(D20=0,\"\",D17/D20)","v":74912.635135135133},{"$f":"IF(E20=0,\"\",E17/E20)","v":77734.238450704215},{"$f":"IF(F20=0,\"\",F17/F20)","v":77748.815714285709},78497.655072463764,78593.571739130421,83213.439436619723,94242.003000000012]
[null,"     Total OM&A per FTE",null,{"$f":"IF(D20=0,\"\",D18/D20)","v":166282.17567567568},{"$f":"IF(E20=0,\"\",E18/E20)","v":166416.32422535215},{"$f":"IF(F20=0,\"\",F18/F20)","v":168627.19542857143},175822.0465217391,175863.71521739129,182034.57225352112,195388.39128571432]
[]
[null,"Notes:"]
[]
[null,1,"If it has been more than four years since the applicant last filed a cost of service application, additional years of historical actuals should be incorporated into the table, as necessary, to go back to the last cost of service application. If the applicant last filed a cost of service application less than four years ago, a minimum of three years of actual information is required."]
[]
[null,2,"The method of calculating the number of customers must be identified. Should correspond with data provided in Appendix 2-IB."]
[null,3,"The method of calculating the number of FTEs must be identified. See also Appendix 2-K."]
[null,4,"The number of customers and the number of FTEs should correspond to mid-year or average of January 1 and December 31 figures."]
[null,5,"For the test year, the applicant should take into account the system O&M (line 22 of Appendix 2-AB) in developing its forecasted OM&A."]

{"sheet":"App.2-L_OM&A_per_Cust_FTEE_exp","index":39,"n_rows":38,"n_cols":12,"rows_kept":38,"cut":false,"hidden":true,"merged":[[37,1,38,11],[36,1,36,11],[32,1,33,11],[19,0,19,1],[18,0,18,1],[20,0,20,1],[26,0,26,1],[8,0,8,11],[9,0,9,11],[34,1,34,6],[35,1,35,6],[21,0,21,1],[22,0,22,1],[25,0,25,1],[14,0,14,1],[13,0,13,1],[11,7,11,11],[15,0,15,1],[16,0,16,1],[17,0,17,1]]}
[null,null,null,null,null,null,null,null,null,null,"File Number:",{"$f":"EBNUMBER","v":"EB-2019-0019"}]
[null,null,null,null,null,null,null,null,null,null,"Exhibit:"]
[null,null,null,null,null,null,null,null,null,null,"Tab:"]
[null,null,null,null,null,null,null,null,null,null,"Schedule:"]
[null,null,null,null,null,null,null,null,null,null,"Page:"]
[]
[null,null,null,null,null,null,null,null,null,null,"Date:"]
[]
["Appendix 2-L"]
["Recoverable OM&A Cost per Customer and per FTE 1"]
[]
[null,null,null,null,null,null,null,"5-year Distribution System Plan Period"]
[null,null,{"$f":"\"Last Rebasing Year - \"&RebaseYear&\"- Board Approved\"","v":"Last Rebasing Year - 2015- Board Approved"},{"$f":"\"Last Rebasing Year - \"&RebaseYear&\"-  Actual\"","v":"Last Rebasing Year - 2015-  Actual"},{"$f":"BridgeYear -2 & \" Actuals\"","v":"2017 Actuals"},{"$f":"BridgeYear -1 & \" Actuals\"","v":"2018 Actuals"},{"$f":"BridgeYear & \" Bridge Year\"","v":"2019 Bridge Year"},{"$f":"TestYear & \" Test Year\"","v":"2020 Test Year"},{"$f":"TestYear+1 & \" Year\"","v":"2021 Year"},{"$f":"TestYear+2 & \" Year\"","v":"2022 Year"},{"$f":"TestYear+3 & \" Year\"","v":"2023 Year"},{"$f":"TestYear+4 & \" Year\"","v":"2024 Year"}]
["Reporting Basis"]
["OM&A Costs"]
["     O&M"]
["     Admin Expenses"]
["Total Recoverable OM&A from Appendix 2-JB 5",null,{"$f":"SUM(C16:C17)","v":0},{"$f":"SUM(D16:D17)","v":0},0,0,0,0,0,0,0,0]
["Number of Customers 2,4"]
["Number of FTEs 3,4"]
["Customers/FTEs",null,{"$f":"IF(C20=0,\"\",C19/C20)","v":""},{"$f":"IF(D20=0,\"\",D19/D20)","v":""},"","","","","","","",""]
["OM&A cost per customer"]
["     O&M per customer",null,{"$f":"IF(C19=0,\"\",C16/C19)","v":""},{"$f":"IF(D19=0,\"\",D16/D19)","v":""},"","","","","","","",""]
["     Admin per customer",null,{"$f":"IF(C19=0,\"\",C17/C19)","v":""},{"$f":"IF(D19=0,\"\",D17/D19)","v":""},"","","","","","","",""]
["     Total OM&A per customer",null,{"$f":"IF(C19=0,\"\",C18/C19)","v":""},{"$f":"IF(D19=0,\"\",D18/D19)","v":""},"","","","","","","",""]
["OM&A cost per FTE"]
["     O&M per FTE",null,{"$f":"IF(C20=0,\"\",C16/C20)","v":""},{"$f":"IF(D20=0,\"\",D16/D20)","v":""},"","","","","","","",""]
["     Admin per FTE",null,{"$f":"IF(C20=0,\"\",C17/C20)","v":""},{"$f":"IF(D20=0,\"\",D17/D20)","v":""},"","","","","","","",""]
["     Total OM&A per FTE",null,{"$f":"IF(C20=0,\"\",C18/C20)","v":""},{"$f":"IF(D20=0,\"\",D18/D20)","v":""},"","","","","","","",""]
[]
["Notes:"]
[]
[1,"If it has been more than three years since the applicant last filed a cost of service application, additional years of historical actuals should be incorporated into the table, as necessary, to go back to the last cost of service application.  If the applicant last filed a cost of service application less than three years ago, a minimum of three years of actual information is required."]
[]
[2,"The method of calculating the number of customers must be identified. Should be linked back to Appendix 2-IA"]
[3,"The method of calculating the number of FTEs must be identified.  See also Appendix 2-K"]
[4,"The number of customers and the number of FTEs should correspond to mid-year or average of January 1 and December 31 figures."]
[5,"For the test year and in the subsequent four years of the DSP period, the applicant should take into account the system O&M (line X of Appendix 2-AB) in developing its forecasted OM&A. Admin expenses beyond the test year also need to be forecasted (separately)."]

{"sheet":"App.2-M_Regulatory_Costs","index":40,"n_rows":71,"n_cols":11,"rows_kept":71,"cut":false,"hidden":false,"merged":[[35,0,35,1],[12,0,12,1],[13,0,13,1],[8,0,8,10],[9,0,9,10],[14,0,14,1]]}
[null,null,null,null,null,null,null,null,null,"File Number:",{"$f":"EBNUMBER","v":"EB-2019-0019"}]
[null,null,null,null,null,null,null,null,null,"Exhibit:",4]
[null,null,null,null,null,null,null,null,null,"Tab:"]
["TO BE UPDATED AT THE DRAFT RATE ORDER STAGE",null,null,null,null,null,null,null,null,"Schedule:"]
[null,null,null,null,null,null,null,null,null,"Page:"]
[]
[null,null,null,null,null,null,null,null,null,"Date:","2019-09-24"]
[]
["Appendix 2-M"]
["Regulatory Cost Schedule"]
[]
[]
["Regulatory Cost Category",null,"USoA Account","USoA Account Balance",{"$f":"\"Last Rebasing Year (\" & RebaseYear & \" Board Approved)\"","v":"Last Rebasing Year (2015 Board Approved)"},{"$f":"\"Last Rebasing Year (\" & RebaseYear & \" Actual)\"","v":"Last Rebasing Year (2015 Actual)"},{"$f":"\"Most Current Actuals Year \" & TestYear - 2","v":"Most Current Actuals Year 2018"},{"$f":"TestYear -1 & \" Bridge Year\"","v":"2019 Bridge Year"},"Annual % Change",{"$f":"TestYear & \" Test Year\"","v":"2020 Test Year"},"Annual % Change"]
["(A)",null,"(B)","(C )","(D)","(E)","(F)","(G)","(H)=[(G)-(F)]/(F)","(I)","(J) = [(I)-(G)]/(G)"]
["Regulatory Costs (Ongoing)"]
[1,"OEB Annual Assessment",5655,null,115000,123037,50464,70800,{"$f":"IF(G16=0,\"\",(H16-G16)/G16)","v":0.40298034242232084},71904,{"$f":"IF(H16=0,\"\",(J16-H16)/H16)","v":1.5593220338983051E-2}]
[2,"OEB Section 30 Costs (OEB-initiated)",5655,null,1000,10946.29,1640.72,5496,{"$f":"IF(G17=0,\"\",(H17-G17)/G17)","v":2.3497488907308983},5416,{"$f":"IF(H17=0,\"\",(J17-H17)/H17)","v":-1.4556040756914119E-2}]
[3,"Expert Witness costs for regulatory matters",5655,null,null,null,null,null,"",null,""]
[4,"Legal costs for regulatory matters",5655,null,null,3875,null,1475,"",null,-1]
[5,"Consultants' costs for regulatory matters",5655,null,null,null,null,null,"",null,""]
[6,"Operating expenses associated with staff resources allocated to regulatory matters",5655,null,53886,58504.31,34393.140000000043,29179.559999999998,-0.1515877875646143,48458.520000000019,0.66070084675711427]
[7,"Operating expenses associated with other resources allocated to regulatory matters 1",5655,null,null,null,null,null,"",null,""]
[8,"Other regulatory agency fees or assessments",5655,null,null,null,null,null,"",null,""]
[9,"Any other costs for regulatory matters (please define) - Amortization of 2015 Approved One-Time Costs",5655,null,null,44628.959999999985,44628.95999999997,44629,8.962790087417895E-7,null,-1]
[10,"Intervenor costs",5655,null,null,null,null,null,"",null,""]
[11,"OEB Section 30 Costs (Applicant-Originated)",5655,null,1000,null,null,null,"",null,""]
[12,null,null,null,null,null,null,null,"",null,""]
[13,null,null,null,null,null,null,null,"",null,""]
[14,null,null,null,null,null,null,null,"",null,""]
[15,null,null,null,null,null,null,null,"",null,""]
[16,null,null,null,null,null,null,null,"",null,""]
[17,null,null,null,null,null,null,null,"",null,""]
[18,null,null,null,null,null,null,null,"",null,""]
[19,null,null,null,null,null,null,null,"",null,""]
[20,null,null,null,null,null,null,null,"",null,""]
["Regulatory Costs (One-Time)"]
[1,"Expert Witness costs",5655,null,null,null,null,null,"",null,""]
[2,"Legal costs",5655,null,110000,null,null,null,"",110000,""]
[3,"Consultants' costs",5655,null,40000,null,null,null,"",73500,""]
[4,"Incremental operating expenses associated with staff resources allocated to this application.",5655,null,null,null,null,null,"",null,""]
[5,"Incremental operating expenses associated with other resources allocated to this application. 1",5655,null,null,null,null,null,"",null,""]
[6,"Intervenor costs",5655,null,75000,null,null,null,"",{"$f":"130000-32500","v":97500},""]
[7,"OEB Section 30 Costs (application-related)",5655,null,null,null,null,null,"",null,""]
[8,"Customer Engagment and Other costs",5655,null,null,null,null,null,"",40000,""]
[9,"Recovery of One-Time DLI-Related Costs (EB-2018-0271)",4305,null,null,null,null,null,{"$f":"IF(G45=0,\"\",(H45-G45)/G45)","v":""},617765,""]
[10,null,null,null,null,null,null,null,"",null,""]
[11,null,null,null,null,null,null,null,"",null,""]
[12,null,null,null,null,null,null,null,"",null,""]
[13,null,null,null,null,null,null,null,"",null,""]
[14,null,null,null,null,null,null,null,"",null,""]
[15,null,null,null,null,null,null,null,"",null,""]
[1,"Sub-total - Ongoing Costs 2",null,{"$f":"SUM(D16:D35)","v":0},{"$f":"SUM(E16:E35)","v":170886},{"$f":"SUM(F16:F35)","v":240991.56},{"$f":"SUM(G16:G35)","v":131126.82},{"$f":"SUM(H16:H35)","v":151579.56},0.15597678644231583,{"$f":"SUM(J16:J35)","v":125778.52000000002},-0.17021450649414724]
[2,"Sub-total - One-time Costs 3",null,{"$f":"SUM(D37:D51)","v":0},{"$f":"SUM(E37:E51)","v":225000},0,0,0,"",{"$f":"SUM(J37:J51)","v":938765},""]
[3,"Total (Ongoing + 1/5 of One-Time)",null,{"$f":"D52+D53","v":0},{"$f":"E52+E58","v":215886},{"$f":"F52+F53","v":240991.56},131126.82,151579.56,0.15597678644231583,{"$f":"J52+C58","v":313531.52000000002},1.0684287512115751]
[]
[null,"Application-Related One-Time Costs","Total (2020)",null,"Total (2015)"]
[null,"Total One-Time Costs Related to Application to be Amortized over IRM Period",{"$f":"J53","v":938765},null,{"$f":"E53","v":225000}]
[null,"1/5 of Total One-Time Costs",{"$f":"C57/5","v":187753},null,{"$f":"E57/5","v":45000}]
[]
[null,"Account 5655",{"$f":"(C57-J45)/5","v":64200}]
[null,"Account 4305",{"$f":"J45/5","v":123553}]
[]
[]
[]
[]
[]
["Notes:"]
[]
["1","Please identify the resources involved."]
["2","Sum of all ongoing costs."]
["3","Sum of all one-time costs."]

{"sheet":"Hidden_RegulatoryCosts1","index":41,"n_rows":40,"n_cols":16,"rows_kept":40,"cut":false,"hidden":true,"merged":[]}
["Utility Name","EB Number","Test Year","Bridge Year","Last Rebasing Year","Regulatory Cost Category","Type of Cost","USoA","USoA Account Balance",{"$f":"'App.2-M_Regulatory_Costs'!E13","v":"Last Rebasing Year (2015 Board Approved)"},{"$f":"'App.2-M_Regulatory_Costs'!F13","v":"Last Rebasing Year (2015 Actual)"},{"$f":"'App.2-M_Regulatory_Costs'!G13","v":"Most Current Actuals Year 2018"},{"$f":"'App.2-M_Regulatory_Costs'!H13","v":"2019 Bridge Year"},{"$f":"'App.2-M_Regulatory_Costs'!I13","v":"Annual % Change"},{"$f":"'App.2-M_Regulatory_Costs'!J13","v":"2020 Test Year"},{"$f":"'App.2-M_Regulatory_Costs'!K13","v":"Annual % Change"}]
[{"$f":"'LDC Info'!$E$14","v":"Algoma Power Inc."},{"$f":"EBNUMBER","v":"EB-2019-0019"},{"$f":"TestYear","v":2020},{"$f":"BridgeYear","v":2019},{"$f":"RebaseYear","v":2015},"OEB Annual Assessment","Ongoing",{"$f":"'App.2-M_Regulatory_Costs'!C16","v":5655},{"$f":"'App.2-M_Regulatory_Costs'!D16","v":0},{"$f":"'App.2-M_Regulatory_Costs'!E16","v":115000},{"$f":"'App.2-M_Regulatory_Costs'!F16","v":123037},{"$f":"'App.2-M_Regulatory_Costs'!G16","v":50464},{"$f":"'App.2-M_Regulatory_Costs'!H16","v":70800},{"$f":"'App.2-M_Regulatory_Costs'!I16","v":0.40298034242232084},{"$f":"'App.2-M_Regulatory_Costs'!J16","v":71904},{"$f":"'App.2-M_Regulatory_Costs'!K16","v":1.5593220338983051E-2}]
[{"$f":"'LDC Info'!$E$14","v":"Algoma Power Inc."},"EB-2019-0019",2020,2019,2015,"OEB Section 30 Costs (OEB-initiated)","Ongoing",{"$f":"'App.2-M_Regulatory_Costs'!C17","v":5655},{"$f":"'App.2-M_Regulatory_Costs'!D17","v":0},{"$f":"'App.2-M_Regulatory_Costs'!E17","v":1000},{"$f":"'App.2-M_Regulatory_Costs'!F17","v":10946.29},{"$f":"'App.2-M_Regulatory_Costs'!G17","v":1640.72},{"$f":"'App.2-M_Regulatory_Costs'!H17","v":5496},{"$f":"'App.2-M_Regulatory_Costs'!I17","v":2.3497488907308983},{"$f":"'App.2-M_Regulatory_Costs'!J17","v":5416},{"$f":"'App.2-M_Regulatory_Costs'!K17","v":-1.4556040756914119E-2}]
[{"$f":"'LDC Info'!$E$14","v":"Algoma Power Inc."},"EB-2019-0019",2020,2019,2015,"Expert Witness costs for regulatory matters","Ongoing",{"$f":"'App.2-M_Regulatory_Costs'!C18","v":5655},{"$f":"'App.2-M_Regulatory_Costs'!D18","v":0},{"$f":"'App.2-M_Regulatory_Costs'!E18","v":0},{"$f":"'App.2-M_Regulatory_Costs'!F18","v":0},{"$f":"'App.2-M_Regulatory_Costs'!G18","v":0},{"$f":"'App.2-M_Regulatory_Costs'!H18","v":0},{"$f":"'App.2-M_Regulatory_Costs'!I18","v":""},{"$f":"'App.2-M_Regulatory_Costs'!J18","v":0},{"$f":"'App.2-M_Regulatory_Costs'!K18","v":""}]
[{"$f":"'LDC Info'!$E$14","v":"Algoma Power Inc."},"EB-2019-0019",2020,2019,2015,"Legal costs for regulatory matters","Ongoing",{"$f":"'App.2-M_Regulatory_Costs'!C19","v":5655},{"$f":"'App.2-M_Regulatory_Costs'!D19","v":0},{"$f":"'App.2-M_Regulatory_Costs'!E19","v":0},{"$f":"'App.2-M_Regulatory_Costs'!F19","v":3875},{"$f":"'App.2-M_Regulatory_Costs'!G19","v":0},{"$f":"'App.2-M_Regulatory_Costs'!H19","v":1475},{"$f":"'App.2-M_Regulatory_Costs'!I19","v":""},{"$f":"'App.2-M_Regulatory_Costs'!J19","v":0},{"$f":"'App.2-M_Regulatory_Costs'!K19","v":-1}]
[{"$f":"'LDC Info'!$E$14","v":"Algoma Power Inc."},"EB-2019-0019",2020,2019,2015,"Consultants' costs for regulatory matters","Ongoing",{"$f":"'App.2-M_Regulatory_Costs'!C20","v":5655},{"$f":"'App.2-M_Regulatory_Costs'!D20","v":0},{"$f":"'App.2-M_Regulatory_Costs'!E20","v":0},{"$f":"'App.2-M_Regulatory_Costs'!F20","v":0},{"$f":"'App.2-M_Regulatory_Costs'!G20","v":0},{"$f":"'App.2-M_Regulatory_Costs'!H20","v":0},{"$f":"'App.2-M_Regulatory_Costs'!I20","v":""},{"$f":"'App.2-M_Regulatory_Costs'!J20","v":0},{"$f":"'App.2-M_Regulatory_Costs'!K20","v":""}]
[{"$f":"'LDC Info'!$E$14","v":"Algoma Power Inc."},"EB-2019-0019",2020,2019,2015,"Operating expenses associated with staff resources allocated to regulatory matters","Ongoing",{"$f":"'App.2-M_Regulatory_Costs'!C21","v":5655},{"$f":"'App.2-M_Regulatory_Costs'!D21","v":0},{"$f":"'App.2-M_Regulatory_Costs'!E21","v":53886},{"$f":"'App.2-M_Regulatory_Costs'!F21","v":58504.31},{"$f":"'App.2-M_Regulatory_Costs'!G21","v":34393.140000000043},{"$f":"'App.2-M_Regulatory_Costs'!H21","v":29179.559999999998},{"$f":"'App.2-M_Regulatory_Costs'!I21","v":-0.1515877875646143},{"$f":"'App.2-M_Regulatory_Costs'!J21","v":48458.520000000019},{"$f":"'App.2-M_Regulatory_Costs'!K21","v":0.66070084675711427}]
[{"$f":"'LDC Info'!$E$14","v":"Algoma Power Inc."},"EB-2019-0019",2020,2019,2015,"Operating expenses associated with other resources allocated to regulatory matters","Ongoing",{"$f":"'App.2-M_Regulatory_Costs'!C22","v":5655},{"$f":"'App.2-M_Regulatory_Costs'!D22","v":0},{"$f":"'App.2-M_Regulatory_Costs'!E22","v":0},{"$f":"'App.2-M_Regulatory_Costs'!F22","v":0},{"$f":"'App.2-M_Regulatory_Costs'!G22","v":0},{"$f":"'App.2-M_Regulatory_Costs'!H22","v":0},{"$f":"'App.2-M_Regulatory_Costs'!I22","v":""},{"$f":"'App.2-M_Regulatory_Costs'!J22","v":0},{"$f":"'App.2-M_Regulatory_Costs'!K22","v":""}]
[{"$f":"'LDC Info'!$E$14","v":"Algoma Power Inc."},"EB-2019-0019",2020,2019,2015,"Other regulatory agency fees or assessments","Ongoing",{"$f":"'App.2-M_Regulatory_Costs'!C23","v":5655},{"$f":"'App.2-M_Regulatory_Costs'!D23","v":0},{"$f":"'App.2-M_Regulatory_Costs'!E23","v":0},{"$f":"'App.2-M_Regulatory_Costs'!F23","v":0},{"$f":"'App.2-M_Regulatory_Costs'!G23","v":0},{"$f":"'App.2-M_Regulatory_Costs'!H23","v":0},{"$f":"'App.2-M_Regulatory_Costs'!I23","v":""},{"$f":"'App.2-M_Regulatory_Costs'!J23","v":0},{"$f":"'App.2-M_Regulatory_Costs'!K23","v":""}]
[{"$f":"'LDC Info'!$E$14","v":"Algoma Power Inc."},"EB-2019-0019",2020,2019,2015,"Any other costs for regulatory matters (please define)","Ongoing",{"$f":"'App.2-M_Regulatory_Costs'!C24","v":5655},{"$f":"'App.2-M_Regulatory_Costs'!D24","v":0},{"$f":"'App.2-M_Regulatory_Costs'!E24","v":0},{"$f":"'App.2-M_Regulatory_Costs'!F24","v":44628.959999999985},{"$f":"'App.2-M_Regulatory_Costs'!G24","v":44628.95999999997},{"$f":"'App.2-M_Regulatory_Costs'!H24","v":44629},{"$f":"'App.2-M_Regulatory_Costs'!I24","v":8.962790087417895E-7},{"$f":"'App.2-M_Regulatory_Costs'!J24","v":0},{"$f":"'App.2-M_Regulatory_Costs'!K24","v":-1}]
[{"$f":"'LDC Info'!$E$14","v":"Algoma Power Inc."},"EB-2019-0019",2020,2019,2015,"Intervenor costs","Ongoing",{"$f":"'App.2-M_Regulatory_Costs'!C25","v":5655},{"$f":"'App.2-M_Regulatory_Costs'!D25","v":0},{"$f":"'App.2-M_Regulatory_Costs'!E25","v":0},{"$f":"'App.2-M_Regulatory_Costs'!F25","v":0},{"$f":"'App.2-M_Regulatory_Costs'!G25","v":0},{"$f":"'App.2-M_Regulatory_Costs'!H25","v":0},{"$f":"'App.2-M_Regulatory_Costs'!I25","v":""},{"$f":"'App.2-M_Regulatory_Costs'!J25","v":0},{"$f":"'App.2-M_Regulatory_Costs'!K25","v":""}]
[{"$f":"'LDC Info'!$E$14","v":"Algoma Power Inc."},"EB-2019-0019",2020,2019,2015,{"$f":"'App.2-M_Regulatory_Costs'!B26","v":"OEB Section 30 Costs (Applicant-Originated)"},"Ongoing",{"$f":"'App.2-M_Regulatory_Costs'!C26","v":5655},{"$f":"'App.2-M_Regulatory_Costs'!D26","v":0},{"$f":"'App.2-M_Regulatory_Costs'!E26","v":1000},{"$f":"'App.2-M_Regulatory_Costs'!F26","v":0},{"$f":"'App.2-M_Regulatory_Costs'!G26","v":0},{"$f":"'App.2-M_Regulatory_Costs'!H26","v":0},{"$f":"'App.2-M_Regulatory_Costs'!I26","v":""},{"$f":"'App.2-M_Regulatory_Costs'!J26","v":0},{"$f":"'App.2-M_Regulatory_Costs'!K26","v":""}]
[{"$f":"'LDC Info'!$E$14","v":"Algoma Power Inc."},"EB-2019-0019",2020,2019,2015,{"$f":"'App.2-M_Regulatory_Costs'!B27","v":0},"Ongoing",{"$f":"'App.2-M_Regulatory_Costs'!C35","v":0},{"$f":"'App.2-M_Regulatory_Costs'!D35","v":0},{"$f":"'App.2-M_Regulatory_Costs'!E35","v":0},{"$f":"'App.2-M_Regulatory_Costs'!F35","v":0},{"$f":"'App.2-M_Regulatory_Costs'!G35","v":0},{"$f":"'App.2-M_Regulatory_Costs'!H35","v":0},{"$f":"'App.2-M_Regulatory_Costs'!I35","v":""},{"$f":"'App.2-M_Regulatory_Costs'!J35","v":0},{"$f":"'App.2-M_Regulatory_Costs'!K35","v":""}]
[{"$f":"'LDC Info'!$E$14","v":"Algoma Power Inc."},"EB-2019-0019",2020,2019,2015,{"$f":"'App.2-M_Regulatory_Costs'!B28","v":0},"Ongoing",{"$f":"'App.2-M_Regulatory_Costs'!C41","v":5655},{"$f":"'App.2-M_Regulatory_Costs'!D41","v":0},{"$f":"'App.2-M_Regulatory_Costs'!E41","v":0},{"$f":"'App.2-M_Regulatory_Costs'!F41","v":0},{"$f":"'App.2-M_Regulatory_Costs'!G41","v":0},{"$f":"'App.2-M_Regulatory_Costs'!H41","v":0},{"$f":"'App.2-M_Regulatory_Costs'!I41","v":""},{"$f":"'App.2-M_Regulatory_Costs'!J41","v":0},{"$f":"'App.2-M_Regulatory_Costs'!K41","v":""}]
[{"$f":"'LDC Info'!$E$14","v":"Algoma Power Inc."},"EB-2019-0019",2020,2019,2015,{"$f":"'App.2-M_Regulatory_Costs'!B29","v":0},"Ongoing",{"$f":"'App.2-M_Regulatory_Costs'!C42","v":5655},{"$f":"'App.2-M_Regulatory_Costs'!D42","v":0},{"$f":"'App.2-M_Regulatory_Costs'!E42","v":75000},{"$f":"'App.2-M_Regulatory_Costs'!F42","v":0},{"$f":"'App.2-M_Regulatory_Costs'!G42","v":0},{"$f":"'App.2-M_Regulatory_Costs'!H42","v":0},{"$f":"'App.2-M_Regulatory_Costs'!I42","v":""},{"$f":"'App.2-M_Regulatory_Costs'!J42","v":97500},{"$f":"'App.2-M_Regulatory_Costs'!K42","v":""}]
[{"$f":"'LDC Info'!$E$14","v":"Algoma Power Inc."},"EB-2019-0019",2020,2019,2015,{"$f":"'App.2-M_Regulatory_Costs'!B30","v":0},"Ongoing",{"$f":"'App.2-M_Regulatory_Costs'!C43","v":5655},{"$f":"'App.2-M_Regulatory_Costs'!D43","v":0},{"$f":"'App.2-M_Regulatory_Costs'!E43","v":0},{"$f":"'App.2-M_Regulatory_Costs'!F43","v":0},{"$f":"'App.2-M_Regulatory_Costs'!G43","v":0},{"$f":"'App.2-M_Regulatory_Costs'!H43","v":0},{"$f":"'App.2-M_Regulatory_Costs'!I43","v":""},{"$f":"'App.2-M_Regulatory_Costs'!J43","v":0},{"$f":"'App.2-M_Regulatory_Costs'!K43","v":""}]
[{"$f":"'LDC Info'!$E$14","v":"Algoma Power Inc."},"EB-2019-0019",2020,2019,2015,{"$f":"'App.2-M_Regulatory_Costs'!B31","v":0},"Ongoing",{"$f":"'App.2-M_Regulatory_Costs'!C47","v":0},{"$f":"'App.2-M_Regulatory_Costs'!D47","v":0},{"$f":"'App.2-M_Regulatory_Costs'!E47","v":0},{"$f":"'App.2-M_Regulatory_Costs'!F47","v":0},{"$f":"'App.2-M_Regulatory_Costs'!G47","v":0},{"$f":"'App.2-M_Regulatory_Costs'!H47","v":0},{"$f":"'App.2-M_Regulatory_Costs'!I47","v":""},{"$f":"'App.2-M_Regulatory_Costs'!J47","v":0},{"$f":"'App.2-M_Regulatory_Costs'!K47","v":""}]
[{"$f":"'LDC Info'!$E$14","v":"Algoma Power Inc."},"EB-2019-0019",2020,2019,2015,{"$f":"'App.2-M_Regulatory_Costs'!B32","v":0},"Ongoing",{"$f":"'App.2-M_Regulatory_Costs'!C48","v":0},{"$f":"'App.2-M_Regulatory_Costs'!D48","v":0},{"$f":"'App.2-M_Regulatory_Costs'!E48","v":0},{"$f":"'App.2-M_Regulatory_Costs'!F48","v":0},{"$f":"'App.2-M_Regulatory_Costs'!G48","v":0},{"$f":"'App.2-M_Regulatory_Costs'!H48","v":0},{"$f":"'App.2-M_Regulatory_Costs'!I48","v":""},{"$f":"'App.2-M_Regulatory_Costs'!J48","v":0},{"$f":"'App.2-M_Regulatory_Costs'!K48","v":""}]
[{"$f":"'LDC Info'!$E$14","v":"Algoma Power Inc."},"EB-2019-0019",2020,2019,2015,{"$f":"'App.2-M_Regulatory_Costs'!B33","v":0},"Ongoing",{"$f":"'App.2-M_Regulatory_Costs'!C49","v":0},{"$f":"'App.2-M_Regulatory_Costs'!D49","v":0},{"$f":"'App.2-M_Regulatory_Costs'!E49","v":0},{"$f":"'App.2-M_Regulatory_Costs'!F49","v":0},{"$f":"'App.2-M_Regulatory_Costs'!G49","v":0},{"$f":"'App.2-M_Regulatory_Costs'!H49","v":0},{"$f":"'App.2-M_Regulatory_Costs'!I49","v":""},{"$f":"'App.2-M_Regulatory_Costs'!J49","v":0},{"$f":"'App.2-M_Regulatory_Costs'!K49","v":""}]
[{"$f":"'LDC Info'!$E$14","v":"Algoma Power Inc."},"EB-2019-0019",2020,2019,2015,{"$f":"'App.2-M_Regulatory_Costs'!B34","v":0},"Ongoing",{"$f":"'App.2-M_Regulatory_Costs'!C50","v":0},{"$f":"'App.2-M_Regulatory_Costs'!D50","v":0},{"$f":"'App.2-M_Regulatory_Costs'!E50","v":0},{"$f":"'App.2-M_Regulatory_Costs'!F50","v":0},{"$f":"'App.2-M_Regulatory_Costs'!G50","v":0},{"$f":"'App.2-M_Regulatory_Costs'!H50","v":0},{"$f":"'App.2-M_Regulatory_Costs'!I50","v":""},{"$f":"'App.2-M_Regulatory_Costs'!J50","v":0},{"$f":"'App.2-M_Regulatory_Costs'!K50","v":""}]
[{"$f":"'LDC Info'!$E$14","v":"Algoma Power Inc."},"EB-2019-0019",2020,2019,2015,{"$f":"'App.2-M_Regulatory_Costs'!B35","v":0},"Ongoing",{"$f":"'App.2-M_Regulatory_Costs'!C51","v":0},{"$f":"'App.2-M_Regulatory_Costs'!D51","v":0},{"$f":"'App.2-M_Regulatory_Costs'!E51","v":0},{"$f":"'App.2-M_Regulatory_Costs'!F51","v":0},{"$f":"'App.2-M_Regulatory_Costs'!G51","v":0},{"$f":"'App.2-M_Regulatory_Costs'!H51","v":0},{"$f":"'App.2-M_Regulatory_Costs'!I51","v":""},{"$f":"'App.2-M_Regulatory_Costs'!J51","v":0},{"$f":"'App.2-M_Regulatory_Costs'!K51","v":""}]
[{"$f":"'LDC Info'!$E$14","v":"Algoma Power Inc."},"EB-2019-0019",2020,2019,2015,null,null,null," "," "," "," "," "," "," ",{"$f":"'App.2-M_Regulatory_Costs'!K52","v":-0.17021450649414724}]
[{"$f":"'LDC Info'!$E$14","v":"Algoma Power Inc."},"EB-2019-0019",2020,2019,2015,{"$f":"'App.2-M_Regulatory_Costs'!B37","v":"Expert Witness costs"},"One-Time",{"$f":"'App.2-M_Regulatory_Costs'!C37","v":5655},{"$f":"'App.2-M_Regulatory_Costs'!D37","v":0},{"$f":"'App.2-M_Regulatory_Costs'!E37","v":0},{"$f":"'App.2-M_Regulatory_Costs'!F37","v":0},{"$f":"'App.2-M_Regulatory_Costs'!G37","v":0},{"$f":"'App.2-M_Regulatory_Costs'!H37","v":0},{"$f":"'App.2-M_Regulatory_Costs'!I37","v":""},{"$f":"'App.2-M_Regulatory_Costs'!J37","v":0},{"$f":"'App.2-M_Regulatory_Costs'!K37","v":""}]
[{"$f":"'LDC Info'!$E$14","v":"Algoma Power Inc."},"EB-2019-0019",2020,2019,2015,{"$f":"'App.2-M_Regulatory_Costs'!B38","v":"Legal costs"},"One-Time",{"$f":"'App.2-M_Regulatory_Costs'!C38","v":5655},{"$f":"'App.2-M_Regulatory_Costs'!D38","v":0},{"$f":"'App.2-M_Regulatory_Costs'!E38","v":110000},{"$f":"'App.2-M_Regulatory_Costs'!F38","v":0},{"$f":"'App.2-M_Regulatory_Costs'!G38","v":0},{"$f":"'App.2-M_Regulatory_Costs'!H38","v":0},{"$f":"'App.2-M_Regulatory_Costs'!I38","v":""},{"$f":"'App.2-M_Regulatory_Costs'!J38","v":110000},{"$f":"'App.2-M_Regulatory_Costs'!K38","v":""}]
[{"$f":"'LDC Info'!$E$14","v":"Algoma Power Inc."},"EB-2019-0019",2020,2019,2015,{"$f":"'App.2-M_Regulatory_Costs'!B39","v":"Consultants' costs"},"One-Time",{"$f":"'App.2-M_Regulatory_Costs'!C39","v":5655},{"$f":"'App.2-M_Regulatory_Costs'!D39","v":0},{"$f":"'App.2-M_Regulatory_Costs'!E39","v":40000},{"$f":"'App.2-M_Regulatory_Costs'!F39","v":0},{"$f":"'App.2-M_Regulatory_Costs'!G39","v":0},{"$f":"'App.2-M_Regulatory_Costs'!H39","v":0},{"$f":"'App.2-M_Regulatory_Costs'!I39","v":""},{"$f":"'App.2-M_Regulatory_Costs'!J39","v":73500},{"$f":"'App.2-M_Regulatory_Costs'!K39","v":""}]
[{"$f":"'LDC Info'!$E$14","v":"Algoma Power Inc."},"EB-2019-0019",2020,2019,2015,{"$f":"'App.2-M_Regulatory_Costs'!B40","v":"Incremental operating expenses associated with staff resources allocated to this application."},"One-Time",{"$f":"'App.2-M_Regulatory_Costs'!C40","v":5655},{"$f":"'App.2-M_Regulatory_Costs'!D40","v":0},{"$f":"'App.2-M_Regulatory_Costs'!E40","v":0},{"$f":"'App.2-M_Regulatory_Costs'!F40","v":0},{"$f":"'App.2-M_Regulatory_Costs'!G40","v":0},{"$f":"'App.2-M_Regulatory_Costs'!H40","v":0},{"$f":"'App.2-M_Regulatory_Costs'!I40","v":""},{"$f":"'App.2-M_Regulatory_Costs'!J40","v":0},{"$f":"'App.2-M_Regulatory_Costs'!K40","v":""}]
[{"$f":"'LDC Info'!$E$14","v":"Algoma Power Inc."},"EB-2019-0019",2020,2019,2015,{"$f":"'App.2-M_Regulatory_Costs'!B41","v":"Incremental operating expenses associated with other resources allocated to this application. 1"},"One-Time",{"$f":"'App.2-M_Regulatory_Costs'!C41","v":5655},{"$f":"'App.2-M_Regulatory_Costs'!D41","v":0},{"$f":"'App.2-M_Regulatory_Costs'!E41","v":0},{"$f":"'App.2-M_Regulatory_Costs'!F41","v":0},{"$f":"'App.2-M_Regulatory_Costs'!G41","v":0},{"$f":"'App.2-M_Regulatory_Costs'!H41","v":0},{"$f":"'App.2-M_Regulatory_Costs'!I41","v":""},{"$f":"'App.2-M_Regulatory_Costs'!J41","v":0},{"$f":"'App.2-M_Regulatory_Costs'!K41","v":""}]
[{"$f":"'LDC Info'!$E$14","v":"Algoma Power Inc."},"EB-2019-0019",2020,2019,2015,{"$f":"'App.2-M_Regulatory_Costs'!B42","v":"Intervenor costs"},"One-Time",{"$f":"'App.2-M_Regulatory_Costs'!C42","v":5655},{"$f":"'App.2-M_Regulatory_Costs'!D42","v":0},{"$f":"'App.2-M_Regulatory_Costs'!E42","v":75000},{"$f":"'App.2-M_Regulatory_Costs'!F42","v":0},{"$f":"'App.2-M_Regulatory_Costs'!G42","v":0},{"$f":"'App.2-M_Regulatory_Costs'!H42","v":0},{"$f":"'App.2-M_Regulatory_Costs'!I42","v":""},{"$f":"'App.2-M_Regulatory_Costs'!J42","v":97500},{"$f":"'App.2-M_Regulatory_Costs'!K42","v":""}]
[{"$f":"'LDC Info'!$E$14","v":"Algoma Power Inc."},"EB-2019-0019",2020,2019,2015,{"$f":"'App.2-M_Regulatory_Costs'!B43","v":"OEB Section 30 Costs (application-related)"},"One-Time",{"$f":"'App.2-M_Regulatory_Costs'!C43","v":5655},{"$f":"'App.2-M_Regulatory_Costs'!D43","v":0},{"$f":"'App.2-M_Regulatory_Costs'!E43","v":0},{"$f":"'App.2-M_Regulatory_Costs'!F43","v":0},{"$f":"'App.2-M_Regulatory_Costs'!G43","v":0},{"$f":"'App.2-M_Regulatory_Costs'!H43","v":0},{"$f":"'App.2-M_Regulatory_Costs'!I43","v":""},{"$f":"'App.2-M_Regulatory_Costs'!J43","v":0},{"$f":"'App.2-M_Regulatory_Costs'!K43","v":""}]
[{"$f":"'LDC Info'!$E$14","v":"Algoma Power Inc."},"EB-2019-0019",2020,2019,2015,{"$f":"'App.2-M_Regulatory_Costs'!B44","v":"Customer Engagment and Other costs"},"One-Time",{"$f":"'App.2-M_Regulatory_Costs'!C44","v":5655},{"$f":"'App.2-M_Regulatory_Costs'!D44","v":0},{"$f":"'App.2-M_Regulatory_Costs'!E44","v":0},{"$f":"'App.2-M_Regulatory_Costs'!F44","v":0},{"$f":"'App.2-M_Regulatory_Costs'!G44","v":0},{"$f":"'App.2-M_Regulatory_Costs'!H44","v":0},{"$f":"'App.2-M_Regulatory_Costs'!I44","v":""},{"$f":"'App.2-M_Regulatory_Costs'!J44","v":40000},{"$f":"'App.2-M_Regulatory_Costs'!K44","v":""}]
[{"$f":"'LDC Info'!$E$14","v":"Algoma Power Inc."},"EB-2019-0019",2020,2019,2015,{"$f":"'App.2-M_Regulatory_Costs'!B45","v":"Recovery of One-Time DLI-Related Costs (EB-2018-0271)"},"One-Time",{"$f":"'App.2-M_Regulatory_Costs'!C45","v":4305},{"$f":"'App.2-M_Regulatory_Costs'!D45","v":0},{"$f":"'App.2-M_Regulatory_Costs'!E45","v":0},{"$f":"'App.2-M_Regulatory_Costs'!F45","v":0},{"$f":"'App.2-M_Regulatory_Costs'!G45","v":0},{"$f":"'App.2-M_Regulatory_Costs'!H45","v":0},{"$f":"'App.2-M_Regulatory_Costs'!I45","v":""},{"$f":"'App.2-M_Regulatory_Costs'!J45","v":617765},{"$f":"'App.2-M_Regulatory_Costs'!K45","v":""}]
[{"$f":"'LDC Info'!$E$14","v":"Algoma Power Inc."},"EB-2019-0019",2020,2019,2015,{"$f":"'App.2-M_Regulatory_Costs'!B46","v":0},"One-Time",{"$f":"'App.2-M_Regulatory_Costs'!C46","v":0},{"$f":"'App.2-M_Regulatory_Costs'!D46","v":0},{"$f":"'App.2-M_Regulatory_Costs'!E46","v":0},{"$f":"'App.2-M_Regulatory_Costs'!F46","v":0},{"$f":"'App.2-M_Regulatory_Costs'!G46","v":0},{"$f":"'App.2-M_Regulatory_Costs'!H46","v":0},{"$f":"'App.2-M_Regulatory_Costs'!I46","v":""},{"$f":"'App.2-M_Regulatory_Costs'!J46","v":0},{"$f":"'App.2-M_Regulatory_Costs'!K46","v":""}]
[{"$f":"'LDC Info'!$E$14","v":"Algoma Power Inc."},"EB-2019-0019",2020,2019,2015,{"$f":"'App.2-M_Regulatory_Costs'!B47","v":0},"One-Time",{"$f":"'App.2-M_Regulatory_Costs'!C47","v":0},{"$f":"'App.2-M_Regulatory_Costs'!D47","v":0},{"$f":"'App.2-M_Regulatory_Costs'!E47","v":0},{"$f":"'App.2-M_Regulatory_Costs'!F47","v":0},{"$f":"'App.2-M_Regulatory_Costs'!G47","v":0},{"$f":"'App.2-M_Regulatory_Costs'!H47","v":0},{"$f":"'App.2-M_Regulatory_Costs'!I47","v":""},{"$f":"'App.2-M_Regulatory_Costs'!J47","v":0},{"$f":"'App.2-M_Regulatory_Costs'!K47","v":""}]
[{"$f":"'LDC Info'!$E$14","v":"Algoma Power Inc."},"EB-2019-0019",2020,2019,2015,{"$f":"'App.2-M_Regulatory_Costs'!B48","v":0},"One-Time",{"$f":"'App.2-M_Regulatory_Costs'!C48","v":0},{"$f":"'App.2-M_Regulatory_Costs'!D48","v":0},{"$f":"'App.2-M_Regulatory_Costs'!E48","v":0},{"$f":"'App.2-M_Regulatory_Costs'!F48","v":0},{"$f":"'App.2-M_Regulatory_Costs'!G48","v":0},{"$f":"'App.2-M_Regulatory_Costs'!H48","v":0},{"$f":"'App.2-M_Regulatory_Costs'!I48","v":""},{"$f":"'App.2-M_Regulatory_Costs'!J48","v":0},{"$f":"'App.2-M_Regulatory_Costs'!K48","v":""}]
[{"$f":"'LDC Info'!$E$14","v":"Algoma Power Inc."},"EB-2019-0019",2020,2019,2015,{"$f":"'App.2-M_Regulatory_Costs'!B49","v":0},"One-Time",{"$f":"'App.2-M_Regulatory_Costs'!C49","v":0},{"$f":"'App.2-M_Regulatory_Costs'!D49","v":0},{"$f":"'App.2-M_Regulatory_Costs'!E49","v":0},{"$f":"'App.2-M_Regulatory_Costs'!F49","v":0},{"$f":"'App.2-M_Regulatory_Costs'!G49","v":0},{"$f":"'App.2-M_Regulatory_Costs'!H49","v":0},{"$f":"'App.2-M_Regulatory_Costs'!I49","v":""},{"$f":"'App.2-M_Regulatory_Costs'!J49","v":0},{"$f":"'App.2-M_Regulatory_Costs'!K49","v":""}]
[{"$f":"'LDC Info'!$E$14","v":"Algoma Power Inc."},"EB-2019-0019",2020,2019,2015,{"$f":"'App.2-M_Regulatory_Costs'!B50","v":0},"One-Time",{"$f":"'App.2-M_Regulatory_Costs'!C50","v":0},{"$f":"'App.2-M_Regulatory_Costs'!D50","v":0},{"$f":"'App.2-M_Regulatory_Costs'!E50","v":0},{"$f":"'App.2-M_Regulatory_Costs'!F50","v":0},{"$f":"'App.2-M_Regulatory_Costs'!G50","v":0},{"$f":"'App.2-M_Regulatory_Costs'!H50","v":0},{"$f":"'App.2-M_Regulatory_Costs'!I50","v":""},{"$f":"'App.2-M_Regulatory_Costs'!J50","v":0},{"$f":"'App.2-M_Regulatory_Costs'!K50","v":""}]
[{"$f":"'LDC Info'!$E$14","v":"Algoma Power Inc."},"EB-2019-0019",2020,2019,2015,{"$f":"'App.2-M_Regulatory_Costs'!B51","v":0},"One-Time",{"$f":"'App.2-M_Regulatory_Costs'!C51","v":0},{"$f":"'App.2-M_Regulatory_Costs'!D51","v":0},{"$f":"'App.2-M_Regulatory_Costs'!E51","v":0},{"$f":"'App.2-M_Regulatory_Costs'!F51","v":0},{"$f":"'App.2-M_Regulatory_Costs'!G51","v":0},{"$f":"'App.2-M_Regulatory_Costs'!H51","v":0},{"$f":"'App.2-M_Regulatory_Costs'!I51","v":""},{"$f":"'App.2-M_Regulatory_Costs'!J51","v":0},{"$f":"'App.2-M_Regulatory_Costs'!K51","v":""}]
[{"$f":"'LDC Info'!$E$14","v":"Algoma Power Inc."},"EB-2019-0019",2020,2019,2015,{"$f":"'App.2-M_Regulatory_Costs'!B52","v":"Sub-total - Ongoing Costs 2"},"One-Time",{"$f":"'App.2-M_Regulatory_Costs'!C52","v":0},{"$f":"'App.2-M_Regulatory_Costs'!D52","v":0},{"$f":"'App.2-M_Regulatory_Costs'!E52","v":170886},{"$f":"'App.2-M_Regulatory_Costs'!F52","v":240991.56},{"$f":"'App.2-M_Regulatory_Costs'!G52","v":131126.82},{"$f":"'App.2-M_Regulatory_Costs'!H52","v":151579.56},{"$f":"'App.2-M_Regulatory_Costs'!I52","v":0.15597678644231583},{"$f":"'App.2-M_Regulatory_Costs'!J52","v":125778.52000000002},{"$f":"'App.2-M_Regulatory_Costs'!K52","v":-0.17021450649414724}]
[{"$f":"'LDC Info'!$E$14","v":"Algoma Power Inc."},"EB-2019-0019",2020,2019,2015,{"$f":"'App.2-M_Regulatory_Costs'!B53","v":"Sub-total - One-time Costs 3"},"One-Time",{"$f":"'App.2-M_Regulatory_Costs'!C53","v":0},{"$f":"'App.2-M_Regulatory_Costs'!D53","v":0},{"$f":"'App.2-M_Regulatory_Costs'!E53","v":225000},{"$f":"'App.2-M_Regulatory_Costs'!F53","v":0},{"$f":"'App.2-M_Regulatory_Costs'!G53","v":0},{"$f":"'App.2-M_Regulatory_Costs'!H53","v":0},{"$f":"'App.2-M_Regulatory_Costs'!I53","v":""},{"$f":"'App.2-M_Regulatory_Costs'!J53","v":938765},{"$f":"'App.2-M_Regulatory_Costs'!K53","v":""}]
[{"$f":"'LDC Info'!$E$14","v":"Algoma Power Inc."},"EB-2019-0019",2020,2019,2015,{"$f":"'App.2-M_Regulatory_Costs'!B54","v":"Total (Ongoing + 1/5 of One-Time)"},"One-Time",{"$f":"'App.2-M_Regulatory_Costs'!C54","v":0},{"$f":"'App.2-M_Regulatory_Costs'!D54","v":0},{"$f":"'App.2-M_Regulatory_Costs'!E54","v":215886},{"$f":"'App.2-M_Regulatory_Costs'!F54","v":240991.56},{"$f":"'App.2-M_Regulatory_Costs'!G54","v":131126.82},{"$f":"'App.2-M_Regulatory_Costs'!H54","v":151579.56},{"$f":"'App.2-M_Regulatory_Costs'!I54","v":0.15597678644231583},{"$f":"'App.2-M_Regulatory_Costs'!J54","v":313531.52000000002},{"$f":"'App.2-M_Regulatory_Costs'!K54","v":1.0684287512115751}]

{"sheet":"Hidden_RegulatoryCosts2","index":42,"n_rows":2,"n_cols":6,"rows_kept":2,"cut":false,"hidden":true,"merged":[]}
["EB Number","Test Year","Bridge Year","Last Rebasing Year","One-Time COS Costs","Amortized Amount"]
[{"$f":"EBNUMBER","v":"EB-2019-0019"},{"$f":"TestYear","v":2020},{"$f":"BridgeYear","v":2019},{"$f":"RebaseYear","v":2015},{"$f":"'App.2-M_Regulatory_Costs'!C57","v":938765},{"$f":"'App.2-M_Regulatory_Costs'!C58","v":187753}]

{"sheet":"App.2-N_Corp_Cost_Allocation","index":43,"n_rows":244,"n_cols":10,"rows_kept":244,"cut":false,"hidden":false,"merged":[[236,7,237,7],[236,8,237,8],[236,9,237,9],[237,1,238,1],[237,2,238,2],[234,1,234,6],[236,1,236,2],[236,3,238,3],[236,4,238,4],[236,5,237,5],[236,6,237,6],[220,1,220,6],[222,1,222,2],[222,3,224,3],[222,4,224,4],[222,5,223,5],[222,6,223,6],[223,1,224,1],[223,2,224,2],[206,1,206,6],[208,1,208,2],[208,3,210,3],[208,4,210,4],[208,5,209,5],[208,6,209,6],[209,1,210,1],[209,2,210,2],[188,1,188,6],[190,1,190,2],[190,3,192,3],[190,4,192,4],[190,5,191,5],[190,6,191,6],[191,1,192,1],[191,2,192,2],[174,1,174,6],[176,1,176,2],[176,3,178,3],[176,4,178,4],[176,5,177,5],[176,6,177,6],[177,1,178,1],[177,2,178,2],[157,1,157,6],[159,1,159,2],[159,3,161,3],[159,4,161,4],[159,5,160,5],[159,6,160,6],[160,1,161,1],[160,2,161,2],[143,1,143,6],[145,1,145,2],[145,3,147,3],[145,4,147,4],[145,5,146,5],[145,6,146,6],[146,1,147,1],[146,2,147,2],[125,1,125,6],[127,1,127,2],[127,3,129,3],[127,4,129,4],[127,5,128,5],[127,6,128,6],[128,1,129,1],[128,2,129,2],[111,1,111,6],[113,1,113,2],[113,3,115,3],[113,4,115,4],[113,5,114,5],[113,6,114,6],[114,1,115,1],[114,2,115,2],[93,1,93,6],[95,1,95,2],[95,3,97,3],[95,4,97,4],[95,5,96,5],[95,6,96,6],[96,1,97,1],[96,2,97,2],[79,1,79,6],[81,1,81,2],[81,3,83,3],[81,4,83,4],[81,5,82,5],[81,6,82,6],[82,1,83,1],[82,2,83,2],[49,7,50,7],[50,1,51,1],[50,2,51,2],[61,1,61,6],[63,1,63,2],[63,3,65,3],[63,4,65,4],[63,5,64,5],[63,6,64,6],[64,1,65,1],[64,2,65,2],[47,1,47,6],[49,1,49,2],[49,3,51,3],[49,4,51,4],[49,5,50,5],[49,6,50,6],[29,1,29,6],[31,1,31,2],[31,3,33,3],[31,4,33,4],[31,5,32,5],[31,6,32,6],[32,1,33,1],[32,2,33,2],[17,4,19,4],[17,5,18,5],[17,6,18,6],[17,7,18,7],[18,1,19,1],[18,2,19,2],[15,1,15,6],[8,1,8,6],[9,1,9,6],[17,1,17,2],[17,3,19,3]]}
[null,null,null,null,null,null,"File Number:",{"$f":"EBNUMBER","v":"EB-2019-0019"}]
[null,null,null,null,null,null,"Exhibit:",4]
[null,null,null,null,null,null,"Tab:"]
[null,null,null,null,null,null,"Schedule:"]
[null,null,null,null,null,null,"Page:"]
[]
[null,null,null,null,null,null,"Date:","2019-05-17"]
[]
[null,"Appendix 2-N"]
[null,"Shared Services and Corporate Cost Allocation 1"]
[]
[]
[]
[null,null,"Year:","2015 Board Approved"]
[]
[null,"Shared Services",null,null,null,null,null,"***combined shared services and corporate allocation into 1 table to keep it concise"]
[]
[null,"Name of Company",null,"Service Offered","Pricing Methodology","Price for the Service","Cost for the Service"]
[null,"From","To"]
[null,null,null,null,null,"$","$"]
[]
[]
[]
[]
[]
[]
[]
[]
[]
[null,"Shared Services and Corporate Cost Allocation"]
[]
[null,"Name of Company",null,"Service Offered","Pricing Methodology","% of Corporate Costs Allocated","Amount Allocated"]
[null,"From","To"]
[null,null,null,null,null,"%","$"]
[null,"FortisOntario","API","corporate services","cost based",0.218,451532]
[null,"FortisOntario","API","building rent","market based",0.13100000000000001,70123]
[null,"CNPI-Distribution","API","administrative services","cost based",0.24299999999999999,1418934.3599999999]
[null,"Fortis Inc.","API","administrative services","cost based",5.0000000000000001E-3,99820]
[]
[]
[]
[]
[]
[]
[]
[null,null,"Year:",2015]
[]
[null,"Shared Services",null,null,null,null,null,"***combined shared services and corporate allocation into 1 table to keep it concise"]
[]
[null,"Name of Company",null,"Service Offered","Pricing Methodology","Price for the Service","Cost for the Service"]
[null,"From","To"]
[null,null,null,null,null,"$","$"]
[]
[]
[]
[]
[]
[]
[]
[]
[]
[null,"Shared Services and Corporate Cost Allocation"]
[]
[null,"Name of Company",null,"Service Offered","Pricing Methodology","% of Corporate Costs Allocated","Amount Allocated"]
[null,"From","To"]
[null,null,null,null,null,"%","$"]
[null,"FortisOntario","API","corporate services","cost based",0.218,447185.27]
[null,"FortisOntario","API","building rent","market based",0.13100000000000001,70122.89]
[null,"CNPI-Distribution","API","administrative services","cost based",0.24299999999999999,1426760.5399999998]
[null,"CNPI-Distribution","API","shared IT","cost based",0.33500000000000002,525645]
[null,"Fortis Inc.","API","administrative services","cost based",5.0000000000000001E-3,137075]
[]
[]
[]
[]
[]
[]
[null,null,"Year:",2016]
[]
[null,"Shared Services"]
[]
[null,"Name of Company",null,"Service Offered","Pricing Methodology","Price for the Service","Cost for the Service"]
[null,"From","To"]
[null,null,null,null,null,"$","$"]
[]
[]
[]
[]
[]
[]
[]
[]
[]
[null,"Shared Services and Corporate Cost Allocation"]
[]
[null,"Name of Company",null,"Service Offered","Pricing Methodology","% of Corporate Costs Allocated","Amount Allocated"]
[null,"From","To"]
[null,null,null,null,null,"%","$"]
[null,"FortisOntario","API","corporate services","cost based",0.218,469379.64]
[null,"FortisOntario","API","building rent","market based",0.13100000000000001,71525.399999999994]
[null,"CNPI-Distribution","API","administrative services","cost based",0.24299999999999999,1398625.6799999997]
[null,"CNPI-Distribution","API","shared IT","cost based",0.33500000000000002,584953.80000000005]
[null,"Fortis Inc.","API","administrative services","cost based",5.0000000000000001E-3,182069.54]
[]
[]
[]
[]
[]
[]
[null,null,"Year:",2017]
[]
[null,"Shared Services"]
[]
[null,"Name of Company",null,"Service Offered","Pricing Methodology","Price for the Service","Cost for the Service"]
[null,"From","To"]
[null,null,null,null,null,"$","$"]
[]
[]
[]
[]
[]
[]
[]
[]
[]
[null,"Shared Services and Corporate Cost Allocation"]
[]
[null,"Name of Company",null,"Service Offered","Pricing Methodology","% of Corporate Costs Allocated","Amount Allocated"]
[null,"From","To"]
[null,null,null,null,null,"%","$"]
[null,"FortisOntario","API","corporate services","cost based",0.218,493618.44]
[null,"FortisOntario","API","building rent","market based",0.13900000000000001,77411.16]
[null,"CNPI-Distribution","API","administrative services","cost based",0.246,1515070.0800000003]
[null,"CNPI-Distribution","API","shared IT","cost based",0.34799999999999998,571402.07999999996]
[null,"Fortis Inc.","API","administrative services","cost based",5.0000000000000001E-3,159750.20000000001]
[]
[]
[]
[]
[]
[]
[null,null,"Year:",2018]
[]
[null,"Shared Services"]
[]
[null,"Name of Company",null,"Service Offered","Pricing Methodology","Price for the Service","Cost for the Service"]
[null,"From","To"]
[null,null,null,null,null,"$","$"]
[]
[]
[]
[]
[]
[]
[]
[]
[]
[null,"Shared Services and Corporate Cost Allocation"]
[]
[null,"Name of Company",null,"Service Offered","Pricing Methodology","% of Corporate Costs Allocated","Amount Allocated"]
[null,"From","To"]
[null,null,null,null,null,"%","$"]
[null,"FortisOntario","API","corporate services","cost based",0.218,479140.08]
[null,"FortisOntario","API","building rent","market based",0.13900000000000001,78959.399999999994]
[null,"CNPI-Distribution","API","administrative services","cost based",0.246,1301191.56]
[null,"CNPI-Distribution","API","shared IT","cost based",0.34799999999999998,572282.04]
[null,"Fortis Inc.","API","administrative services","cost based",5.0000000000000001E-3,170800.14]
[]
[]
[]
[]
[]
[null,null,"Year:",2019]
[]
[null,"Shared Services"]
[]
[null,"Name of Company",null,"Service Offered","Pricing Methodology","Price for the Service","Cost for the Service"]
[null,"From","To"]
[null,null,null,null,null,"$","$"]
[]
[]
[]
[]
[]
[]
[]
[]
[]
[null,"Shared Services and Corporate Cost Allocation"]
[]
[null,"Name of Company",null,"Service Offered","Pricing Methodology","% of Corporate Costs Allocated","Amount Allocated"]
[null,"From","To"]
[null,null,null,null,null,"%","$"]
[null,"FortisOntario","API","corporate services","cost based",0.218,521540.4]
[null,"FortisOntario","API","building rent","market based",0.13900000000000001,80538.600000000006]
[null,"CNPI-Distribution","API","administrative services","cost based",0.246,1594810.7999999998]
[null,"CNPI-Distribution","API","shared IT","cost based",0.34799999999999998,546529.31999999995]
[null,"Fortis Inc.","API","administrative services","cost based",5.0000000000000001E-3,173838.36]
[]
[]
[]
[]
[]
[]
[null,null,"Year:",2020]
[]
[null,"Shared Services"]
[]
[null,"Name of Company",null,"Service Offered","Pricing Methodology","Price for the Service","Cost for the Service"]
[null,"From","To"]
[null,null,null,null,null,"$","$"]
[]
[]
[]
[]
[]
[]
[]
[]
[]
[null,"Shared Services and Corporate Cost Allocation"]
[]
[null,"Name of Company",null,"Service Offered","Pricing Methodology","% of Corporate Costs Allocated","Amount Allocated"]
[null,"From","To"]
[null,null,null,null,null,"%","$"]
[null,"FortisOntario","API","corporate services","cost based",0.218,534579]
[null,"FortisOntario","API","building rent","market based",0.13900000000000001,82551.960000000006]
[null,"CNPI-Distribution","API","administrative services","cost based",0.246,1665334.08]
[null,"CNPI-Distribution","API","shared IT","cost based",0.34799999999999998,560454.6]
[null,"Fortis Inc.","API","administrative services","cost based",5.0000000000000001E-3,189233.64]
[]
[]
[]
[]
[null,"Shared Services and Corporate Cost Allocation"]
[null,null,null,null,null,{"$f":"+D14","v":"2015 Board Approved"},{"$f":"+D142","v":2018},{"$f":"+D205","v":2020},{"$f":"\"Variance (\"&H236&\" Test vs \"&G236&\")\"","v":"Variance (2020 Test vs 2018)"},{"$f":"\"Variance (\"&H236&\" Test vs \"&F236&\")\"","v":"Variance (2020 Test vs 2015 Board Approved)"}]
[null,"Name of Company",null,"Service Offered","Pricing Methodology","Amount Allocated","Amount Allocated","Amount Allocated","Amount Allocated","Amount Allocated"]
[null,"From","To"]
[null,null,null,null,null,"$","$","$","$","$"]
[null,"FortisOntario","API","corporate services","cost based",{"$f":"+G35","v":451532},{"$f":"+G163","v":479140.08},{"$f":"+G226","v":534579},{"$f":"+H240-G240","v":55438.919999999984},{"$f":"+H240-F240","v":83047}]
[null,"FortisOntario","API","building rent","market based",{"$f":"+G36","v":70123},{"$f":"+G164","v":78959.399999999994},{"$f":"+G227","v":82551.960000000006},{"$f":"+H241-G241","v":3592.5600000000122},{"$f":"+H241-F241","v":12428.960000000006}]
[null,"CNPI-Distribution","API","administrative services","cost based",{"$f":"+G37","v":1418934.3599999999},1301191.56,1665334.08,364142.52,246399.7200000002]
[null,"CNPI-Distribution","API","shared IT","cost based",0,572282.04,560454.6,-11827.440000000061,560454.6]
[null,"Fortis Inc.","API","administrative services","cost based",{"$f":"+G38","v":99820},170800.14,189233.64,18433.5,89413.640000000014]

{"sheet":"App.2-OA Capital Structure","index":44,"n_rows":144,"n_cols":38,"rows_kept":144,"cut":false,"hidden":false,"merged":[[73,4,73,8],[92,4,92,8],[111,4,111,8],[130,4,130,8],[14,32,14,33],[17,4,17,8],[17,19,17,23],[17,29,17,33],[54,4,54,8],[10,29,10,37],[12,0,12,14],[36,4,36,8],[9,2,9,14],[10,2,10,14],[14,22,14,24],[10,19,10,27]]}
[null,null,null,null,null,null,null,null,null,null,"File Number:",null,null,null,{"$f":"EBNUMBER","v":"EB-2019-0019"}]
[null,null,null,null,null,null,null,null,null,null,"Exhibit:",null,null,null,5]
[null,null,null,null,null,null,null,null,null,null,"Tab:"]
[null,null,null,null,null,null,null,null,null,null,"Schedule:"]
[null,null,null,null,null,null,null,null,null,null,"Page:"]
[]
[null,null,null,null,null,null,null,null,null,null,"Date:",null,null,null,"2019-05-17"]
[]
[]
[null,null,"Appendix 2-OA"]
[null,null,"Capital Structure and Cost of Capital",null,null,null,null,null,null,null,null,null,null,null,null,null,null,null,null,"Actual Debt and Equity",null,null,null,null,null,null,null,null,null,"Variance - Actual vs Deemed"]
[]
["This table must be completed for the last Board-approved year and the test year."]
[]
[null,null,null,null,null,null,"Year:",null,2020,null,"Test Year",null,null,null,null,null,null,null,null,null,null,"Year:",2020,null,null,null,null,null,null,null,null,"Year:",{"$f":"W15","v":2020}]
[]
[]
["Line No.",null,"Particulars",null,"Capitalization Ratio",null,null,null,null,null,"Cost Rate",null,null,null,"Return",null,null,"Particulars",null,"Capitalization Ratio",null,null,null,null,null,"Cost Rate",null,"Return",null,"Capitalization Ratio",null,null,null,null,null,"Cost Rate",null,"Return"]
[]
[null,null,null,null,"(%)",null,null,null,"($)",null,"(%)",null,null,null,"($)",null,null,null,null,"(%)",null,null,null,"($)",null,"(%)",null,"($)",null,"(%)",null,null,null,"($)",null,"(%)",null,"($)"]
[null,null,"Debt",null,null,null,null,null,null,null,null,null,null,null,null,null,null,"Debt"]
[1,null,"  Long-term Debt",null,0.56000000000000016,null,null,null,{"$f":"I31*E22","v":67129125.186766803},null,4.9500000000000002E-2,null,null,null,{"$f":"K22*I22","v":3322891.696744957},null,null,"  Long-term Debt",null,{"$f":"X22/X31","v":0.5401530244751046},null,null,null,64750000,null,{"$f":"K22","v":4.9500000000000002E-2},null,{"$f":"Z22*X22","v":3205125},null,{"$f":"E22-T22","v":1.984697552489556E-2},null,null,null,{"$f":"I22-X22","v":2379125.1867668033},null,{"$f":"K22","v":4.9500000000000002E-2},null,{"$f":"AJ22*AH22","v":117766.69674495676}]
[2,null,"  Short-term Debt",null,0.04,null,"(1)",null,{"$f":"I31*E23","v":4794937.5133404844},null,2.8199999999999999E-2,null,null,null,{"$f":"K23*I23","v":135217.23787620166},null,null,"  Short-term Debt",null,0,null,-1,null,0,null,{"$f":"K23","v":2.8199999999999999E-2},null,{"$f":"Z23*X23","v":0},null,{"$f":"E23-T23","v":0.04},null,-1,null,{"$f":"I23-X23","v":4794937.5133404844},null,{"$f":"K23","v":2.8199999999999999E-2},null,{"$f":"AJ23*AH23","v":135217.23787620166}]
[3,null,"Total Debt",null,{"$f":"SUM(E22:E23)","v":0.6000000000000002},null,null,null,{"$f":"SUM(I22:I23)","v":71924062.700107291},null,{"$f":"IF(E24=0,0,SUMPRODUCT(E22:E23,K22:K23)/E24)","v":4.8079999999999998E-2},null,null,null,{"$f":"SUM(O22:O23)","v":3458108.9346211585},null,null,"Total Debt",null,{"$f":"SUM(T22:T23)","v":0.5401530244751046},null,null,null,{"$f":"SUM(X22:X23)","v":64750000},null,{"$f":"IF(E24=0,0,SUMPRODUCT(E22:E23,K22:K23)/E24)","v":4.8079999999999998E-2},null,{"$f":"SUM(AB22:AB23)","v":3205125},null,{"$f":"E24-T24","v":5.9846975524895596E-2},null,null,null,{"$f":"SUM(AH22:AH23)","v":7174062.7001072876},null,{"$f":"IF(E24=0,0,SUMPRODUCT(E22:E23,K22:K23)/E24)","v":4.8079999999999998E-2},null,{"$f":"SUM(AL22:AL23)","v":252983.93462115841}]
[]
[null,null,"Equity",null,null,null,null,null,null,null,null,null,null,null,null,null,null,"Equity"]
[4,null,"  Common Equity",null,0.4,null,null,null,{"$f":"I31*E27","v":47949375.133404851},null,8.9800000000000005E-2,null,null,null,{"$f":"K27*I27","v":4305853.8869797559},null,null,"  Common Equity",null,{"$f":"X27/X31","v":0.4598469755248954},null,null,null,{"$f":"X31-X24","v":55123437.833512112},null,{"$f":"K27","v":8.9800000000000005E-2},null,{"$f":"Z27*X27","v":4950084.7174493875},null,{"$f":"E27-T27","v":-5.9846975524895374E-2},null,null,null,{"$f":"I27-X27","v":-7174062.7001072615},null,{"$f":"K27","v":8.9800000000000005E-2},null,{"$f":"AJ27*AH27","v":-644230.83046963217}]
[5,null,"  Preferred Shares",null,null,null,null,null,{"$f":"I31*E28","v":0},null,null,null,null,null,{"$f":"K28*I28","v":0},null,null,"  Preferred Shares",null,null,null,null,null,{"$f":"I31*E28","v":0},null,null,null,{"$f":"Z28*X28","v":0},null,null,null,null,null,{"$f":"I28-X28","v":0},null,null,null,{"$f":"K28*I28","v":0}]
[6,null,"Total Equity",null,{"$f":"SUM(E27:E28)","v":0.4},null,null,null,{"$f":"SUM(I27:I28)","v":47949375.133404851},null,{"$f":"IF(E29=0,0,SUMPRODUCT(E27:E28,K27:K28)/E29)","v":8.9799999999999991E-2},null,null,null,{"$f":"SUM(O27:O28)","v":4305853.8869797559},null,null,"Total Equity",null,{"$f":"SUM(T27:T28)","v":0.4598469755248954},null,null,null,{"$f":"SUM(X27:X28)","v":55123437.833512112},null,{"$f":"IF(E29=0,0,SUMPRODUCT(E27:E28,K27:K28)/E29)","v":8.9799999999999991E-2},null,{"$f":"SUM(AB27:AB28)","v":4950084.7174493875},null,{"$f":"AD27+AD28","v":-5.9846975524895374E-2},null,null,null,{"$f":"SUM(AH27:AH28)","v":-7174062.7001072615},null,{"$f":"IF(E29=0,0,SUMPRODUCT(E27:E28,K27:K28)/E29)","v":8.9799999999999991E-2},null,{"$f":"SUM(AL27:AL28)","v":-644230.83046963217}]
[]
[7,null,"Total",null,1,null,null,null,119873437.83351211,null,{"$f":"(K24*E24)+(K29*E29)","v":6.4768000000000006E-2},null,null,null,{"$f":"O24+O29","v":7763962.821600914},null,null,"Total",null,1,null,null,null,119873437.83351211,null,{"$f":"(Z24*T24)+(Z29*T29)","v":6.7264815818898635E-2},null,{"$f":"AB24+AB29","v":8155209.7174493875},null,{"$f":"AD24+AD29","v":2.2204460492503131E-16},null,null,null,{"$f":"AH24+AH29","v":2.6077032089233398E-8},null,{"$f":"(AJ24*AD24)+(AJ29*AD29)","v":-2.4968158188986241E-3},null,{"$f":"AL24+AL29","v":-391246.89584847377}]
[]
[]
[null,null,null,null,null,null,"Year:",null,2019]
[]
[]
["Line No.",null,"Particulars",null,"Capitalization Ratio",null,null,null,null,null,"Cost Rate",null,null,null,"Return"]
[]
[null,null,null,null,"(%)",null,null,null,"($)",null,"(%)",null,null,null,"($)"]
[null,null,"Debt"]
[1,null,"  Long-term Debt",null,0.56000000000000016,null,null,null,{"$f":"$I$50*E41","v":64281569.588919222},null,5.1499999999999997E-2,null,null,null,{"$f":"K41*I41","v":3310500.8338293396}]
[2,null,"  Short-term Debt",null,0.04,null,"(1)",null,{"$f":"$I$50*E42","v":4591540.6849228004},null,2.1600000000000001E-2,null,null,null,{"$f":"K42*I42","v":99177.278794332495}]
[3,null,"Total Debt",null,{"$f":"SUM(E41:E42)","v":0.6000000000000002},null,null,null,{"$f":"SUM(I41:I42)","v":68873110.273842022},null,{"$f":"IF(E43=0,0,SUMPRODUCT(E41:E42,K41:K42)/E43)","v":4.9506666666666664E-2},null,null,null,{"$f":"SUM(O41:O42)","v":3409678.112623672}]
[]
[null,null,"Equity"]
[4,null,"  Common Equity",null,0.4,null,null,null,{"$f":"$I$50*E46","v":45915406.849228002},null,9.2999999999999999E-2,null,null,null,{"$f":"K46*I46","v":4270132.8369782045}]
[5,null,"  Preferred Shares",null,null,null,null,null,{"$f":"$I$50*E47","v":0},null,null,null,null,null,{"$f":"K47*I47","v":0}]
[6,null,"Total Equity",null,{"$f":"SUM(E46:E47)","v":0.4},null,null,null,{"$f":"SUM(I46:I47)","v":45915406.849228002},null,{"$f":"IF(E48=0,0,SUMPRODUCT(E46:E47,K46:K47)/E48)","v":9.2999999999999999E-2},null,null,null,{"$f":"SUM(O46:O47)","v":4270132.8369782045}]
[]
[7,null,"Total",null,1,null,null,null,114788517.12307,null,{"$f":"(K43*E43)+(K48*E48)","v":6.6904000000000019E-2},null,null,null,{"$f":"O43+O48","v":7679810.9496018765}]
[]
[]
[null,null,null,null,null,null,"Year:",null,2018]
[]
["Line No.",null,"Particulars",null,"Capitalization Ratio",null,null,null,null,null,"Cost Rate",null,null,null,"Return"]
[]
[null,null,null,null,"(%)",null,null,null,"($)",null,"(%)",null,null,null,"($)"]
[null,null,"Debt"]
[1,null,"  Long-term Debt",null,0.56000000000000016,null,null,null,{"$f":"$I$68*E59","v":61101222.001680031},null,5.1499999999999997E-2,null,null,null,{"$f":"K59*I59","v":3146712.9330865215}]
[2,null,"  Short-term Debt",null,0.04,null,"(1)",null,{"$f":"$I$68*E60","v":4364373.0001200009},null,2.1600000000000001E-2,null,null,null,{"$f":"K60*I60","v":94270.456802592031}]
[3,null,"Total Debt",null,{"$f":"SUM(E59:E60)","v":0.6000000000000002},null,null,null,{"$f":"SUM(I59:I60)","v":65465595.00180003},null,{"$f":"IF(E61=0,0,SUMPRODUCT(E59:E60,K59:K60)/E61)","v":4.9506666666666664E-2},null,null,null,{"$f":"SUM(O59:O60)","v":3240983.3898891136}]
[]
[null,null,"Equity"]
[4,null,"  Common Equity",null,0.4,null,null,null,{"$f":"$I$68*E64","v":43643730.001200013},null,9.2999999999999999E-2,null,null,null,{"$f":"K64*I64","v":4058866.890111601}]
[5,null,"  Preferred Shares",null,null,null,null,null,{"$f":"$I$68*E65","v":0},null,null,null,null,null,{"$f":"K65*I65","v":0}]
[6,null,"Total Equity",null,{"$f":"SUM(E64:E65)","v":0.4},null,null,null,{"$f":"SUM(I64:I65)","v":43643730.001200013},null,{"$f":"IF(E66=0,0,SUMPRODUCT(E64:E65,K64:K65)/E66)","v":9.2999999999999999E-2},null,null,null,{"$f":"SUM(O64:O65)","v":4058866.890111601}]
[]
[7,null,"Total",null,1,null,null,null,109109325.00300002,null,{"$f":"(K61*E61)+(K66*E66)","v":6.6904000000000019E-2},null,null,null,{"$f":"O61+O66","v":7299850.2800007146}]
[]
[]
[null,null,null,null,null,null,"Year:",null,2017,null,null,null,null,null,null,null,null,null,null,null,null,null,null,null,null,null,null,null,null,null,null,null,9]
[null,null,null,null,null,null,null,null,null,null,null,null,null,null,null,null,null,null,null,null,null,null,null,null,null,null,null,null,null,null,null,null,2.9]
[null,null,null,null,null,null,null,null,null,null,null,null,null,null,null,null,null,null,null,null,null,null,null,null,null,null,null,null,null,null,null,null,2.29]
["Line No.",null,"Particulars",null,"Capitalization Ratio",null,null,null,null,null,"Cost Rate",null,null,null,"Return"]
[]
[null,null,null,null,"(%)",null,null,null,"($)",null,"(%)",null,null,null,"($)"]
[null,null,"Debt"]
[1,null,"  Long-term Debt",null,0.56000000000000016,null,null,null,{"$f":"$I$87*E78","v":59335536.527120031},null,5.1499999999999997E-2,null,null,null,{"$f":"K78*I78","v":3055780.1311466815}]
[2,null,"  Short-term Debt",null,0.04,null,"(1)",null,{"$f":"$I$87*E79","v":4238252.6090800008},null,2.1600000000000001E-2,null,null,null,{"$f":"K79*I79","v":91546.256356128026}]
[3,null,"Total Debt",null,{"$f":"SUM(E78:E79)","v":0.6000000000000002},null,null,null,{"$f":"SUM(I78:I79)","v":63573789.136200033},null,{"$f":"IF(E80=0,0,SUMPRODUCT(E78:E79,K78:K79)/E80)","v":4.9506666666666664E-2},null,null,null,{"$f":"SUM(O78:O79)","v":3147326.3875028095}]
[]
[null,null,"Equity"]
[4,null,"  Common Equity",null,0.4,null,null,null,{"$f":"$I$87*E83","v":42382526.090800017},null,9.2999999999999999E-2,null,null,null,{"$f":"K83*I83","v":3941574.9264444015}]
[5,null,"  Preferred Shares",null,null,null,null,null,{"$f":"$I$87*E84","v":0},null,null,null,null,null,{"$f":"K84*I84","v":0}]
[6,null,"Total Equity",null,{"$f":"SUM(E83:E84)","v":0.4},null,null,null,{"$f":"SUM(I83:I84)","v":42382526.090800017},null,{"$f":"IF(E85=0,0,SUMPRODUCT(E83:E84,K83:K84)/E85)","v":9.2999999999999999E-2},null,null,null,{"$f":"SUM(O83:O84)","v":3941574.9264444015}]
[]
[7,null,"Total",null,1,null,null,null,105956315.22700003,null,{"$f":"(K80*E80)+(K85*E85)","v":6.6904000000000019E-2},null,null,null,{"$f":"O80+O85","v":7088901.313947211}]
[]
[]
[null,null,null,null,null,null,"Year:",null,2016]
[]
[]
["Line No.",null,"Particulars",null,"Capitalization Ratio",null,null,null,null,null,"Cost Rate",null,null,null,"Return"]
[]
[null,null,null,null,"(%)",null,null,null,"($)",null,"(%)",null,null,null,"($)"]
[null,null,"Debt"]
[1,null,"  Long-term Debt",null,0.56000000000000016,null,null,null,{"$f":"$I$106*E97","v":57169259.388080031},null,5.1499999999999997E-2,null,null,null,{"$f":"K97*I97","v":2944216.8584861215}]
[2,null,"  Short-term Debt",null,0.04,null,"(1)",null,{"$f":"$I$106*E98","v":4083518.5277200011},null,2.1600000000000001E-2,null,null,null,{"$f":"K98*I98","v":88204.000198752023}]
[3,null,"Total Debt",null,{"$f":"SUM(E97:E98)","v":0.6000000000000002},null,null,null,{"$f":"SUM(I97:I98)","v":61252777.915800035},null,{"$f":"IF(E99=0,0,SUMPRODUCT(E97:E98,K97:K98)/E99)","v":4.9506666666666664E-2},null,null,null,{"$f":"SUM(O97:O98)","v":3032420.8586848737}]
[]
[null,null,"Equity"]
[4,null,"  Common Equity",null,0.4,null,null,null,{"$f":"$I$106*E102","v":40835185.277200013},null,9.2999999999999999E-2,null,null,null,{"$f":"K102*I102","v":3797672.2307796013}]
[5,null,"  Preferred Shares",null,null,null,null,null,{"$f":"$I$106*E103","v":0},null,null,null,null,null,{"$f":"K103*I103","v":0}]
[6,null,"Total Equity",null,{"$f":"SUM(E102:E103)","v":0.4},null,null,null,{"$f":"SUM(I102:I103)","v":40835185.277200013},null,{"$f":"IF(E104=0,0,SUMPRODUCT(E102:E103,K102:K103)/E104)","v":9.2999999999999999E-2},null,null,null,{"$f":"SUM(O102:O103)","v":3797672.2307796013}]
[]
[7,null,"Total",null,1,null,null,null,102087963.19300002,null,{"$f":"(K99*E99)+(K104*E104)","v":6.6904000000000019E-2},null,null,null,{"$f":"O99+O104","v":6830093.0894644745}]
[]
[]
[null,null,null,null,null,null,"Year:",null,2015]
[]
[]
["Line No.",null,"Particulars",null,"Capitalization Ratio",null,null,null,null,null,"Cost Rate",null,null,null,"Return"]
[]
[null,null,null,null,"(%)",null,null,null,"($)",null,"(%)",null,null,null,"($)"]
[null,null,"Debt"]
[1,null,"  Long-term Debt",null,0.56000000000000016,null,null,null,{"$f":"$I$125*E116","v":53718993.927200004},null,5.1499999999999997E-2,null,null,null,{"$f":"K116*I116","v":2766528.1872508}]
[2,null,"  Short-term Debt",null,0.04,null,"(1)",null,{"$f":"$I$125*E117","v":3837070.9947999991},null,2.1600000000000001E-2,null,null,null,{"$f":"K117*I117","v":82880.733487679987}]
[3,null,"Total Debt",null,{"$f":"SUM(E116:E117)","v":0.6000000000000002},null,null,null,{"$f":"SUM(I116:I117)","v":57556064.922000006},null,{"$f":"IF(E118=0,0,SUMPRODUCT(E116:E117,K116:K117)/E118)","v":4.9506666666666664E-2},null,null,null,{"$f":"SUM(O116:O117)","v":2849408.9207384801}]
[]
[null,null,"Equity"]
[4,null,"  Common Equity",null,0.4,null,null,null,{"$f":"$I$125*E121","v":38370709.947999991},null,9.2999999999999999E-2,null,null,null,{"$f":"K121*I121","v":3568476.0251639993}]
[5,null,"  Preferred Shares",null,null,null,null,null,{"$f":"$I$125*E122","v":0},null,null,null,null,null,{"$f":"K122*I122","v":0}]
[6,null,"Total Equity",null,{"$f":"SUM(E121:E122)","v":0.4},null,null,null,{"$f":"SUM(I121:I122)","v":38370709.947999991},null,{"$f":"IF(E123=0,0,SUMPRODUCT(E121:E122,K121:K122)/E123)","v":9.2999999999999999E-2},null,null,null,{"$f":"SUM(O121:O122)","v":3568476.0251639993}]
[]
[7,null,"Total",null,1,null,null,null,95926774.869999975,null,{"$f":"(K118*E118)+(K123*E123)","v":6.6904000000000019E-2},null,null,null,{"$f":"O118+O123","v":6417884.9459024798}]
[]
[]
[null,null,null,null,null,null,"Year:",null,2015,null,"Board Approved"]
[]
[]
["Line No.",null,"Particulars",null,"Capitalization Ratio",null,null,null,null,null,"Cost Rate",null,null,null,"Return"]
[]
[null,null,null,null,"(%)",null,null,null,"($)",null,"(%)",null,null,null,"($)"]
[null,null,"Debt"]
[1,null,"  Long-term Debt",null,0.56000000000000016,null,null,null,{"$f":"$I$144*E135","v":54920225.360000014},null,5.1499999999999997E-2,null,null,null,{"$f":"K135*I135","v":2828391.6060400004}]
[2,null,"  Short-term Debt",null,0.04,null,"(1)",null,{"$f":"$I$144*E136","v":3922873.24},null,2.1600000000000001E-2,null,null,null,{"$f":"K136*I136","v":84734.061984000014}]
[3,null,"Total Debt",null,{"$f":"SUM(E135:E136)","v":0.6000000000000002},null,null,null,{"$f":"SUM(I135:I136)","v":58843098.600000016},null,{"$f":"IF(E137=0,0,SUMPRODUCT(E135:E136,K135:K136)/E137)","v":4.9506666666666664E-2},null,null,null,{"$f":"SUM(O135:O136)","v":2913125.6680240002}]
[]
[null,null,"Equity"]
[4,null,"  Common Equity",null,0.4,null,null,null,{"$f":"$I$144*E140","v":39228732.399999999},null,9.2999999999999999E-2,null,null,null,{"$f":"K140*I140","v":3648272.1132}]
[5,null,"  Preferred Shares",null,null,null,null,null,{"$f":"$I$144*E141","v":0},null,null,null,null,null,{"$f":"K141*I141","v":0}]
[6,null,"Total Equity",null,{"$f":"SUM(E140:E141)","v":0.4},null,null,null,{"$f":"SUM(I140:I141)","v":39228732.399999999},null,{"$f":"IF(E142=0,0,SUMPRODUCT(E140:E141,K140:K141)/E142)","v":9.2999999999999999E-2},null,null,null,{"$f":"SUM(O140:O141)","v":3648272.1132}]
[]
[7,null,"Total",null,1,null,null,null,98071831,null,{"$f":"(K137*E137)+(K142*E142)","v":6.6904000000000019E-2},null,null,null,{"$f":"O137+O142","v":6561397.7812240003}]

{"sheet":"App.2-OB_Debt Instruments","index":45,"n_rows":125,"n_cols":11,"rows_kept":125,"cut":false,"hidden":false,"merged":[[9,0,9,10],[10,0,10,10],[10,11,10,14],[12,0,12,10]]}
[null,null,null,null,null,null,null,null,null,"File Number:",{"$f":"EBNUMBER","v":"EB-2019-0019"}]
[null,null,null,null,null,null,null,null,null,"Exhibit:",5]
[null,null,null,null,null,null,null,null,null,"Tab:"]
[null,null,null,null,null,null,null,null,null,"Schedule:"]
[null,null,null,null,null,null,null,null,null,"Page:"]
[]
[null,null,null,null,null,null,null,null,null,"Date:","2019-05-17"]
[]
[]
["Appendix 2-OB"]
["Debt Instruments"]
[]
["This table must be completed for all required historical years, the bridge year and the test year."]
[null,null,null,"Year",2020]
[]
["Row","Description","Lender","Affiliated or Third-Party Debt?","Fixed or Variable-Rate?","Start Date","Term              (years)","Principal                         ($)","Rate (%)                     (Note 2)","Interest ($)       (Note 1)","Additional Comments, if any"]
[1,{"$f":"B36","v":"Senior Unsecured Notes"},{"$f":"C36","v":"Life Insurance Cos."},"Third-Party","Fixed Rate","2011-12-16",30,52000000,5.1180000000000003E-2,{"$f":"H17*I17","v":2661360}]
[2,{"$f":"B37","v":"Debt Issue Costs"},null,null,null,null,null,null,null,16632,"$498,968 over 30 yrs"]
[3,"Promissory Note","FortisOntario Inc.","Affiliated","Variable Rate","2018-12-17","Demand",12750000,4.1300000000000003E-2,{"$f":"H19*I19","v":526575}]
[4,null,null,null,null,null,null,null,null,0]
[5,null,null,null,null,null,null,null,null,0]
[6,null,null,null,null,null,null,null,null,0]
[7,null,null,null,null,null,null,null,null,0]
[8,null,null,null,null,null,null,null,null,0]
[9,null,null,null,null,null,null,null,null,0]
[10,null,null,null,null,null,null,null,null,0]
[11,null,null,null,null,null,null,null,null,0]
[12,null,null,null,null,null,null,null,null,0]
[]
["Total",null,null,null,null,null,null,{"$f":"SUM(H17:H28)","v":64750000},{"$f":"IF(H30=0,\"\",J30/H30)","v":4.9491382239382237E-2},{"$f":"SUM(J17:J28)","v":3204567}]
[]
[]
[null,null,null,"Year",2019]
[]
["Row","Description","Lender","Affiliated or Third-Party Debt?","Fixed or Variable-Rate?","Start Date","Term              (years)","Principal                         ($)","Rate (%)                     (Note 2)","Interest ($)       (Note 1)","Additional Comments, if any"]
[1,{"$f":"B55","v":"Senior Unsecured Notes"},{"$f":"C55","v":"Life Insurance Cos."},"Third-Party","Fixed Rate","2011-12-16",30,52000000,5.1180000000000003E-2,{"$f":"H36*I36","v":2661360}]
[2,{"$f":"B56","v":"Debt Issue Costs"},null,null,null,null,null,null,null,16632,"$498,968 over 30 yrs"]
[3,"Promissory Note","FortisOntario Inc.","Affiliated","Variable Rate","2018-12-17","Demand",12750000,4.1300000000000003E-2,{"$f":"H38*I38","v":526575}]
[4,null,null,null,null,null,null,null,null,0]
[5,null,null,null,null,null,null,null,null,0]
[6,null,null,null,null,null,null,null,null,0]
[7,null,null,null,null,null,null,null,null,0]
[8,null,null,null,null,null,null,null,null,0]
[9,null,null,null,null,null,null,null,null,0]
[10,null,null,null,null,null,null,null,null,0]
[11,null,null,null,null,null,null,null,null,0]
[12,null,null,null,null,null,null,null,null,0]
[]
["Total",null,null,null,null,null,null,{"$f":"SUM(H36:H47)","v":64750000},{"$f":"IF(H49=0,\"\",J49/H49)","v":4.9491382239382237E-2},{"$f":"SUM(J36:J47)","v":3204567}]
[]
[]
[null,null,null,"Year",2018]
[]
["Row","Description","Lender","Affiliated or Third-Party Debt?","Fixed or Variable-Rate?","Start Date","Term              (years)","Principal                         ($)","Rate (%)                     (Note 2)","Interest ($)       (Note 1)","Additional Comments, if any"]
[1,{"$f":"B74","v":"Senior Unsecured Notes"},{"$f":"C74","v":"Life Insurance Cos."},"Third-Party","Fixed Rate","2011-12-16",30,52000000,5.1180000000000003E-2,{"$f":"H55*I55","v":2661360}]
[2,{"$f":"B75","v":"Debt Issue Costs"},null,null,null,null,null,null,null,16632,"$498,968 over 30 yrs"]
[3,null,null,null,null,null,null,null,null,{"$f":"H57*I57","v":0}]
[4,null,null,null,null,null,null,null,null,0]
[5,null,null,null,null,null,null,null,null,0]
[6,null,null,null,null,null,null,null,null,0]
[7,null,null,null,null,null,null,null,null,0]
[8,null,null,null,null,null,null,null,null,0]
[9,null,null,null,null,null,null,null,null,0]
[10,null,null,null,null,null,null,null,null,0]
[11,null,null,null,null,null,null,null,null,0]
[12,null,null,null,null,null,null,null,null,0]
[]
["Total",null,null,null,null,null,null,{"$f":"SUM(H55:H66)","v":52000000},{"$f":"IF(H68=0,\"\",J68/H68)","v":5.1499846153846153E-2},{"$f":"SUM(J55:J66)","v":2677992}]
[]
[]
[null,null,null,"Year",2017]
[]
["Row","Description","Lender","Affiliated or Third-Party Debt?","Fixed or Variable-Rate?","Start Date","Term              (years)","Principal                         ($)","Rate (%)                     (Note 2)","Interest ($)       (Note 1)","Additional Comments, if any"]
[1,{"$f":"B93","v":"Senior Unsecured Notes"},{"$f":"C93","v":"Life Insurance Cos."},"Third-Party","Fixed Rate","2011-12-16",30,52000000,5.1180000000000003E-2,{"$f":"H74*I74","v":2661360}]
[2,{"$f":"B94","v":"Debt Issue Costs"},null,null,null,null,null,null,null,16632,"$498,968 over 30 yrs"]
[3,null,null,null,null,null,null,null,null,{"$f":"H76*I76","v":0}]
[4,null,null,null,null,null,null,null,null,0]
[5,null,null,null,null,null,null,null,null,0]
[6,null,null,null,null,null,null,null,null,0]
[7,null,null,null,null,null,null,null,null,0]
[8,null,null,null,null,null,null,null,null,0]
[9,null,null,null,null,null,null,null,null,0]
[10,null,null,null,null,null,null,null,null,0]
[11,null,null,null,null,null,null,null,null,0]
[12,null,null,null,null,null,null,null,null,0]
[]
["Total",null,null,null,null,null,null,{"$f":"SUM(H74:H85)","v":52000000},{"$f":"IF(H87=0,\"\",J87/H87)","v":5.1499846153846153E-2},{"$f":"SUM(J74:J85)","v":2677992}]
[]
[]
[null,null,null,"Year",2016]
[]
["Row","Description","Lender","Affiliated or Third-Party Debt?","Fixed or Variable-Rate?","Start Date","Term              (years)","Principal                         ($)","Rate (%)                     (Note 2)","Interest ($)       (Note 1)","Additional Comments, if any"]
[1,{"$f":"B112","v":"Senior Unsecured Notes"},{"$f":"C112","v":"Life Insurance Cos."},"Third-Party","Fixed Rate",{"$f":"F112","v":"2011-12-16"},{"$f":"G112","v":30},{"$f":"H112","v":52000000},{"$f":"I112","v":5.1180000000000003E-2},{"$f":"H93*I93","v":2661360}]
[2,{"$f":"B113","v":"Debt Issue Costs"},null,null,null,null,null,null,null,{"$f":"J113","v":16632},{"$f":"K113","v":"$498,968 over 30 yrs"}]
[3,null,null,null,null,null,null,null,null,{"$f":"H95*I95","v":0}]
[4,null,null,null,null,null,null,null,null,0]
[5,null,null,null,null,null,null,null,null,0]
[6,null,null,null,null,null,null,null,null,0]
[7,null,null,null,null,null,null,null,null,0]
[8,null,null,null,null,null,null,null,null,0]
[9,null,null,null,null,null,null,null,null,0]
[10,null,null,null,null,null,null,null,null,0]
[11,null,null,null,null,null,null,null,null,0]
[12,null,null,null,null,null,null,null,null,0]
[]
["Total",null,null,null,null,null,null,{"$f":"SUM(H93:H104)","v":52000000},{"$f":"IF(H106=0,\"\",J106/H106)","v":5.1499846153846153E-2},{"$f":"SUM(J93:J104)","v":2677992}]
[]
[]
[null,null,null,"Year",2015]
[]
["Row","Description","Lender","Affiliated or Third-Party Debt?","Fixed or Variable-Rate?","Start Date","Term              (years)","Principal                         ($)","Rate (%)                     (Note 2)","Interest ($)       (Note 1)","Additional Comments, if any"]
[1,"Senior Unsecured Notes","Life Insurance Cos.","Third-Party","Fixed Rate","2011-12-16",30,52000000,5.1180000000000003E-2,{"$f":"H112*I112","v":2661360}]
[2,"Debt Issue Costs",null,null,null,null,null,null,null,16632,"$498,968 over 30 yrs"]
[3,null,null,null,null,null,null,null,null,{"$f":"H114*I114","v":0}]
[4,null,null,null,null,null,null,null,null,0]
[5,null,null,null,null,null,null,null,null,0]
[6,null,null,null,null,null,null,null,null,0]
[7,null,null,null,null,null,null,null,null,0]
[8,null,null,null,null,null,null,null,null,0]
[9,null,null,null,null,null,null,null,null,0]
[10,null,null,null,null,null,null,null,null,0]
[11,null,null,null,null,null,null,null,null,0]
[12,null,null,null,null,null,null,null,null,0]
[]
["Total",null,null,null,null,null,null,{"$f":"SUM(H112:H123)","v":52000000},{"$f":"IF(H125=0,\"\",J125/H125)","v":5.1499846153846153E-2},{"$f":"SUM(J112:J123)","v":2677992}]

{"sheet":"App.2-Q_Cost of Serv. Emb. Dx","index":46,"n_rows":60,"n_cols":7,"rows_kept":60,"cut":false,"hidden":false,"merged":[[9,7,9,11],[12,0,12,6],[11,0,11,6],[58,3,59,3],[58,4,59,4],[53,4,54,4],[8,0,8,6],[9,0,9,6],[15,0,15,1],[15,2,15,3],[53,3,54,3]]}
[null,null,null,null,null,"File Number:",{"$f":"EBNUMBER","v":"EB-2019-0019"}]
[null,null,null,null,null,"Exhibit:"]
[null,null,null,null,null,"Tab:"]
[null,null,null,null,null,"Schedule:"]
[null,null,null,null,null,"Page:"]
[]
[null,null,null,null,null,"Date:"]
[]
["Appendix 2-Q"]
["Cost of Serving Embedded Distributor(s) "]
[]
["To be completed by Host Distributors ONLY"]
["(Not required if Host Distributor has an Embedded Distributor rate class, i.e. a separate row on Sheet 11 of the RRWF.)"]
[null,null,null,"**N/A for Algoma Power**"]
[]
["Proposed Rate Class for Billing Embedded Distributor(s)"]
[]
["Host's Distribution Facilities used by Embedded Distributor(s)"]
[]
["(1)","(2)","(3)","(4)","(5)","(6) = '(3) + (4)"]
["Asset Class","Total OM&A costs asociated with asset class ","Original cost of asset class ","Accumulated amortization of asset class","Annual amortization of asset class","Net Book Value of asset class"]
["Totals for Host Distributor:","($)","($)","($)","($)"]
["Distribution Stations",null,null,null,null,{"$f":"C23+D23","v":0}]
["Low Voltage Line",null,null,null,null,0]
["LV Line category # 2 (if applcable)",null,null,null,null,0]
["TS (owned by host)",null,null,null,null,0]
["add rows if necessary... ",null,null,null,null,0]
[null,null,null,null,null,0]
[null,null,null,null,null,0]
[]
["(1)","(7)","(8)","(9)","(10)","(11)"]
[{"$f":"A21","v":"Asset Class"},"Total line length or station capacity in asset class","Line length or capacity required to provide LV service to Embedded Distributor(s)","Annual total demand on station/line providing LV services (sum of 12 monthly peaks)","Annual billed Embedded Distributor demand on station/line providing LV services","Embedded Distributor(s)' Responsibility Share "]
["Embedded Distributor's share:","kW or kVa; km","kW or kVA; km","kW or kVA","kW or kVA","percent"]
["Distribution Stations",null,null,null,null,{"$f":"IF(D34=0,0,(C34/B34)*(E34/D34))","v":0}]
["Low Voltage Line",null,null,null,null,{"$f":"IF(D35=0,0,(C35/B35)*(E35/D35))","v":0}]
["LV Line # 2 (if applicable) ",null,null,null,null,{"$f":"IF(D36=0,0,(C36/B36)*(E36/D36))","v":0}]
["TS (owned by host)",null,null,null,null,{"$f":"IF(D37=0,0,(C37/B37)*(E37/D37))","v":0}]
["add rows if necessary ",null,null,null,null,{"$f":"IF(D38=0,0,(C38/B38)*(E38/D38))","v":0}]
[]
["(1)","(12)","(12a)","(13)","(14)","(15)","(16)"]
[{"$f":"A32","v":"Asset Class"},"Return on Assets used to Provide LV services","Taxes/PILs","Annual amortization on assets used to provide LV services","OM&A costs with burden associated with assets used to provide LV services","Total annual cost associated with assets used to provide LV services","Monthly cost associated with the delivery of LV services"]
[null,"($)","($)","($)","($)","($)","$/kW or $/kVA"]
["Distribution Stations",{"$f":"E$54*(F23+B23*E$59)*F34","v":0},{"$f":"(B43-(B$54*C$54*F34*(F23+B23*E57)+B$55*C$55*F34*(F23+B23*E$57)))*E$57/(1-E$57)","v":0},{"$f":"E23*F34","v":0},{"$f":"B23*F34","v":0},{"$f":"SUM(B43:E43)","v":0},{"$f":"IF(E34=0,0,(D43/E34))","v":0}]
["Low Voltage Line",{"$f":"E$54*(F24+B24*E$59)*F35","v":0},{"$f":"(B44-(B$54*C$54*F35*(F24+B24*E58)+B$55*C$55*F35*(F24+B24*E58)))*E$57/(1-E$57)","v":0},{"$f":"E24*F35","v":0},{"$f":"B24*F35","v":0},{"$f":"SUM(B44:E44)","v":0},{"$f":"IF(E35=0,0,(D44/E35))","v":0}]
["LV Line # 2 (if applicable) ",{"$f":"E$54*(F25+B25*E$59)*F36","v":0},{"$f":"(B45-(B$54*C$54*F36*(F25+B25*E59)+B$55*C$55*F36*(F25+B25*E$59)))*E$57/(1-E$57)","v":0},{"$f":"E25*F36","v":0},{"$f":"B25*F36","v":0},{"$f":"SUM(B45:E45)","v":0},{"$f":"IF(E36=0,0,(D45/E36))","v":0}]
["TS (owned by host)",{"$f":"E$54*(F26+B26*E$59)*F37","v":0},{"$f":"(B46-(B$54*C$54*F37*(F26+B26*E60)+B$55*C$55*F37*(F26+B26*E60)))*E$57/(1-E$57)","v":0},{"$f":"E26*F37","v":0},{"$f":"B26*F37","v":0},{"$f":"SUM(B46:E46)","v":0},{"$f":"IF(E37=0,0,(D46/E37))","v":0}]
["add rows if necessary ",{"$f":"E$54*(F27+B27*E$59)*F38","v":0},{"$f":"(B47-(B$54*C$54*F38*(F27+B27*I61)+B$55*C$55*F38*(F27+B27*I61)))*E$57/(1-E$57)","v":0},{"$f":"E27*F38","v":0},{"$f":"B27*F38","v":0},{"$f":"SUM(B47:E47)","v":0},{"$f":"IF(E38=0,0,(D47/E38))","v":0}]
[]
["Total",null,null,null,null,{"$f":"SUM(F43:F47)","v":0},{"$f":"SUM(G43:G47)","v":0}]
[]
["(17)","(18)","(19)","(20)","(21)"]
[null,"Capital Structure","Cost Rate"]
[null,"(%)","(%)",null,"(%)"]
["Long-Term Debt",null,null,"Weighted Average Cost of Capital",{"$f":"IF(B60=0%,0,SUMPRODUCT(B54:B58,C54:C58)/B60)","v":0}]
["Short-term Debt"]
[]
["Common Equity",null,null,"Tax/PILs Rate"]
["Preferred Shares"]
[null,null,null,"Working Capital Allowance Factor"]
["Total",{"$f":"SUM(B54:B58)","v":0}]

{"sheet":"App.2-R_Loss Factors","index":47,"n_rows":70,"n_cols":9,"rows_kept":70,"cut":false,"hidden":false,"merged":[[55,2,56,8],[58,2,58,8],[30,2,32,8],[68,2,68,8],[60,2,60,8],[62,2,62,8],[64,2,66,7],[50,2,50,8],[14,2,14,8],[23,2,23,8],[25,2,25,8],[52,2,53,8],[34,2,37,8],[41,2,43,8],[45,2,48,8],[8,1,8,8],[9,1,9,8],[10,1,10,8],[12,1,13,2],[12,3,12,7],[12,8,13,8]]}
[null,null,null,null,null,null,null,"File Number:",{"$f":"EBNUMBER","v":"EB-2019-0019"}]
[null,null,null,null,null,null,null,"Exhibit:",8]
[null,null,null,null,null,null,null,"Tab:"]
[null,null,null,null,null,null,null,"Schedule:"]
[null,null,null,null,null,null,null,"Page:"]
[]
[null,null,null,null,null,null,null,"Date:","2019-05-17"]
[]
[null,"Appendix 2-R"]
[null,"Loss Factors"]
[]
[]
[null,null,null,"Historical Years",null,null,null,null,"5-Year Average"]
[null,null,null,{"$f":"IF(ISBLANK('LDC Info'!E26-5), \"Year 5\", 'LDC Info'!E26-5)","v":2014},{"$f":"IF(ISBLANK('LDC Info'!E26-4), \"Year 5\", 'LDC Info'!E26-4)","v":2015},{"$f":"IF(ISBLANK('LDC Info'!E26-3), \"Year 5\", 'LDC Info'!E26-3)","v":2016},{"$f":"IF(ISBLANK('LDC Info'!E26-2), \"Year 5\", 'LDC Info'!E26-2)","v":2017},{"$f":"IF(ISBLANK('LDC Info'!E26-1), \"Year 5\", 'LDC Info'!E26-1)","v":2018}]
[null,null,"Losses Within Distributor's System"]
[null,"A(1)","\"Wholesale\" kWh delivered to distributor (higher value)",224055026.48999998,218359583.91999999,213114844.56,219147651.52387795,243134750.75999999,{"$f":"IF(SUM(D16:H16)=0,0,AVERAGE(D16:H16))","v":223562371.45077562}]
[null,"A(2)","\"Wholesale\" kWh delivered to distributor (lower value)",223056717.0686909,217389981.1548034,212169173.7878049,218174267.27538872,242054718.72407666,{"$f":"IF(SUM(D17:H17)=0,0,AVERAGE(D17:H17))","v":222568971.60215291}]
[null,"B","Portion of \"Wholesale\" kWh delivered to distributor for its Large Use Customer(s)",0,0,0,0,0,{"$f":"IF(SUM(D18:H18)=0,0,AVERAGE(D18:H18))","v":0}]
[null,"C","Net \"Wholesale\" kWh delivered to distributor  = A(2) - B",{"$f":"D17-D18","v":223056717.0686909},217389981.1548034,212169173.7878049,218174267.27538872,242054718.72407666,222568971.60215291]
[null,"D","\"Retail\" kWh delivered by distributor",205806696.26376733,200913699.96306553,197489288.44989136,203142174.43307829,224890511.40462381,{"$f":"IF(SUM(D20:H20)=0,0,AVERAGE(D20:H20))","v":206448474.10288525}]
[null,"E","Portion of \"Retail\" kWh delivered by distributor to its Large Use Customer(s)",0,0,0,0,0,{"$f":"IF(SUM(D21:H21)=0,0,AVERAGE(D21:H21))","v":0}]
[null,"F","Net \"Retail\" kWh delivered by distributor = D - E",{"$f":"D20-D21","v":205806696.26376733},200913699.96306553,197489288.44989136,203142174.43307829,224890511.40462381,206448474.10288525]
[null,"G","Loss Factor in Distributor's system = C / F",{"$f":"IF(D22=0,\"\",D19/D22)","v":1.0838166158734479},1.0820067580994563,1.0743325648349695,1.0739978927776146,1.0763225056150589,1.0780848469300572]
[null,null,"Losses Upstream of Distributor's System"]
[null,"H","Supply Facilities Loss Factor",1.0044999999999999,1.0044999999999999,1.0044999999999999,1.0044999999999999,1.0044999999999999,{"$f":"IF(SUM(D25:H25)=0,0,AVERAGE(D25:H25))","v":1.0044999999999999}]
[null,null,"Total Losses"]
[null,"I","Total Loss Factor = G x H",{"$f":"IF(D23=\"\",\"\",D23*D25)","v":1.0886937906448784},1.0868757885109039,1.0791670613767268,1.0788308832951139,1.0811659568903267,1.0829362287412425]
[]
[null,"Notes:"]
[]
[null,"A(1)","If directly connected to the IESO-controlled grid, kWh pertains to the virtual meter on the primary or high voltage side of the transformer at the interface with the transmission grid.  This corresponds to the \"With Losses\" kWh value provided by the IESO's MV-WEB.  It is the higher of the two values provided by MV-WEB."]
[]
[]
[]
[null,null,"If fully embedded within a host distributor, kWh pertains to the virtual meter on the primary or high voltage side of the transformer, at the interface between the host distributor and the transmission grid.  For example, if the host distributor is Hydro One Networks Inc., kWh from the Hydro One Networks' invoice corresponding to \"Total kWh w Losses\" should be reported.  This corresponds to the higher of the two kWh values provided in Hydro One Networks' invoice."]
[]
[]
[]
[]
[null,null,"If partially embedded, kWh pertains to the sum of the above."]
[]
[null,"A(2)","If directly connected to the IESO-controlled grid, kWh pertains to a metering installation on the secondary or low voltage side of the transformer at the interface with the transmission grid.  This corresponds to the \"Without Losses\" kWh value provided by the IESO's MV-WEB.  It is the lower of the two kWh values provided by MV-WEB."]
[]
[]
[]
[null,null,"If fully embedded with the host distributor, kWh pertains to a metering installation on the secondary or low voltage side of the transformer at the interface between the embedded distributor and the host distributor.  For example, if the host distributor is Hydro One Networks Inc., kWh from the Hydro One Networks' invoice corresponding to \"Total kWh\" should be reported.  This corresponds to the lower of the two kWh values provided in Hydro One Networks' invoice."]
[]
[]
[]
[]
[null,null,"If partially embedded, kWh pertains to the sum of the above."]
[]
[null,null,"Additionally, kWh pertaining to distributed generation directly connected to the distributor's own distribution network should be included in A(2)."]
[]
[]
[null,"B","If a Large Use Customer is metered on the secondary or low voltage side of the transformer, the default loss is 1%                         (i.e., B = 1.01 X E)."]
[]
[]
[null,"D","kWh corresponding to D should equal metered or estimated kWh at the customer’s delivery point."]
[]
[null,"G and I","These loss factors pertain to secondary-metered customers with demand less than 5,000 kW."]
[]
[null,"H","If directly connected to the IESO-controlled grid, SFLF = 1.0045."]
[]
[null,null,"If fully embedded within a host distributor, SFLF = loss factor re losses in transformer at grid interface X loss factor re losses in host distributor's system.  If the host distributor is Hydro One Networks Inc., SFLF = 1.0060 X 1.0278 = 1.0340. If partially embedded, SFLF should be calculated as the weighted average of above."]
[]
[]
[]
[null,null,"Distributors that wish to propose a different SFLF should provide appropriate justification for any such proposal including supporting"]
[null,null,"calculations and any other relevant material."]

{"sheet":"App.2-S_Stranded Meters","index":48,"n_rows":93,"n_cols":8,"rows_kept":93,"cut":false,"hidden":false,"merged":[[8,0,8,7],[9,0,9,7],[30,0,33,7],[35,0,36,7],[55,2,56,7],[10,0,10,7],[63,2,65,7],[67,0,68,7],[38,1,39,7],[41,1,43,7],[45,1,48,7],[50,1,53,7],[58,2,61,7],[92,0,95,7],[85,1,87,7],[89,1,90,7],[70,1,71,7],[77,1,79,7],[81,1,83,7],[73,1,75,7]]}
[null,null,null,null,null,null,"File Number:",{"$f":"EBNUMBER","v":"EB-2019-0019"}]
[null,null,null,null,null,null,"Exhibit:"]
[null,null,null,null,null,null,"Tab:"]
[null,null,null,null,null,null,"Schedule:"]
[null,null,null,null,null,null,"Page:"]
[]
[null,null,null,null,null,null,"Date:"]
[]
["Appendix 2-S"]
["Stranded Meter Treatment"]
["**N/A for this Application**"]
["Year","Notes","Gross Asset Value","Accumulated Amortization","Contributed Capital (Net of Amortization)","Net Asset","Proceeds on Disposition","Residual Net Book Value"]
[null,null,"(A)","(B)","(C)","(D ) = (A) - (B) - (C)","(E)","(F) = (D) - (E)"]
[2006,null,null,null,null,{"$f":"C14-D14-E14","v":0},null,{"$f":"F14-G14","v":0}]
[2007,null,null,null,null,0,null,0]
[2008,null,null,null,null,0,null,0]
[2009,null,null,null,null,0,null,0]
[2010,null,null,null,null,0,null,0]
[2011,null,null,null,null,0,null,0]
[2012,null,null,null,null,0,null,0]
[2013,null,null,null,null,{"$f":"C21-D21-E21","v":0},null,{"$f":"F21-G21","v":0}]
[2014,null,null,null,null,{"$f":"C22-D22-E22","v":0},null,{"$f":"F22-G22","v":0}]
[2015,null,null,null,null,{"$f":"C23-D23-E23","v":0},null,{"$f":"F23-G23","v":0}]
[2016,null,null,null,null,{"$f":"C24-D24-E24","v":0},null,{"$f":"F24-G24","v":0}]
[2017,"(1)",null,null,null,0,null,0]
[]
["Notes:"]
[]
["(1)","For 2017, please indicate whether the amounts provided are on a forecast or actual basis."]
[]
["Some distributors have transferred the cost of stranded meters from Account 1860 - Meters to \"Sub-account Stranded Meter Costs of Account 1555\", while in some cases distributors have left these costs in Account 1860.  Depending on which treatment the applicant has chosen. please provide the information under either of the two scenarios (A and B below), as applicable."]
[]
[]
[]
[]
["Scenario A:  If the stranded meter costs were transferred to \"Sub-account Stranded Meter Costs\" of Account 1555, the above table should be completed and the following information should be provided in Exhibit 9."]
[]
[]
[1,"A description of the accounting treatment followed by the applicant on stranded meter costs for financial accounting and reporting purposes."]
[]
[]
[2,"The amount of the pooled residual net book value of the removed from service stranded meters, less any contributed capital (net of accumulated amortization), and less any net proceeds from sales, which were transferred to this sub-account as of December 31, 2010."]
[]
[]
[]
[3,"A statement as to whether or not, since transferring the removed stranded meter costs to the sub-account, the recording of depreciation expenses was continued in order to reduce the net book value through accumulated depreciation.  If so, the total depreciation expense amount for the period from the time the costs for the stranded meters were transferred to the sub-account to December 31, 2010 should be provided."]
[]
[]
[]
[]
[null,"If no depreciation expenses were recorded to reduce the net book value of stranded meter costs through accumulated depreciation, the total depreciation expense amount that would have been applicable from the time that the stranded meter costs were transferred to the sub-account of Account 1555 to December 31, 2010 should be provided.  In addition, the following information should be provided:"]
[]
[]
[]
[]
[null,"a)","Whether or not carrying charges were recorded for the stranded meter cost balances in the sub-account, and if so, the total carrying charges recorded to December 31, 2010."]
[]
[]
[null,"b)","The estimated amount of the pooled residual net book value of the removed from service meters, less any net proceeds from sales and contributed capital, at the time when the smart meters will have been fully deployed (e.g., as of December 31, 2010).  If the smart meters have been fully deployed, the actual amount should be provided."]
[]
[]
[]
[]
[null,"c)","A description as to how the applicant intends to recover in rates the remaining costs for stranded meters, including the proposed accounting treatment, the proposed disposition period, and the associated bill impacts."]
[]
[]
[]
["Scenario B:  If the stranded meter costs remained recorded in Account 1860, the above table should be completed and the following information should be provided in Exhibit 9:"]
[]
[]
[1,"A description of the accounting treatment followed by the applicant on stranded meter costs for financial accounting and reporting purposes."]
[]
[]
[2,"The amount of the pooled residual net book value of the removed from service stranded meters, less any contributed capital (net of accumulated amortization), and less any net proceeds from sales, as of December 31, 2010."]
[]
[]
[]
[3,"A statement as to whether or not the recording of depreciation expenses continued in order to reduce the net book value through accumulated depreciation.  If so, provision of the total (cumulative) depreciation expense for the period from the time that the meters became stranded to December 31, 2010."]
[]
[]
[]
[4,"If no depreciation expenses were recorded to reduce the net book value of stranded meters through accumulated depreciation, the total (cumulative) depreciation expense amount that would have been applicable for the period from the time that the meters became stranded to December 31, 2010."]
[]
[]
[]
[5,"The estimated amount of the pooled residual net book value of the removed from service meters, less any net proceeds from sales and contributed capital, at the time when smart meters will have been fully deployed.  If the smart meters have been fully deployed, please provide the actual amount."]
[]
[]
[]
[6,"A description as to how the applicant intends to recover in rates the costs for stranded meters, including the proposed accounting treatment, the proposed disposition period and the associated bill impacts."]
[]
[]
["Distributors should also provide the Net Book Value per class of meter as of December 31, 2010 as well as the number of meters that were removed / stranded.  In preparing this information, distributors should review the Board's letter of January 16, 2007 Stranded Meter Costs Related to the Installation of Smart Meters which stated that records were to be kept of the type and number of each meter to support the stranded meter costs."]

{"sheet":"App.2-Y_MIFRS Summary Impacts","index":49,"n_rows":37,"n_cols":9,"rows_kept":37,"cut":false,"hidden":true,"merged":[[8,0,8,8],[9,0,9,8],[10,0,10,8],[14,0,16,2],[14,6,14,8],[15,6,15,8],[17,0,17,2],[17,6,17,8],[18,0,18,2],[18,6,18,8],[19,0,19,2],[19,6,19,8],[20,0,20,2],[20,6,20,8],[21,0,21,2],[21,6,21,8],[22,0,22,2],[22,3,22,5],[22,6,22,8],[23,0,23,2],[23,6,23,8],[24,0,24,2],[24,6,24,8],[25,0,25,2],[25,6,25,8],[26,0,26,2],[26,6,26,8],[27,0,27,2],[27,6,27,8],[28,0,28,2],[28,6,28,8],[36,0,36,8],[29,0,29,2],[29,6,29,8],[30,0,30,2],[30,6,30,8],[31,0,31,2],[31,6,31,8],[32,0,32,2],[32,6,32,8],[33,0,33,2],[33,6,33,8],[34,0,34,2],[34,6,34,8]]}
[null,null,null,null,null,null,null,"File Number:",{"$f":"EBNUMBER","v":"EB-2019-0019"}]
[null,null,null,null,null,null,null,"Exhibit:"]
[null,null,null,null,null,null,null,"Tab:"]
[null,null,null,null,null,null,null,"Schedule:"]
[null,null,null,null,null,null,null,"Page:"]
[]
[null,null,null,null,null,null,null,"Date:"]
[]
["Appendix 2-Y"]
["Summary of Impacts to Revenue Requirement"]
["from Transition to MIFRS"]
[]
[]
[]
["Revenue Requirement Component",null,null,{"$f":"TestYear","v":2020},{"$f":"TestYear","v":2020},"Difference","Reasons why the revenue requirement "]
[null,null,null,"MIFRS","CGAAP 1",null,"component is different under MIFRS"]
[]
["Closing NBV 2017",null,null,null,null,{"$f":"+D18-E18","v":0}]
["Closing NBV 2018",null,null,null,null,{"$f":"+D19-E19","v":0}]
["Average NBV",null,null,{"$f":"(D18+D19)/2","v":0},{"$f":"(E18+E19)/2","v":0},{"$f":"+D20-E20","v":0}]
["Working Capital",null,null,null,null,{"$f":"+D21-E21","v":0}]
["Rate Base",null,null,{"$f":"SUM(D20:D21)","v":0},{"$f":"SUM(E20:E21)","v":0},{"$f":"+D22-E22","v":0}]
[null,null,null,null,null,{"$f":"+D23-E23","v":0}]
["Return on Rate Base",null,null,null,null,0]
[null,null,null,null,null,0]
["OM&A",null,null,null,null,0]
["Depreciation",null,null,null,null,0]
["PILs or Income Taxes",null,null,null,null,0]
[null,null,null,null,null,0]
["Less: Revenue Offsets",null,null,null,null,0]
[null,null,null,null,null,0]
[null,null,null,null,null,0]
[null,null,null,null,null,0]
["Insert description of additional item(s) and new rows if needed.",null,null,null,null,0]
["Total Base Revenue Requirement",null,null,{"$f":"SUM(D24:D34)","v":0},{"$f":"SUM(E24:E34)","v":0},{"$f":"SUM(F24:F34)","v":0}]
[]
["1.  Applicants must provide a summary of the dollar impacts of MIFRS to each component of the revenue requirement (e.g. rate base, operating costs, etc.), including the overall impact on the proposed revenue requirement.  Accordingly, the applicants must identify financial differences and resulting revenue requirement impacts arising from the adoption of  MIFRS as compared to CGAAP.  If the applicant is reflecting the changes in capitalization and depreciation policies for the first time in a rebasing application, then the comparison in the above table should be between MIFRS and CGAAP before the change in accounting policies. If the applicant changed capitalization and depreciation policies and reflected these changes in a previous rebasing application, the comparison in the above table should be between MIFRS and CGAAP after the change in accounting policies.  "]

{"sheet":"Sheet19","index":50,"n_rows":72,"n_cols":9,"rows_kept":72,"cut":false,"hidden":true,"merged":[]}
[null,"CGAAP","CGAAP","CGAAP","MIFRS","USGAAP","ASPE","ASPE","ASPE"]
[null,"N/A",2012,2013,null,null,"N/A",2012,2013]
["LDC Info","x","x","x","x","x","x","x","x"]
["Table of Contents","x","x","x","x","x","x","x","x"]
["COS Flowchart","x","x","x","x","x","x","x","x"]
["List of Key References","x","x","x","x","x","x","x","x"]
["App.2-AA_Capital Projects","x","x","x","x","x","x","x","x"]
["App.2-AB_Capital Expenditures","x","x","x","x","x","x","x","x"]
["App.2-BA1_Fix Asset Cont.CGAAP","x","x","x","n","x","x","x","x"]
["App.2-BA2_Fix Asset Cont.MIFRS","n","n","n","x","n","n","n","n"]
["Appendix 2-BB Service Life Comp","x","x","x","x","x","x","x","x"]
["Instruction for App. 2-C MIFRS","n","n","n","x","n","n","n","n"]
["App.2-CA_CGAAP_DepExp_2011","n","n","n","x","n","n","n","n"]
["App.2-CB_MIFRS_DepExp_2011","n","n","n","x","n","n","n","n"]
["App.2-CC_MIFRS_DepExp_2012","n","n","n","x","n","n","n","n"]
["App.2-CD_MIFRS_DepExp_2013","n","n","n","x","n","n","n","n"]
["App.2-CE_MIFRS_DepExp_2014","n","n","n","x","n","n","n","n"]
["App.2-CF_CGAAP_DepExp_2012","n","n","n","x","n","n","n","n"]
["App.2-CG_MIFRS_DepExp_2012","n","n","n","x","n","n","n","n"]
["App.2-CH_MIFRS_DepExp_2013","n","n","n","x","n","n","n","n"]
["App.2-CI_MIFRS_DepExp_2014","n","n","n","x","n","n","n","n"]
["App.2-CJ_CGAAP_DepExp_2012","n","n","n","x","n","n","n","n"]
["App.2-CK_CGAAP_DepExp_2013","n","n","n","x","n","n","n","n"]
["App.2-CL_MIFRS_DepExp_2013","n","n","n","x","n","n","n","n"]
["App.2-CM_MIFRS_DepExp_2014","n","n","n","x","n","n","n","n"]
["Instruction for App. 2-C CGAAP","x","x","x","n","n","x","x","x"]
["App.2-CN_OldCGAAP_DepExp_2012","x","x","n","n","n","x","x","n"]
["App.2-CO_NewCGAAP_DepExp_2012","x","x","n","n","n","x","x","n"]
["App.2-CP_NewCGAAP_DepExp_2013","x","x","n","n","n","x","x","n"]
["App.2-CQ NewCGAAP_DepExp_2014","x","x","n","n","n","x","x","n"]
["App.2-CR_OldCGAAP_DepExp_2012","x","n","x","n","n","x","n","x"]
["App.2-CS_OldCGAAP_DepExp_2013","x","n","x","n","n","x","n","x"]
["App.2-CT_NewCGAAP_DepExp_2013","x","n","x","n","n","x","n","x"]
["App.2-CU_NewCGAAP_DepExp_2014","x","n","x","n","n","x","n","x"]
["App.2-CV_USGAAP_DepExp","n","n","n","n","x","n","n","n"]
["App.2-DA_Overhead","n","n","n","x","n","n","n","n"]
["App.2-DB_Overhead","x","x","x","n","n","x","x","x"]
["App.2-EA_PP&E Deferral Account","n","n","n","x","x","n","n","n"]
["App.2-EB_PP&E Deferral Account","n","n","n","x","x","n","n","n"]
["App.2-EC_PP&E Deferral Account","n","n","n","x","x","n","n","n"]
["App.2-ED_Account 1576 (2012)","x","x","n","x","x","x","x","n"]
["App.2-EE_Account 1576 (2013)","x","n","x","x","x","x","n","x"]
["App.2-FA Proposed REG Invest.","o","o","o","o","o","o","o","o"]
["App.2-FB Calc of REG Improvemnt","o","o","o","o","o","o","o","o"]
["App.2-FC Calc of REG Expansion","o","o","o","o","o","o","o","o"]
["App.2-G SQI","x","x","x","x","x","x","x","x"]
["App.2-H_Other_Oper_Rev","x","x","x","x","x","x","x","x"]
["App.2-I LF_CDM_WF","x","x","x","x","x","x","x","x"]
["App.2-JA_OM&A_Summary_Analys","x","x","x","x","x","x","x","x"]
["App.2-JB_OM&A_Cost _Drivers","x","x","x","x","x","x","x","x"]
["App.2-JC_OMA Programs","x","x","x","x","x","x","x","x"]
["App.2-K_Employee Costs","x","x","x","x","x","x","x","x"]
["App.2-L_OM&A_per_Cust_FTEE","x","x","x","x","x","x","x","x"]
["App.2-M_Regulatory_Costs","x","x","x","x","x","x","x","x"]
["App.2-N_Corp_Cost_Allocation","x","x","x","x","x","x","x","x"]
["App.2-OA Capital Structure","x","x","x","x","x","x","x","x"]
["App.2-OB_Debt Instruments","x","x","x","x","x","x","x","x"]
["App.2-P_Cost_Allocation","x","x","x","x","x","x","x","x"]
["App.2-Q_Cost of Serv. Emb. Dx","e","e","e","e","e","e","e","e"]
["App.2-R_Loss Factors","x","x","x","x","x","x","x","x"]
["App.2-S_Stranded Meters","x","x","x","x","x","x","x","x"]
["App.2-TA_1592_Tax_Variance","x","x","x","x","x","x","x","x"]
["App.2-TB_1592_HST-OVAT","x","x","x","x","x","x","x","x"]
["App.2-U_IFRS Transition Costs","x","x","x","x","x","x","x","x"]
["App.2-V_Rev_Reconciliation","x","x","x","x","x","x","x","x"]
["App.2-W_Bill Impacts","x","x","x","x","x","x","x","x"]
["App.2-YA_MIFRS Summary Impacts","n","n","n","x","n","n","n","n"]
["App. 2-YB_CGAAP Summary Impacts","x","x","x","n","n","x","x","x"]
["App. 2-Z_Tariff","x","x","x","x","x","x","x","x"]
["lists","n","n","n","n","n","n","n","n"]
["lists2","n","n","n","n","n","n","n","n"]
["Sheet19","n","n","n","n","n","n","n","n"]

{"sheet":"App.2-YA_IFRS Transition Costs","index":51,"n_rows":34,"n_cols":15,"rows_kept":34,"cut":false,"hidden":true,"merged":[[16,0,16,2],[13,0,15,2],[13,13,15,13],[13,10,14,10],[13,12,15,12],[8,0,8,16],[9,0,9,16],[11,0,11,14],[13,11,14,11],[13,14,15,14],[28,0,28,2],[17,0,17,2],[18,0,18,2],[19,0,19,2],[20,0,20,2],[21,0,21,2],[22,0,22,2],[23,0,23,2],[24,0,24,2],[25,0,25,2],[26,0,26,2],[27,0,27,2],[44,0,45,0],[44,1,45,3],[33,0,34,0],[36,0,37,0],[36,1,37,3],[32,1,32,4],[32,5,32,6],[31,1,31,14],[33,1,33,14],[39,0,42,0],[39,1,42,3]]}
[]
[null,null,null,null,null,null,null,null,null,null,null,null,null,"File Number:",{"$f":"EBNUMBER","v":"EB-2019-0019"}]
[null,null,null,null,null,null,null,null,null,null,null,null,null,"Exhibit:"]
[null,null,null,null,null,null,null,null,null,null,null,null,null,"Tab:"]
[null,null,null,null,null,null,null,null,null,null,null,null,null,"Schedule:"]
[null,null,null,null,null,null,null,null,null,null,null,null,null,"Page:"]
[]
[null,null,null,null,null,null,null,null,null,null,null,null,null,"Date:"]
["Appendix 2-YA"]
["One-Time Incremental IFRS Transition Costs"]
[]
["The following table should be completed based on the information requested below. An explanation should be provided for any blank entries.  The entries should include one-time incremental IFRS transition costs that are currently included in Account 1508, Other Regulatory Assets, sub-account Deferred IFRS Transition Costs Account, or Account 1508, Other Regulatory Assets, sub-account IFRS Transition Costs Variance Account."]
[]
["Nature of One-Time Incremental IFRS Transition Costs 1",null,null,null,"Audited Actual Costs Incurred","Audited Actual Costs Incurred","Audited Actual Costs Incurred","Audited Actual Costs Incurred","Audited Actual Costs Incurred","Audited Carrying Charges ","Forecasted Costs ","Forecasted Costs ","Carrying Charges January 1, 2017 to December 31, 2017 or April 30, 2017 (As appropriate)","Total Costs and Carrying Charges","Reasons why the costs recorded meet the criteria of one-time IFRS administrative incremental costs"]
[]
[null,null,null,null,2012,2013,2014,2015,"2016 3","To December 31, 2016","2017 3","2018 3"]
["Professional accounting fees",null,null,null,null,null,null,null,null,null,null,null,null,{"$f":"SUM(E17:M17)","v":0}]
["Professional legal fees",null,null,null,null,null,null,null,null,null,null,null,null,0]
["Salaries, wages and benefits of staff added to support the transition to IFRS",null,null,null,null,null,null,null,null,null,null,null,null,0]
["Associated staff training and development costs",null,null,null,null,null,null,null,null,null,null,null,null,0]
["Costs related to system upgrades, or replacements or changes where IFRS was the major reason for conversion",null,null,null,null,null,null,null,null,null,null,null,null,0]
[null,null,null,null,null,null,null,null,null,null,null,null,null,0]
[null,null,null,null,null,null,null,null,null,null,null,null,null,0]
[null,null,null,null,null,null,null,null,null,null,null,null,null,0]
[null,null,null,null,null,null,null,null,null,null,null,null,null,0]
["Amounts, if any, included in previous Board approved rates (amounts should be negative) 2",null,null,null,null,null,null,null,null,null,null,null,null,0]
[null,null,null,null,null,null,null,null,null,null,null,null,null,0]
["Insert description of additional item(s) and new rows if needed.",null,null,null,null,null,null,null,null,null,null,null,null,0]
["Total",null,null,null,{"$f":"SUM(E17:E28)","v":0},0,null,{"$f":"SUM(H17:H28)","v":0},null,0,null,0,null,{"$f":"SUM(N17:N28)","v":0}]
[]
["Note:"]
[1,"The Deferred IFRS Transition Costs Account and the IFRS Transition Costs Variance Account are exclusively for necessary, incremental transition costs and shall not include ongoing IFRS compliance costs or impacts arising from adopting accounting policy changes that reflect changes in the timing of the recognition of income. The incremental costs in these accounts shall not include costs related to system upgrades, or replacements or changes where IFRS was not the major reason for conversion. In addition, incremental IFRS costs shall not include capital assets or expenditures."]
[2,"If there were any amounts approved in previous Board approved rates, please state the EB #:"]
[3,"Any forecasted One-time costs past 2015 should be fully explained in the application, since distributors were required to adopt IFRS or an alternative accounting standard by January 1, 2015."]

{"sheet":"App.2-Z_Commodity Expense","index":52,"n_rows":85,"n_cols":22,"rows_kept":85,"cut":false,"hidden":false,"merged":[[36,11,38,11],[16,3,16,4],[21,3,21,4],[22,3,22,4],[23,3,23,4],[32,2,32,5],[32,6,32,7],[32,8,32,9],[34,8,34,9],[34,11,35,11],[16,8,16,10],[17,3,17,4],[18,3,18,4],[19,3,19,4],[20,3,20,4],[24,3,24,4],[1,0,2,5],[8,1,8,18],[12,3,12,14],[14,8,14,10],[14,11,15,11],[14,12,14,13],[15,3,15,4],[9,0,9,14],[25,3,25,4],[26,3,26,4],[27,3,27,4],[31,8,31,9],[37,2,37,5],[38,2,38,5],[39,2,39,5],[40,2,40,5],[36,2,36,5],[36,6,41,6],[41,2,41,5],[42,2,42,5],[48,5,48,9],[48,10,48,14],[54,5,54,9],[54,10,54,14],[56,7,66,8],[56,12,66,13],[69,5,69,9],[69,10,69,14],[70,7,81,8],[70,12,81,13]]}
[null,null,null,null,null,null,null,null,null,null,null,null,"File Number:",{"$f":"'App.2-S_Stranded Meters'!H1","v":"EB-2019-0019"}]
["In the green shaded cell (row 18-26) enter the most recent 12-month actual data. If there is a material difference between actual and forecasted consumption data, use forecasted data and provide an explanation",null,null,null,null,null,null,null,null,null,null,null,"Exhibit:",2]
[null,null,null,null,null,null,null,null,null,null,null,null,"Tab:"]
[null,null,null,null,null,null,null,null,null,null,null,null,"Schedule:"]
[null,null,null,null,null,null,null,null,null,null,null,null,"Page:"]
[]
[null,null,null,null,null,null,null,null,null,null,null,null,"Date:","2019-09-24"]
[]
[null," "]
["Commodity Expense "]
[]
[]
["Step 1:","Allocation of Commodity",null,"2017 Historical Actuals"]
[]
[null,null,null,null,null,null,null,null,"non-RPP",null,null,"RPP","Proportions (by Class)"]
[null," "," ",null,null,null,null,null,"non GA mod","GA mod","Total ",null,"non-RPP","RPP"]
[null,"Customer Class Name",null,"Last Actual kWh's",null,"Class A kWh","Class B kWh",null,null,null,null,null,"%","%"]
[null,"Residential R1",null,108556834,null,null,{"$f":"+D18-F18","v":108556834},null,0,4068000,{"$f":"SUM(I18:J18)","v":4068000},{"$f":"G18-(I18+J18)","v":104488834},{"$f":"+K18/D18","v":3.747345837296618E-2},{"$f":"+L18/D18","v":0.96252654162703377}]
[null,"Seasonal",null,6046269,null,0,{"$f":"+D19-F19","v":6046269},null,0,28000,{"$f":"SUM(I19:J19)","v":28000},6018269,4.6309550567465657E-3,0.9953690449432534]
[null,"Residential R2",null,109385574,null,null,109385574,null,104118000,2003000,106121000,3264574,0.97015535156400057,2.9844648435999432E-2]
[null,"Street Lighting",null,577097,null,null,577097,null,0,577000,577000,97,0.99983191733798649,1.6808266201349167E-4]
[null,"other",null,null,null,null,0,null,null,null,0,0,{"$error":"#DIV/0!"},{"$error":"#DIV/0!"}]
[null,"other",null,null,null,null,0,null,0,null,0,0,{"$error":"#DIV/0!"},{"$error":"#DIV/0!"}]
[null,"other",null,null,null,null,0,null,0,null,0,0,{"$error":"#DIV/0!"},{"$error":"#DIV/0!"}]
[null,"other",null,null,null,null,0,null,null,null,null,0]
[null,"other",null,null,null,null,0,null,null,null,null,0]
[null,"TOTAL"," ",{"$f":"SUM(D18:E26)","v":224565774},null,{"$f":"SUM(F18:F26)","v":0},224565774,null,{"$f":"SUM(I18:I26)","v":104118000},{"$f":"SUM(J18:J26)","v":6676000},{"$f":"SUM(K18:K26)","v":110794000},{"$f":"SUM(L18:L26)","v":113771774}]
[null,"%"," ",{"$f":"$D$27/$D$27","v":1},null,null,1,null,{"$f":"$I$27/$G$27","v":0.46364144520081674},{"$f":"$J$27/$G$27","v":2.9728483914026899E-2},null,{"$f":"$L$27/$G$27","v":0.50663007088515633},{"$f":"I28+J28","v":0.49336992911484362},{"$f":"L28","v":0.50663007088515633},{"$f":"M28+N28","v":1}]
[]
[]
["Step 2:","Forecasted Commodity Prices"]
[null," ",null,null,null,null,null,null,"non-RPP"]
["Step 2a:","GA Modifier","($/MWh)",null,null,null,null,null,-41.49,null,"Source:","   Table 1: RPP Prices and GA Modifier: May 1, 2018 to April 30, 2019*"]
[]
["Step 2b:","Forecasted Commodity Prices"," Table 1: Average RPP Supply Cost Summary**",null,null,null,null,null,"non-RPP",null,null,"RPP"]
[null,null,null,null,null,null,null,null,"non GA mod","GA mod"]
[null,"HOEP ($/MWh)","Load-Weighted Price for RPP Consumers",null,null,null,null,null,20.68,{"$f":"+I37","v":20.68}]
[null,"Global Adjustment ($/MWh)","Impact of the Global Adjustment",null,null,null,null,null,102.22,{"$f":"+I38+I33","v":60.73}]
[null,"Adjustments ($/MWh)",null,null,null,null,null,null,1,{"$f":"+I39","v":1}]
[null,"TOTAL ($/MWh)","Average Supply Cost for RPP Consumers",null,null,null,null,null,{"$f":"SUM(I37:I39)","v":123.9},{"$f":"SUM(J37:J39)","v":82.41},null,{"$f":"J40","v":82.41},null,null,null,null,null,null,null,null,null," "]
[null,"$/kWh",null,null,null,null,null,null,{"$f":"I40/1000","v":0.12390000000000001},{"$f":"J40/1000","v":8.2409999999999997E-2},null,{"$f":"L40/1000","v":8.2409999999999997E-2}]
[null,"Percentage shares (%)","non-RPP (GA mod/non-GA mod), RPP",null,null,null,null,null,{"$f":"I28","v":0.46364144520081674},{"$f":"J28","v":2.9728483914026899E-2},null,{"$f":"L28","v":0.50663007088515633}]
[null,"WEIGHTED AVERAGE PRICE ($/kWh)","(Sum of I43, J43 and L43)",null,null,null,{"$f":"I43+J43+L43","v":0.1016464835613819},null,{"$f":"I41*I42","v":5.7445175060381201E-2},{"$f":"J41*J42","v":2.4499243593549568E-3},null,{"$f":"L41*L42","v":4.1751384141645732E-2}]
[]
[]
["Step 3:","Commodity Expense"]
[null,"(volumes for the bridge and test year are loss adjusted)"]
[]
[null,"Class A",null,null,null,2018,null,null,null,null,2019]
[null,"Customer",null,"Revenue","Expense","kWh Volume","kW Volume","HOEP Rate/kWh","Avg GA/kW","Amount","kWh Volume","kW Volume","HOEP Rate/kWh","Avg GA/kW","Amount"]
[null,{"$f":"+B20","v":"Residential R2"},null,4035,4705,81086629,131588,{"$f":"+I37/1000","v":2.068E-2},20.238,{"$f":"(+F51*H51)+(G51*I51)","v":4339949.4317199998},81086629,131588,{"$f":"+I37/1000","v":2.068E-2},20.238,{"$f":"(+K51*M51)+(L51*N51)","v":4339949.4317199998}]
[null,{"$f":"+B21","v":"Street Lighting"},null,4010,4705,null,null,{"$f":"+I37/1000","v":2.068E-2},null,{"$f":"(+F52*H52)+(G52*I52)","v":0},null,null,{"$f":"+I37/1000","v":2.068E-2},null,{"$f":"(+K52*M52)+(L52*N52)","v":0}]
[null,null,null,null,null,{"$f":"+F51+F52","v":81086629},{"$f":"+G51+G52","v":131588},null,null,{"$f":"+J51+J52","v":4339949.4317199998},null,null,null,null,{"$f":"+O51+O52","v":4339949.4317199998}]
[]
[null,"Class B",null,null,null,2018,null,null,null,null,2019]
[null,"Customer",null,"Revenue","Expense"," "]
[null,"Class Name","UoM","USA #","USA #","Volume","rate ($/kWh):",null,null,"Amount","Volume","rate ($/kWh):",null,null,"Amount"]
[null,{"$f":"B18","v":"Residential R1"},"kWh",4006,4705,116594732.58413842,{"$f":"G43","v":0.1016464835613819},null,null,{"$f":"F58*G58","v":11851444.568957344},122732709.12678739,{"$f":"G58","v":0.1016464835613819},null,null,{"$f":"ROUND(K58*L58,0)","v":12475348}]
[null,"Seasonal","kWh",4010,4705,6460264.8392944653,{"$f":"+$G$58","v":0.1016464835613819},null,null,656663.20378951833,6361357.8335585045,{"$f":"L58","v":0.1016464835613819},null,null,646610]
[null,"Residential R2","kWh",4035,4705,35644146.097383618,{"$f":"+$G$58","v":0.1016464835613819},null,null,3623102.1103471988,34928163.406232819,{"$f":"L59","v":0.1016464835613819},null,null,3550325]
[null,"Street Lighting","kWh",4010,4705,623994.56284139596,0.1016464835613819,null,null,63426.853074249637,629278.01114400954,0.1016464835613819,null,null,63964]
[null,"other","kWh",4025,4705,null,0.1016464835613819,null,null,0,null,0.1016464835613819,null,null,0]
[null,"other","kWh",4025,4705,null,0.1016464835613819,null,null,0,null,0.1016464835613819,null,null,0]
[null,"other","kWh",4025,4705,null,0.1016464835613819,null,null,0,null,0.1016464835613819,null,null,0]
[null,"other","kWh",4025,4705,null,0.1016464835613819,null,null,0,null,0.1016464835613819,null,null,0]
[null,"other","kWh",4025,4705,null,0.1016464835613819,null,null,0,null,0.1016464835613819,null,null,0]
[null,"TOTAL",null,null,null,{"$f":"SUM(F58:F66)","v":159323138.08365789},null,null,null,{"$f":"SUM(J58:J66)","v":16194636.73616831},{"$f":"SUM(K58:K66)","v":164651508.37772271},null,null,null,{"$f":"SUM(O58:O66)","v":16736247}]
[]
[]
[null,"Total",null,null,null,2017,null,null,null,null,2018]
[null,"Customer",null,"Revenue","Expense"," "]
[null,"Class Name","UoM","USA #","USA #","Volume","avg rate ($/kWh):",null,null,"Amount","Volume","avg rate ($/kWh):",null,null,"Amount"]
[null,{"$f":"+B18","v":"Residential R1"},"kWh",4006,4705,{"$f":"+F58","v":116594732.58413842},{"$f":"+J73/F73","v":0.1016464835613819},null,null,{"$f":"+J58","v":11851444.568957344},{"$f":"+K58","v":122732709.12678739},{"$f":"+O73/K73","v":0.10164648111134342},null,null,{"$f":"+O58","v":12475348}]
[null,"Seasonal","kWh",4010,4705,{"$f":"+F59","v":6460264.8392944653},0.1016464835613819,null,null,{"$f":"+J59","v":656663.20378951833},{"$f":"+K59","v":6361357.8335585045},0.10164653788046543,null,null,{"$f":"+O59","v":646610}]
[null,"Residential R2","kWh",4035,4705,{"$f":"+F60+F51","v":116730775.09738362},6.8217242071972509E-2,null,null,{"$f":"+J60+J51","v":7963051.5420671981},{"$f":"+K60+K51","v":116014792.40623282},6.8010934365091355E-2,null,null,{"$f":"+O60+O51","v":7890274.4317199998}]
[null,"Street Lighting","kWh",4010,4705,{"$f":"+F61+F52","v":623994.56284139596},0.1016464835613819,null,null,{"$f":"+J61+J52","v":63426.853074249637},{"$f":"+K61+K52","v":629278.01114400954},0.101646647216729,null,null,{"$f":"+O61+O52","v":63964}]
[null,"other","kWh",4025,4705,0,{"$error":"#DIV/0!"},null,null,{"$f":"+J62","v":0},{"$f":"+K62","v":0},{"$error":"#DIV/0!"},null,null,0]
[null,"other","kWh",4025,4705,0,{"$error":"#DIV/0!"},null,null,{"$f":"+J63","v":0},0,{"$error":"#DIV/0!"},null,null,0]
[null,"other","kWh",4025,4705,0,{"$error":"#DIV/0!"},null,null,{"$f":"+J64","v":0},0,{"$error":"#DIV/0!"},null,null,0]
[null,"other","kWh",4025,4705,0,0,null,null,{"$f":"+J65","v":0},0,0,null,null,0]
[null,"other","kWh",4025,4705,0,0,null,null,{"$f":"+J66","v":0},0,0,null,null,0]
[null,"TOTAL",null,null,null,{"$f":"SUM(F73:F81)","v":240409767.08365789},null,null,null,{"$f":"SUM(J73:J81)","v":20534586.16788831},{"$f":"SUM(K73:K81)","v":245738137.37772271},null,null,null,{"$f":"SUM(O73:O81)","v":21076196.43172}]
[]
["*Regulated Price Plan Prices and the Global Adjustment Modifier for the Period May 1, 2018 – April 30, 2019"]
["** Regulated Price Plan Cost Suppy Report May 1, 2018 - April 30, 2019"]

{"sheet":"Sheet1","index":53,"n_rows":0,"n_cols":0,"rows_kept":0,"cut":false,"hidden":false,"merged":[]}