{"text_format":"1","workbook":"xlsx","n_sheets":3,"sheets":["Affidavit & Summary","Fees & Disbursements","EndSheet"],"not_rendered":{"charts":0,"images":1,"macros":1,"external_links":0,"defined_names":3,"comments":0,"pivot_tables":0},"unopened":[],"bounds":{"document_bytes":16777216,"sheet_cells":100000,"rows_first":2000,"rows_last":500,"rows_between":2000,"halvings":0,"cell_chars":16384,"cell_head_chars":4096},"cells_cut":0,"cells_raw":0,"read":"whole","date_system":"1900"}

{"sheet":"Affidavit & Summary","index":0,"n_rows":88,"n_cols":10,"rows_kept":88,"cut":false,"hidden":false,"merged":[[64,4,64,8],[63,0,63,2],[62,0,62,2],[50,0,50,3],[57,0,57,9],[53,0,53,2],[52,0,52,2],[53,4,53,5],[51,0,51,2],[61,0,61,3],[59,0,59,3],[60,4,60,6],[59,4,59,8],[61,4,61,8],[62,4,62,8],[63,4,63,8],[32,0,32,9],[52,4,52,5],[49,0,49,9],[50,4,50,5],[51,4,51,5],[46,1,46,4],[33,0,33,9],[46,7,46,9],[38,3,38,5],[38,7,38,8],[39,7,39,8],[37,5,37,8],[44,6,44,9],[44,1,44,4],[41,0,41,5],[35,0,35,5],[30,0,30,9],[31,0,31,9],[18,0,18,1],[18,2,18,4],[16,1,16,4],[28,4,28,6],[16,7,16,9],[25,0,25,9],[24,6,24,7],[18,6,18,7],[0,0,1,9],[27,7,27,9],[11,0,11,9],[4,0,4,9],[3,0,3,9],[9,0,9,9],[6,8,6,9],[5,0,5,9],[27,1,27,4],[10,0,10,9],[7,0,7,9],[14,6,14,9],[14,1,14,4],[8,0,8,9]]}
["This form should be used by a party to a hearing before the Board to identify the fees and disbursements that form the party's cost claim.  Paper and electronic copies of this form and itemized receipts must be filed with the Board and served on one or more other parties as directed by the Board in the applicable Board order.  Please ensure all required (yellow-shaded) fields are filled in and the Affidavit portion is signed and sworn or affirmed."]
[]
[]
["Instructions"]
["- Required data input is indicated by yellow-shaded fields.  Formulas are embedded in the form to assist with calculations."]
["- All claims must be in Canadian dollars.   If applicable, state exchange rate and country of initial currency."]
[null,null,null,null,"Rate:",null,null,"Country:"]
["- A separate \"Detail of Fees and Disbursements Being Claimed\" (comprising a \"Statement of Fees Being Claimed\" and a \"Statement of Disbursements Being Claimed\") is required for each lawyer, analyst/consultant and articling student/paralegal.  "]
["However, only one \"Summary of Fees and Disbursements\" covering the whole of the party's cost claim should be provided."]
["- The cost claim must be supported by a completed Affidavit signed by a representative of the party. "]
["- A CV for each consultant/analyst must be attached unless provided to the Board as prescribed on the Cost Award Tariff."]
["Except as provided in section 7.03 of the Practice Direction on Cost Awards, itemized receipts must be provided."]
[]
[]
["File #  EB-","2018-0305",null,null,null,"Process: ","Enbridge Gas Inc. 2019 Natural Gas Rates"]
[]
["Party:","Quinte Manufacturers Association",null,null,null,null,"Affiant's Name:","Michael McLeod"]
[]
["HST Number:",null,"893039321 RT0001",null,null,null,"HST Rate Ontario:",null,0.13]
[]
[null,null,null,"Full Registrant",null,null,null,"Qualifying Non-Profit"]
[null,null,null,"Unregistered",null,null,null,"Tax Exempt"]
[null,null,null,"Other"]
[]
[]
["Affidavit"]
[]
["I,","Michael McLeod",null,null,null,", of the City/Town of",null,"Carrying Place"]
["in the Province/State of",null,null,null,"Ontario",null,null,", swear or affirm that:"]
[]
["1. I am a representative of the above-noted party (the \"Party\") and as such have knowledge of the matters attested to herein."]
["2. I have examined all of the documentation in support of this cost claim, including the attached \"Summary of Fees and Disbursements Being Claimed\", \"Statement(s) of Fees Being Claimed\" and \"Statement(s) of Disbursements Being Claimed\"."]
["3. The attached \"Summary of Fees and Disbursements Being Claimed\", \"Statement(s) of Fees Being Claimed\" and \"Statement(s) of Disbursements Being Claimed\" include only costs incurred and time spent directly for the purposes of the Party's participation in the Ontario Energy Board process referred to above."]
["4. This cost claim does not include any costs for work done, or time spent, by a person that is an employee or officer of the Party as described in sections 6.05 and 6.09 of the Board's Practice Direction on Cost Awards."]
[null,null,null,null,null,null," "," "," "," "]
["Signature of Affiant"]
[]
["Sworn or affirmed before me at the City/Town of",null,null,null,null,"Belleville",null,null,null,","]
["in the Province/State of",null,null,"Ontario",null,null,", on","2019-10-24",null,"."]
[null,null,null,null,null,null,null,"(date)"]
[null,null,null,null,null,null,null,null,"   "]
["Commissioner for taking Affidavits"]
[]
[]
["File #  EB-",{"$f":"IF(B15=\"\",\"\",B15)","v":"2018-0305"},null,null,null,"Process: ",{"$f":"IF(G15=\"\",\"\",G15)","v":"Enbridge Gas Inc. 2019 Natural Gas Rates"}]
[]
["Party:",{"$f":"IF(B17=\"\",\"\",B17)","v":"Quinte Manufacturers Association"}]
[]
[]
["Summary of Fees and Disbursements Being Claimed"]
["Legal/consultant/other fees",null,null,null,{"$f":"SUM('Fees & Disbursements:EndSheet'!F42)","v":4585}]
["Disbursements",null,null,null,{"$f":"SUM('Fees & Disbursements:EndSheet'!E74)","v":0}]
["HST",null,null,null,{"$f":"SUM('Fees & Disbursements:EndSheet'!G42)+SUM('Fees & Disbursements:EndSheet'!G74)","v":596.04999999999995}]
["Total Cost Claim",null,null,null,{"$f":"SUM(E51:E53)","v":5181.05}]
[]
[]
[]
["Payment Information"]
[]
["Make cheque payable to:  ",null,null,null,"GH Gunther Huettlin Manufacturing Inc."]
[]
["Send payment to this address:  ",null,null,null,"Ms. K. Egan, EVP & CFO"]
[null,null,null,null,"101 Petrie Place"]
[null,null,null,null,"Belleville, Ontario K8N 5T3"]
[]
[]
[]
[]
[]
[]
[]
[]
[]
[]
[]
[]
[]
[]
[]
[]
[]
[]
[]
[]
[]
[]
[]
[" "]

{"sheet":"Fees & Disbursements","index":1,"n_rows":89,"n_cols":8,"rows_kept":89,"cut":false,"hidden":false,"merged":[[6,6,6,7],[5,6,5,7],[9,4,9,6],[30,7,30,8],[18,0,18,2],[19,0,19,2],[20,0,20,2],[18,7,18,8],[19,7,19,8],[20,7,20,8],[10,5,10,6],[13,0,13,8],[14,7,14,8],[16,7,16,8],[27,7,27,8],[14,0,14,2],[17,7,17,8],[17,0,17,2],[21,7,21,8],[22,7,22,8],[23,7,23,8],[21,0,21,2],[22,0,22,2],[25,7,25,8],[55,0,55,3],[24,0,24,2],[24,7,24,8],[1,1,1,3],[1,5,1,8],[3,1,3,3],[41,7,41,8],[41,0,41,3],[46,0,46,2],[25,0,25,2],[26,0,26,2],[28,0,28,2],[28,7,28,8],[29,7,29,8],[26,7,26,8],[31,0,31,2],[36,0,36,2],[31,7,31,8],[32,0,32,2],[37,0,37,2],[38,0,38,2],[38,7,38,8],[40,7,40,8],[34,7,34,8],[65,7,65,8],[66,7,66,8],[67,7,67,8],[59,7,59,8],[66,0,66,3],[65,4,65,5],[67,0,67,3],[64,4,64,5],[60,4,60,5],[61,4,61,5],[66,4,66,5],[59,4,59,5],[62,4,62,5],[60,7,60,8],[61,7,61,8],[52,1,52,2],[35,7,35,8],[37,7,37,8],[36,7,36,8],[39,7,39,8],[15,7,15,8],[15,0,15,2],[16,0,16,2],[27,0,27,2],[33,0,33,2],[33,7,33,8],[32,7,32,8],[39,0,39,2],[34,0,34,2],[35,0,35,2],[23,0,23,2],[3,4,3,5],[3,6,3,7],[57,4,57,5],[58,4,58,5],[68,7,68,8],[69,7,69,8],[73,7,73,8],[68,0,68,3],[69,2,69,3],[73,0,73,3],[69,0,69,1],[68,4,68,5],[69,4,69,5],[73,4,73,5],[62,7,62,8],[63,7,63,8],[63,4,63,5],[67,4,67,5],[57,0,57,3],[58,0,58,3],[59,0,59,3],[50,1,50,2],[50,5,50,8],[70,0,70,1],[70,2,70,3],[70,4,70,5],[70,7,70,8],[71,0,71,1],[71,2,71,3],[71,4,71,5],[71,7,71,8],[52,4,52,5],[52,6,52,7],[56,0,56,3],[54,0,54,8],[64,2,64,3],[64,7,64,8],[60,0,60,3],[63,0,63,3],[62,0,62,3],[61,0,61,3],[58,7,58,8],[55,7,55,8],[55,4,55,5],[56,4,56,5],[57,7,57,8],[56,7,56,8],[65,0,65,3]]}
[]
["File #  EB-",{"$f":"IF('Affidavit & Summary'!B$15=\"\",\"\",'Affidavit & Summary'!B$15)","v":"2018-0305"},null,null,"Process: ",{"$f":"IF('Affidavit & Summary'!G$15=\"\",\"\",'Affidavit & Summary'!G$15)","v":"Enbridge Gas Inc. 2019 Natural Gas Rates"}]
[]
["Party:",{"$f":"IF('Affidavit & Summary'!B$17=\"\",\"\",'Affidavit & Summary'!B$17)","v":"Quinte Manufacturers Association"},null,null,"Service Provider Name:",null,"Michael McLeod"]
[]
[null,null,"SERVICE PROVIDER TYPE","(check one)","Year Called to Bar",null,"Completed Years Practising/Years of Relevant Experience"]
[null,null,"Legal Counsel",null,null,null,37]
[null,null,"Articling Student/Paralegal"]
[null,null,"Consultant",null,null,null,"Hourly Rate:",140]
[null,null,"Analyst"]
[null,null,"For Consultant/Analyst:","           CV attached",null,"HST Rate Charged (enter %):",null,0.13]
[null,null,null,"           CV provided within previous 24 months"]
[]
["Statement of Fees Being Claimed"]
[null,null,null,"Hours","Hourly Rate","Subtotal","HST","Total"]
["Pre-hearing Conference"]
["Preparation",null,null,null,{"$f":"H9","v":140},{"$f":"D17*E17","v":0},{"$f":"F17*H$11","v":0},{"$f":"F17+G17","v":0}]
["Attendance",null,null,null,{"$f":"E17","v":140},{"$f":"D18*E18","v":0},{"$f":"F18*H$11","v":0},{"$f":"F18+G18","v":0}]
["Technical Conference"]
["Preparation",null,null,2.75,{"$f":"E17","v":140},{"$f":"D20*E20","v":385},{"$f":"F20*H$11","v":50.050000000000004},{"$f":"F20+G20","v":435.05}]
["Attendance",null,null,7,{"$f":"E17","v":140},{"$f":"D21*E21","v":980},{"$f":"F21*H$11","v":127.4},{"$f":"F21+G21","v":1107.4000000000001}]
["Interrogatories"]
["Preparation",null,null,4,{"$f":"E$17","v":140},{"$f":"D23*E23","v":560},{"$f":"F23*H$11","v":72.8},{"$f":"F23+G23","v":632.79999999999995}]
["Responses",null,null,2.25,{"$f":"E$17","v":140},{"$f":"D24*E24","v":315},{"$f":"F24*H$11","v":40.950000000000003},{"$f":"F24+G24","v":355.95}]
["Issues Conference"]
["Preparation",null,null,null,{"$f":"E$17","v":140},{"$f":"D26*E26","v":0},{"$f":"F26*H$11","v":0},{"$f":"F26+G26","v":0}]
["Attendance",null,null,null,{"$f":"E$17","v":140},{"$f":"D27*E27","v":0},{"$f":"F27*H$11","v":0},{"$f":"F27+G27","v":0}]
["ADR - Settlement Conference"]
["Preparation",null,null,2,{"$f":"E$17","v":140},{"$f":"D29*E29","v":280},{"$f":"F29*H$11","v":36.4},{"$f":"F29+G29","v":316.39999999999998}]
[null,null,"Attendance",8,{"$f":"E$17","v":140},{"$f":"D30*E30","v":1120},145.6,{"$f":"F30+G30","v":1265.5999999999999}]
[null,null,"Proposal Preparation",null,{"$f":"E$17","v":140},{"$f":"D31*E31","v":0},0,{"$f":"F31+G31","v":0}]
["Argument"]
["Preparation",null,null,6.75,{"$f":"E$17","v":140},{"$f":"D33*E33","v":945},{"$f":"F33*H$11","v":122.85000000000001},{"$f":"F33+G33","v":1067.8499999999999}]
["Oral Hearing"]
["Preparation",null,null,null,{"$f":"E$17","v":140},{"$f":"D35*E35","v":0},{"$f":"F35*H$11","v":0},{"$f":"F35+G35","v":0}]
["Attendance",null,null,null,{"$f":"E$17","v":140},{"$f":"D36*E36","v":0},0,{"$f":"F36+G36","v":0}]
["Other Conferences"]
["Preparation",null,null,null,{"$f":"E$17","v":140},{"$f":"D38*E38","v":0},{"$f":"F38*H$11","v":0},{"$f":"F38+G38","v":0}]
["Attendance",null,null,null,{"$f":"E$17","v":140},{"$f":"D39*E39","v":0},0,{"$f":"F39+G39","v":0}]
["Case Management",null,null,null,null,{"$f":"D40*E40","v":0},0,{"$f":"F40+G40","v":0}]
[]
["TOTAL SERVICE PROVIDER FEES",null,null,null,null,{"$f":"SUM(F16:F40)","v":4585},{"$f":"SUM(G16:G40)","v":596.04999999999995},{"$f":"SUM(H16:H40)","v":5181.0499999999993}]
[]
[]
[]
[]
[]
[]
[]
[]
["File #  EB-",{"$f":"IF('Affidavit & Summary'!B$15=\"\",\"\",'Affidavit & Summary'!B$15)","v":"2018-0305"},null,null,"Process: ",{"$f":"IF('Affidavit & Summary'!G$15=\"\",\"\",'Affidavit & Summary'!G$15)","v":"Enbridge Gas Inc. 2019 Natural Gas Rates"}]
[]
["Party:",{"$f":"IF('Affidavit & Summary'!B$17=\"\",\"\",'Affidavit & Summary'!B$17)","v":"Quinte Manufacturers Association"},null,null,"Service Provider Name:",null,{"$f":"IF(G4=\"\",\"\",G4)","v":"Michael McLeod"}]
[]
["Statement of Disbursements Being Claimed"]
[null,null,null,null,"Net Cost",null,"HST","Total"]
["Scanning/Photocopy",null,null,null,null,null,{"$f":"E57*H11","v":0},{"$f":"E57+G57","v":0}]
["Printing",null,null,null,null,null,{"$f":"E58*H11","v":0},0]
["Courier",null,null,null,null,null,{"$f":"E59*H11","v":0},0]
["Telephone/Fax",null,null,null,null,null,{"$f":"E60*H11","v":0},0]
["Transcripts",null,null,null,null,null,{"$f":"E61*H11","v":0},0]
["Travel: Air",null,null,null,null,null,{"$f":"E62*H11","v":0},0]
["Travel: Car",null,null,null,null,null,{"$f":"E63*H11","v":0},0]
["Travel: Rail",null,null,null,null,null,{"$f":"E64*H11","v":0},0]
["Travel (Other):",null,null,null,null,null,{"$f":"E65*H11","v":0},0]
["Parking",null,null,null,null,null,{"$f":"E66*H11","v":0},{"$f":"E66+G66","v":0}]
["Taxi",null,null,null,null,null,{"$f":"E67*H11","v":0},{"$f":"E67+G67","v":0}]
["Accommodation",null,null,null,null,null,{"$f":"E68*H11","v":0},0]
["Meals",null,null,null,null,null,{"$f":"E69*H11","v":0},0]
["Other:",null,null,null,null,null,{"$f":"E70*H11","v":0},0]
["Other:",null,null,null,null,null,{"$f":"E71*H11","v":0},0]
["Other:",null,null,null,null,null,{"$f":"E72*H11","v":0},0]
[]
["TOTAL DISBURSEMENTS:",null,null,null,{"$f":"SUM(E57:E72)","v":0},null,{"$f":"SUM(G57:G72)","v":0},{"$f":"SUM(H57:I72)","v":0}]
[]
[]
[]
[]
[]
[]
[]
[]
[]
[]
[]
[]
[]
[]
[false,false,true,false,{"$f":"IF(A89=TRUE,TRUE,IF(B89=TRUE,TRUE,IF(C89=TRUE,TRUE,IF(D89=TRUE,TRUE,FALSE))))","v":true},false]

{"sheet":"EndSheet","index":2,"n_rows":0,"n_cols":0,"rows_kept":0,"cut":false,"hidden":true,"merged":[]}