{"text_format":"1","workbook":"xlsx","n_sheets":24,"sheets":["A1.1 Distributor Information","B1.1 Current Distribution Rates","B1.2 Billing Determinants","B1.3 Current Rev From Rates","C1.1 Current Rate Riders","C2.1 Regulatory Cost Adjustment","C2.2 Alloc Reg Cost Adj","C2.3 Adj Monthly Service Chg","D1.1 Rate 1 Adjustment","D1.2 Rate 6 Adjustment","D1.3 Rate 11 Adjustment","D1.4 Rate 16 Adjustment","E1.1 Proposed Dist Rates ","E1.2 Billing Determinants","E1.3 Proposed Rev From Rate","F1.1 Calc Shared Tax Changes","F1.2 Alloc Shared Tax Changes","F1.3 Rate Riders","F2.1 Deferred Revenue Recovery","G1.1 Rate 1 Bill Impact","G1.2 Rate 6 Bill Impact","G1.3 Rate 11 Bill Impact","G1.4 Rate 16 Bill Impact","G1.7 Summary of Bill Impacts"],"not_rendered":{"charts":0,"images":1,"macros":1,"external_links":0,"defined_names":5,"comments":0,"pivot_tables":0},"unopened":[],"bounds":{"document_bytes":16777216,"sheet_cells":100000,"rows_first":2000,"rows_last":500,"rows_between":2000,"halvings":0,"cell_chars":16384,"cell_head_chars":4096},"cells_cut":0,"cells_raw":0,"read":"whole","date_system":"1900"}

{"sheet":"A1.1 Distributor Information","index":0,"n_rows":12,"n_cols":4,"rows_kept":12,"cut":false,"hidden":false,"merged":[]}
[]
[]
[null,null,{"$f":" \"Name of LDC:       \" &D8","v":"Name of LDC:       EPCOR Natural Gas Limited Partnership"}]
[null,null,{"$f":" \"OEB Application Number:          \" & D9","v":"OEB Application Number:          EB-2020-0233  Exhibit A - 2021 Custom Incentive Application"}]
[]
[null,null,"Distributor Information"]
[]
[null,null,"Distributor Name","EPCOR Natural Gas Limited Partnership"]
[null,null,"OEB Application Number","EB-2020-0233  Exhibit A - 2021 Custom Incentive Application"]
[]
{"$rows_left_out":3}
{"sheet":"B1.1 Current Distribution Rates","index":1,"n_rows":18,"n_cols":17,"rows_kept":18,"cut":false,"hidden":false,"merged":[[6,6,6,8]]}
[]
[null,null,{"$f":"'A1.1 Distributor Information'!C3","v":"Name of LDC:       EPCOR Natural Gas Limited Partnership"}]
[null,null,{"$f":"'A1.1 Distributor Information'!C4","v":"OEB Application Number:          EB-2020-0233  Exhibit A - 2021 Custom Incentive Application"}]
[]
[null,null,"Current Distribution Tariff Sheet Rates"]
[]
[null,null,null,null,"Fixed ",null,"Delivery Charge",null,null,"Delivery Charge"]
[null,null,"Rate Class",null,"Monthly Base",{"$f":"OneDollar","v":"Bill 32 Rate"},"Tier 1","Tier 2","Tier 3","Contract Demand","Gas Supply","Upstream Recovery \nCharge","Transportation & \nStorage Charge","Transportation Charge \nFrom Dawn","Transportation Charge \nFrom Kirkwall","Transportation Charge From Parkway","Federal Carbon Charge"]
[null,null,null,null," $/month","$ / month","₵ / m3","₵ / m3","₵ / m3","₵ /contracted m3","₵  / m3","(A)","₵  / m3","₵ /contracted m3","₵ /contracted m3","₵ /contracted m3","₵ / m3"]
[null,null,"Rate 1","General Firm Service",25.38,1,27.1967,26.661000000000001,25.8735,null,12.9861,1.474,2.6981999999999999,null,null,null,5.87]
{"$rows_left_out":9}
{"sheet":"B1.2 Billing Determinants","index":2,"n_rows":12,"n_cols":10,"rows_kept":12,"cut":false,"hidden":false,"merged":[[6,5,6,7]]}
[]
[null,null,{"$f":"'A1.1 Distributor Information'!C3","v":"Name of LDC:       EPCOR Natural Gas Limited Partnership"}]
[null,null,{"$f":"'A1.1 Distributor Information'!C4","v":"OEB Application Number:          EB-2020-0233  Exhibit A - 2021 Custom Incentive Application"}]
[]
[null,null,"Billing Determinants"]
[]
[null,null,null,null,"Fixed","Delivery Charge",null,null,"Delivery Charge"]
[null,null,"Rate Class",null,"Monthly Base","Tier 1","Tier 2","Tier 3","Contract Demand","Gas Supply"]
[null,null,"Rate 1","General Firm Service",3077.5,3115813.1882673944,3760450.7385175074,183058.5732150978,0,4014141.5]
[null,null,"Rate 6","Large Volume General Firm Service",46.5,476342.5175655412,1038569.5952123763,242616.75990112737,0,887258.36309749365]
{"$rows_left_out":3}
{"sheet":"B1.3 Current Rev From Rates","index":3,"n_rows":19,"n_cols":15,"rows_kept":19,"cut":false,"hidden":false,"merged":[[17,2,17,3],[10,6,10,8]]}
[]
[null,null,{"$f":"'A1.1 Distributor Information'!C3","v":"Name of LDC:       EPCOR Natural Gas Limited Partnership"}]
[null,null,{"$f":"'A1.1 Distributor Information'!C4","v":"OEB Application Number:          EB-2020-0233  Exhibit A - 2021 Custom Incentive Application"}]
[]
[]
[null,null,"Forecasted Revenue from Current Rates"]
[]
[null,null,"Months / Year",12]
[]
[]
{"$rows_left_out":10}
{"sheet":"C1.1 Current Rate Riders","index":4,"n_rows":13,"n_cols":6,"rows_kept":13,"cut":false,"hidden":false,"merged":[]}
[]
[null,null,{"$f":"'A1.1 Distributor Information'!C3","v":"Name of LDC:       EPCOR Natural Gas Limited Partnership"}]
[null,null,{"$f":"'A1.1 Distributor Information'!C4","v":"OEB Application Number:          EB-2020-0233  Exhibit A - 2021 Custom Incentive Application"}]
[]
[null,null,"Current Rate Riders"]
[]
[null,null,"Description:",null,"Delay in Revenue Recovery Rate Rider"]
[null,null,"Effective Until:",null,"Dec 31, 2028"]
[]
[null,null,"Rate 1 | General Firm Service","cents / m3 volume",1.633,"$/m3"]
{"$rows_left_out":4}
{"sheet":"C2.1 Regulatory Cost Adjustment","index":5,"n_rows":23,"n_cols":6,"rows_kept":23,"cut":false,"hidden":true,"merged":[]}
[null,null,{"$f":"'A1.1 Distributor Information'!#REF!","v":{"$error":"#REF!"}}]
[null,null,{"$f":"'A1.1 Distributor Information'!C3","v":"Name of LDC:       EPCOR Natural Gas Limited Partnership"}]
[null,null,{"$f":"'A1.1 Distributor Information'!C4","v":"OEB Application Number:          EB-2020-0233  Exhibit A - 2021 Custom Incentive Application"}]
[]
[]
[]
[]
[null,null,"Regulatory Cost Adjustment"]
[null,null,"Annual Regulatory  Adjustment"]
[null,null,22800,"for 3 years",{"$f":"C10*3","v":68400},"Total to be collected"]
{"$rows_left_out":14}
{"sheet":"C2.2 Alloc Reg Cost Adj","index":6,"n_rows":26,"n_cols":15,"rows_kept":26,"cut":false,"hidden":true,"merged":[]}
[]
[null,null,{"$f":"'A1.1 Distributor Information'!C3","v":"Name of LDC:       EPCOR Natural Gas Limited Partnership"}]
[null,null,{"$f":"'A1.1 Distributor Information'!C4","v":"OEB Application Number:          EB-2020-0233  Exhibit A - 2021 Custom Incentive Application"}]
[]
[]
[]
[]
[]
[]
[null,null,"Allocation of Regualtory Cost Adjustment"]
{"$rows_left_out":17}
{"sheet":"C2.3 Adj Monthly Service Chg","index":7,"n_rows":28,"n_cols":9,"rows_kept":28,"cut":false,"hidden":true,"merged":[]}
[null,null,{"$f":"'A1.1 Distributor Information'!#REF!","v":{"$error":"#REF!"}}]
[null,null,{"$f":"'A1.1 Distributor Information'!C3","v":"Name of LDC:       EPCOR Natural Gas Limited Partnership"}]
[null,null,{"$f":"'A1.1 Distributor Information'!C4","v":"OEB Application Number:          EB-2020-0233  Exhibit A - 2021 Custom Incentive Application"}]
[]
[]
[]
[]
[]
[]
[null,null,"Adjustment to Monthly Service Charge"]
{"$rows_left_out":19}
{"sheet":"D1.1 Rate 1 Adjustment","index":8,"n_rows":27,"n_cols":9,"rows_kept":27,"cut":false,"hidden":false,"merged":[]}
[]
[null,null,{"$f":"'A1.1 Distributor Information'!C3","v":"Name of LDC:       EPCOR Natural Gas Limited Partnership"}]
[null,null,{"$f":"'A1.1 Distributor Information'!C4","v":"OEB Application Number:          EB-2020-0233  Exhibit A - 2021 Custom Incentive Application"}]
[]
[null,null,"Rate 1 Incentive Rate Adjustment"]
[null,null,{"$f":"MID(CELL(\"filename\",A1),FIND(\"]\",CELL(\"filename\",A1))+1,255)","v":"D1.1 Rate 1 Adjustment"}]
[]
[null,null,"Rate 1"]
[]
[null,null,"GDP-IPI"]
{"$rows_left_out":18}
{"sheet":"D1.2 Rate 6 Adjustment","index":9,"n_rows":27,"n_cols":9,"rows_kept":27,"cut":false,"hidden":false,"merged":[]}
[]
[null,null,{"$f":"'A1.1 Distributor Information'!C3","v":"Name of LDC:       EPCOR Natural Gas Limited Partnership"}]
[null,null,{"$f":"'A1.1 Distributor Information'!C4","v":"OEB Application Number:          EB-2020-0233  Exhibit A - 2021 Custom Incentive Application"}]
[]
[null,null,"Rate 6 Incentive Rate Adjustment"]
[null,null,{"$f":"MID(CELL(\"filename\",A1),FIND(\"]\",CELL(\"filename\",A1))+1,255)","v":"D1.2 Rate 6 Adjustment"}]
[]
[null,null,"Rate 6"]
[]
[null,null,"GDP-IPI"]
{"$rows_left_out":18}
{"sheet":"D1.3 Rate 11 Adjustment","index":10,"n_rows":27,"n_cols":9,"rows_kept":27,"cut":false,"hidden":false,"merged":[]}
[]
[null,null,{"$f":"'A1.1 Distributor Information'!C3","v":"Name of LDC:       EPCOR Natural Gas Limited Partnership"}]
[null,null,{"$f":"'A1.1 Distributor Information'!C4","v":"OEB Application Number:          EB-2020-0233  Exhibit A - 2021 Custom Incentive Application"}]
[]
[null,null,"Rate 11 Incentive Rate Adjustment"]
[null,null,{"$f":"MID(CELL(\"filename\",A1),FIND(\"]\",CELL(\"filename\",A1))+1,255)","v":"D1.3 Rate 11 Adjustment"}]
[]
[null,null,"Rate 11"]
[]
[null,null,"GDP-IPI"]
{"$rows_left_out":18}
{"sheet":"D1.4 Rate 16 Adjustment","index":11,"n_rows":29,"n_cols":9,"rows_kept":29,"cut":false,"hidden":false,"merged":[]}
[]
[null,null,{"$f":"'A1.1 Distributor Information'!C3","v":"Name of LDC:       EPCOR Natural Gas Limited Partnership"}]
[null,null,{"$f":"'A1.1 Distributor Information'!C4","v":"OEB Application Number:          EB-2020-0233  Exhibit A - 2021 Custom Incentive Application"}]
[]
[null,null,"Rate 16 Incentive Rate Adjustment"]
[null,null,{"$f":"MID(CELL(\"filename\",A1),FIND(\"]\",CELL(\"filename\",A1))+1,255)","v":"D1.4 Rate 16 Adjustment"}]
[]
[null,null,"Rate 16"]
[]
[null,null,"GDP-IPI"]
{"$rows_left_out":20}
{"sheet":"E1.1 Proposed Dist Rates ","index":12,"n_rows":14,"n_cols":17,"rows_kept":14,"cut":false,"hidden":false,"merged":[]}
[]
[null,null,{"$f":"'A1.1 Distributor Information'!C3","v":"Name of LDC:       EPCOR Natural Gas Limited Partnership"}]
[null,null,{"$f":"'A1.1 Distributor Information'!C4","v":"OEB Application Number:          EB-2020-0233  Exhibit A - 2021 Custom Incentive Application"}]
[]
[null,null,"Proposed Distribution Tariff Sheet Rates"]
[null,null,{"$f":"MID(CELL(\"filename\",A1),FIND(\"]\",CELL(\"filename\",A1))+1,255)","v":"E1.1 Proposed Dist Rates "}]
[]
[null,null,"Rate Class",null,"Monthly Base",{"$f":"OneDollar","v":"Bill 32 Rate"},"Tier 1","Tier 2","Tier 3","Contract Demand","Gas Supply","Upstream Recovery \nCharge","Transportation & \nStorage Charge","Transportation Charge \nFrom Dawn","Transportation Charge \nFrom Kirkwall","Transportation Charge From Parkway","Federal Carbon Charge"]
[null,null,null,null,"$/month","$/month","₵ / m3","₵ / m3","₵ / m3","₵/contracted m3","₵/m3","(A)","₵  / m3","₵ /contracted m3","₵ /contracted m3","₵ /contracted m3","₵ / m3"]
[null,null,"Rate 1","General Firm Service",{"$f":"INDEX('D1.1 Rate 1 Adjustment'!$G$17:$G$26,MATCH(E$8,'D1.1 Rate 1 Adjustment'!$C$17:$C$26,0))","v":25.760699999999996},{"$f":"INDEX('D1.1 Rate 1 Adjustment'!$G$17:$G$26,MATCH(F$8,'D1.1 Rate 1 Adjustment'!$C$17:$C$26,0))","v":1},{"$f":"INDEX('D1.1 Rate 1 Adjustment'!$G$17:$G$26,MATCH(G$8,'D1.1 Rate 1 Adjustment'!$C$17:$C$26,0))","v":27.604650499999998},{"$f":"INDEX('D1.1 Rate 1 Adjustment'!$G$17:$G$26,MATCH(H$8,'D1.1 Rate 1 Adjustment'!$C$17:$C$26,0))","v":27.060914999999998},{"$f":"INDEX('D1.1 Rate 1 Adjustment'!$G$17:$G$26,MATCH(I$8,'D1.1 Rate 1 Adjustment'!$C$17:$C$26,0))","v":26.261602499999999},null,{"$f":"INDEX('D1.1 Rate 1 Adjustment'!$G$17:$G$26,MATCH(K$8,'D1.1 Rate 1 Adjustment'!$C$17:$C$26,0))","v":12.9861},{"$f":"INDEX('D1.1 Rate 1 Adjustment'!$G$17:$G$26,MATCH(L$8,'D1.1 Rate 1 Adjustment'!$C$17:$C$26,0))","v":1.474},{"$f":"INDEX('D1.1 Rate 1 Adjustment'!$G$17:$G$26,MATCH(M$8,'D1.1 Rate 1 Adjustment'!$C$17:$C$26,0))","v":2.7324671399999998},null,null,null,{"$f":"INDEX('D1.1 Rate 1 Adjustment'!$G$17:$G$26,MATCH(Q$8,'D1.1 Rate 1 Adjustment'!$C$17:$C$26,0))","v":5.87}]
{"$rows_left_out":5}
{"sheet":"E1.2 Billing Determinants","index":13,"n_rows":14,"n_cols":10,"rows_kept":14,"cut":false,"hidden":false,"merged":[]}
[]
[null,null,{"$f":"'A1.1 Distributor Information'!C3","v":"Name of LDC:       EPCOR Natural Gas Limited Partnership"}]
[null,null,{"$f":"'A1.1 Distributor Information'!C4","v":"OEB Application Number:          EB-2020-0233  Exhibit A - 2021 Custom Incentive Application"}]
[]
[null,null,"Billing Determinants"]
[null,null,{"$f":"MID(CELL(\"filename\",A1),FIND(\"]\",CELL(\"filename\",A1))+1,255)","v":"E1.2 Billing Determinants"}]
[]
[]
[null,null,"Rate Class","Description","Base","Tier 1","Tier 2","Tier 3","Firm Demand","Gas Supply"]
[null,null,null,null,"cx's","m3","m3","m3","Contracted m3","m3"]
{"$rows_left_out":5}
{"sheet":"E1.3 Proposed Rev From Rate","index":14,"n_rows":18,"n_cols":15,"rows_kept":18,"cut":false,"hidden":false,"merged":[]}
[]
[null,null,{"$f":"'A1.1 Distributor Information'!C3","v":"Name of LDC:       EPCOR Natural Gas Limited Partnership"}]
[null,null,{"$f":"'A1.1 Distributor Information'!C4","v":"OEB Application Number:          EB-2020-0233  Exhibit A - 2021 Custom Incentive Application"}]
[]
[null,null,"Proposed Revenue from Rates"]
[]
[null,null,"Months / Year",12]
[]
[null,null,"Rate Class",null,"Monthly Base",{"$f":"OneDollar","v":"Bill 32 Rate"},"Tier 1","Tier 2","Tier 3","Contracted\nDemand","Gas Supply","Upstream Recovery \nCharge","Transportation & \nStorage Charge","Federal Carbon \nCharge","Total"]
[null,null,null,null,null,null,null,null,null,null,null,null,"(A)"]
{"$rows_left_out":9}
{"sheet":"F1.1 Calc Shared Tax Changes","index":15,"n_rows":38,"n_cols":19,"rows_kept":38,"cut":false,"hidden":true,"merged":[]}
[]
[null,null,{"$f":"'A1.1 Distributor Information'!C3","v":"Name of LDC:       EPCOR Natural Gas Limited Partnership"}]
[null,null,{"$f":"'A1.1 Distributor Information'!C4","v":"OEB Application Number:          EB-2020-0233  Exhibit A - 2021 Custom Incentive Application"}]
[]
[]
[]
[]
[]
[]
[null,null,"Tax Change Rate Rider"]
{"$rows_left_out":29}
{"sheet":"F1.2 Alloc Shared Tax Changes","index":16,"n_rows":28,"n_cols":15,"rows_kept":28,"cut":false,"hidden":true,"merged":[]}
[]
[null,null,{"$f":"'A1.1 Distributor Information'!C3","v":"Name of LDC:       EPCOR Natural Gas Limited Partnership"}]
[null,null,{"$f":"'A1.1 Distributor Information'!C4","v":"OEB Application Number:          EB-2020-0233  Exhibit A - 2021 Custom Incentive Application"}]
[]
[]
[]
[]
[]
[]
[null,null,"Allocation of Shared Tax Changes"]
{"$rows_left_out":19}
{"sheet":"F1.3 Rate Riders","index":17,"n_rows":11,"n_cols":6,"rows_kept":11,"cut":false,"hidden":false,"merged":[]}
[]
[null,null,{"$f":"'A1.1 Distributor Information'!C3","v":"Name of LDC:       EPCOR Natural Gas Limited Partnership"}]
[null,null,{"$f":"'A1.1 Distributor Information'!C4","v":"OEB Application Number:          EB-2020-0233  Exhibit A - 2021 Custom Incentive Application"}]
[]
[null,null,"Delay in Revenue Recovery Rate Rider"]
[null,null,"F1.3 Rate Riders",null,"Delay in Revenue Recovery Rate Rider"]
[]
[null,null,"Rate 1 | General Firm Service",null,1.633,"Cents/m3"]
[null,null,"Rate 6 | Large Volume General Firm Service",null,0.90900000000000003,"Cents/m3"]
[null,null,"Rate 11 | Large Volume Seasonal Service",null,0.5524,"Cents/m3"]
{"$rows_left_out":2}
{"sheet":"F2.1 Deferred Revenue Recovery","index":18,"n_rows":28,"n_cols":18,"rows_kept":28,"cut":false,"hidden":true,"merged":[[11,10,11,17],[12,10,13,17]]}
[]
[null,null,{"$f":"'A1.1 Distributor Information'!C3","v":"Name of LDC:       EPCOR Natural Gas Limited Partnership"}]
[null,null,{"$f":"'A1.1 Distributor Information'!C4","v":"OEB Application Number:          EB-2020-0233  Exhibit A - 2021 Custom Incentive Application"}]
[]
[]
[]
[]
[]
[]
[null,null,"Deferred Revenue Recovery"]
{"$rows_left_out":19}
{"sheet":"G1.1 Rate 1 Bill Impact","index":19,"n_rows":149,"n_cols":12,"rows_kept":149,"cut":false,"hidden":false,"merged":[]}
[]
[null,null,{"$f":"'A1.1 Distributor Information'!C3","v":"Name of LDC:       EPCOR Natural Gas Limited Partnership"}]
[null,null,{"$f":"'A1.1 Distributor Information'!C4","v":"OEB Application Number:          EB-2020-0233  Exhibit A - 2021 Custom Incentive Application"}]
[]
[null,null,"Rate 1 Delivery Bill Impact"]
[null,null,"G1.1 Rate 1 Bill Impact"]
[]
[null,null,"Rate 1"]
[]
[null,null,"Rate 1 - Existing Residential",null,"Units","Current Rate",null,"Proposed Rate"]
{"$rows_left_out":140}
{"sheet":"G1.2 Rate 6 Bill Impact","index":20,"n_rows":77,"n_cols":12,"rows_kept":77,"cut":false,"hidden":false,"merged":[]}
[]
[null,null,{"$f":"'A1.1 Distributor Information'!C3","v":"Name of LDC:       EPCOR Natural Gas Limited Partnership"}]
[null,null,{"$f":"'A1.1 Distributor Information'!C4","v":"OEB Application Number:          EB-2020-0233  Exhibit A - 2021 Custom Incentive Application"}]
[]
[null,null,"Rate 6 Delivery Bill Impact"]
[null,null,"G1.2 Rate 6 Bill Impact"]
[]
[null,null,"Rate 6 - Medium Commercial",null,"Units","Current Rate",null,"Proposed Rate"]
[]
[null,null,"Customer",null,"$/month",{"$f":"INDEX('B1.1 Current Distribution Rates'!$E$10:$Q$13,2,COUNTA($C$10:C10))","v":103.53},null,{"$f":"INDEX('E1.1 Proposed Dist Rates '!$E$10:$Q$13,2,COUNTA($C$10:C10))","v":105.08295}]
{"$rows_left_out":68}
{"sheet":"G1.3 Rate 11 Bill Impact","index":21,"n_rows":76,"n_cols":12,"rows_kept":76,"cut":false,"hidden":false,"merged":[]}
[]
[null,null,{"$f":"'A1.1 Distributor Information'!C3","v":"Name of LDC:       EPCOR Natural Gas Limited Partnership"}]
[null,null,{"$f":"'A1.1 Distributor Information'!C4","v":"OEB Application Number:          EB-2020-0233  Exhibit A - 2021 Custom Incentive Application"}]
[]
[null,null,"Rate 11 Delivery Bill Impact"]
[null,null,{"$f":"MID(CELL(\"filename\",A1),FIND(\"]\",CELL(\"filename\",A1))+1,255)","v":"G1.3 Rate 11 Bill Impact"}]
[]
[null,null,"Rate 11 - Large Seasonal Service Sample Dryer 1",null,"Units","Current Rate",null,"Proposed Rate"]
[]
[null,null,"Customer",null,"$/month",{"$f":"INDEX('B1.1 Current Distribution Rates'!$E$10:$Q$13,3,COUNTA($C10:C$10))","v":207.06},null,{"$f":"INDEX('E1.1 Proposed Dist Rates '!$E$10:$Q$13,3,COUNTA($C10:C$10))","v":210.16589999999999}]
{"$rows_left_out":67}
{"sheet":"G1.4 Rate 16 Bill Impact","index":22,"n_rows":45,"n_cols":12,"rows_kept":45,"cut":false,"hidden":false,"merged":[]}
[]
[null,null,{"$f":"'A1.1 Distributor Information'!C3","v":"Name of LDC:       EPCOR Natural Gas Limited Partnership"}]
[null,null,{"$f":"'A1.1 Distributor Information'!C4","v":"OEB Application Number:          EB-2020-0233  Exhibit A - 2021 Custom Incentive Application"}]
[]
[null,null,"Rate 16 Delivery Bill Impact"]
[null,null,{"$f":"MID(CELL(\"filename\",A1),FIND(\"]\",CELL(\"filename\",A1))+1,255)","v":"G1.4 Rate 16 Bill Impact"}]
[]
[null,null,"Rate 16 - Contracted Demand",null,"Units","Current Rate",null,"Proposed Rate"]
[]
[null,null,"Customer",null,"$/month",{"$f":"INDEX('B1.1 Current Distribution Rates'!$E$10:$Q$13,4,COUNTA($C$10:C10))","v":1522.5},null,{"$f":"INDEX('E1.1 Proposed Dist Rates '!$E$10:$Q$13,4,COUNTA($C$10:C10))","v":1545.3374999999999}]
{"$rows_left_out":36}
{"sheet":"G1.7 Summary of Bill Impacts","index":23,"n_rows":18,"n_cols":13,"rows_kept":18,"cut":false,"hidden":false,"merged":[]}
[]
[null,null,{"$f":"'A1.1 Distributor Information'!C3","v":"Name of LDC:       EPCOR Natural Gas Limited Partnership"}]
[null,null,{"$f":"'A1.1 Distributor Information'!C4","v":"OEB Application Number:          EB-2020-0233  Exhibit A - 2021 Custom Incentive Application"}]
[]
[null,null,"Summary of Bill Impacts"]
[]
[null,null,{"$f":"MID(CELL(\"filename\",A1),FIND(\"]\",CELL(\"filename\",A1))+1,255)","v":"G1.7 Summary of Bill Impacts"}]
[null,null,"Rate Class",null,"Fixed Change",{"$f":"OneDollar","v":"Bill 32 Rate"},"Volumetric Change","Rate Rider","Upstream Recovery \nCharge","Transportation & \nStorage Charge","Federal Carbon Charge Change","Total Change","Total Change %"]
[null,null,null,null,"($/year)","($/year)","($/year)","($/year)","($/year)","($/year)","($/year)","($/year)"]
[null,null,"Rate 1","Existing Residential",{"$f":"'G1.1 Rate 1 Bill Impact'!J27","v":4.5683999999999401},{"$f":"'G1.1 Rate 1 Bill Impact'!J28","v":0},{"$f":"SUM('G1.1 Rate 1 Bill Impact'!J29:J32)","v":8.6746341014187465},{"$f":"'G1.1 Rate 1 Bill Impact'!J41","v":0},{"$f":"'G1.1 Rate 1 Bill Impact'!J34","v":0},{"$f":"'G1.1 Rate 1 Bill Impact'!J35","v":0.73640083859999095},{"$f":"'G1.1 Rate 1 Bill Impact'!J36","v":0},{"$f":"SUM(E10:K10)","v":13.979434940018677},{"$f":"'G1.1 Rate 1 Bill Impact'!L43","v":9.8112294863844911E-3}]
{"$rows_left_out":8}