{"text_format":"1","workbook":"xlsx","n_sheets":53,"sheets":["LDC Info","Index","COS Flowchart","List of Key References","App.2-A_Requested_Approvals","App.2-AA_Capital Projects","App.2-AB_Capital Expenditures","Hidden_CAPEX","App.2-AC_Customer Engagement","App.2-B_Acctg Instructions","App.2-BA_Fixed Asset Cont","Appendix 2-BB Service Life  ","App.2-C_DepExp","App.2-D_Overhead","App.2-EA_Account 1575 (2015)","App.2-EB_Account 1576 (2012)","App.2-EC_Account 1576 (2013)","Hidden_REG Invest.","Hidden_REG Improvement","Hidden_REG Expansion","App.2-FA Proposed REG Invest.","App.2-FB Calc of REG Improvemnt","App.2-FC Calc of REG Expansion","App.2-G SQI","App.2-H_Other_Oper_Rev","Hidden_Other Revenue","App_2-I LF_CDM","lists","App.2-IA_Load_Forecast_Instrct","App.2-IB_Load_Forecast_Analysis","App.2-JA_OM&A_Summary_Analys","Hidden_OM&A Summary","App.2-JB_OM&A_Cost _Drivers","App.2-JC_OMA Programs","App.2-K_Employee Costs","Hidden_Employee Costs","App.2-L_OM&A_per_Cust_FTE","App.2-L_OM&A_per_Cust_FTEE_exp","App.2-M_Regulatory_Costs","Hidden_RegulatoryCosts1","Hidden_RegulatoryCosts2","App.2-N_Corp_Cost_Allocation","App.2-OA Capital Structure","App.2-OB_Debt Instruments","App.2-Q_Cost of Serv. Emb. Dx","App.2-R_Loss Factors","App.2-ZA_Com. Exp. Forecast","App.2-ZB_Cost of Power","App.2-S_Stranded Meters","App.2-Y_MIFRS Summary Impacts","Sheet19","App.2-YA_IFRS Transition Costs","Sheet1"],"not_rendered":{"charts":0,"images":4,"macros":1,"external_links":21,"defined_names":903,"comments":2,"pivot_tables":0},"unopened":[],"bounds":{"document_bytes":16777216,"sheet_cells":100000,"rows_first":2000,"rows_last":500,"rows_between":2000,"halvings":0,"cell_chars":16384,"cell_head_chars":4096},"cells_cut":0,"cells_raw":0,"read":"whole","date_system":"1900"}

{"sheet":"LDC Info","index":0,"n_rows":77,"n_cols":27,"rows_kept":77,"cut":false,"hidden":false,"merged":[[35,0,36,3],[32,8,33,9],[36,4,36,6],[48,0,48,3],[27,4,27,6],[30,4,30,6],[29,0,30,3],[45,0,46,3],[41,0,42,3],[42,4,42,6],[32,0,33,3],[33,4,33,6],[38,0,39,3],[17,4,17,10],[13,4,13,10],[15,4,15,8],[19,4,19,8],[25,4,25,6],[23,4,23,6],[21,4,21,8]]}
[]
[]
[null,null,null,null,null,null,null,null,null,null,null,null,null,null,null,null,null,null,null,null,null,null,null,null,null,1,"Alectra Utilities Corporation-Brampton Rate Zone"]
[null,null,null,null,null,null,null,null,null,null,null,null,null,null,null,null,null,null,null,null,null,null,null,null,null,2,"Alectra Utilities Corporation-Enersource Rate Zone"]
[null,null,null,null,null,null,null,null,null,null,null,null,null,null,null,null,null,null,null,null,null,null,null,null,null,3,"Alectra Utilities Corporation-Horizon Utilities Rate Zone"]
[null,null,null,null,null,null,null,null,null,null,null,null,null,null,null,null,null,null,null,null,null,null,null,null,null,4,"Alectra Utilities Corporation-PowerStream Rate Zone"]
[null,null,null,null,null,null,null,null,null,null,null,null,null,null,null,null,null,null,null,null,null,null,null,null,null,5,"Alectra Utilities Corporation-Guelph Rate Zone"]
[null,null,null,null,null,null,null,null,null,null,null,null,null,null,null,null,null,null,null,null,null,null,null,null,null,6,"Algoma Power Inc."]
[null,null,null,null,null,null,null,null,null,null,null,null,null,null,null,null,null,null,null,null,null,null,null,null,null,7,"Atikokan Hydro Inc."]
[null,null,null,null,null,null,null,null,null,null,null,null,null,null,null,null,null,null,null,null,null,null,null,null,null,8,"Bluewater Power Distribution Corporation"]
[null,null,null,null,null,null,null,null,null,null,null,null,null,null,null,null,null,null,null,null,null,null,null,null,null,9,"Brantford Power Inc."]
[null,null,null,null,null,null,null,null,null,null,null,null,null,null,null,null,null,null,null,null,null,null,null,null,null,10,"Burlington Hydro Inc."]
[null,null,null,null,null,null,null,null,null,null,null,null,null,null,null,null,null,null,null,null,null,null,null,null,null,11,"Canadian Niagara Power Inc."]
[null,null,null,"Utility Name   ",null,null,null,null,null,null,null,null,null,null,null,null,null,null,null,null,null,null,null,null,null,12,"Centre Wellington Hydro Ltd."]
[null,null,null,null,null,null,null,null,null,null,null,null,null,null,null,null,null,null,null,null,null,null,null,null,null,13,"Chapleau Public Utilities Corporation"]
[null,null,null,"Assigned EB Number",null,null,null,null,null,null,null,null,null,null,null,null,null,null,null,null,null,null,null,null,null,14,"Cooperative Hydro Embrun Inc."]
[null,null,null,null,null,null,null,null,null,null,null,null,null,null,null,null,null,null,null,null,null,null,null,null,null,15,"E.L.K. Energy Inc."]
[null,null,null,"Name of Contact and Title",null,null,null,null,null,null,null,null,null,null,null,null,null,null,null,null,null,null,null,null,null,16,"Elexicon Energy Inc.-Whitby Rate Zone"]
[null,null,null,null,null,null,null,null,null,null,null,null,null,null,null,null,null,null,null,null,null,null,null,null,null,17,"Elexicon Energy Inc.-Veridian Rate Zone"]
[null,null,null,"Phone Number   ",null,null,null,null,null,null,null,null,null,null,null,null,null,null,null,null,null,null,null,null,null,18,"Energy+ Inc."]
[null,null,null,null,null,null,null,null,null,null,null,null,null,null,null,null,null,null,null,null,null,null,null,null,null,19,"Entegrus Powerlines Inc.-For Entegrus-Main Rate Zone"]
[null,null,null,"Email Address   ",null,null,null,null,null,null,null,null,null,null,null,null,null,null,null,null,null,null,null,null,null,20,"Entegrus Powerlines Inc.-For Former St. Thomas Energy Rate Zone"]
[null,null,null,null,null,null,null,null,null,null,null,null,null,null,null,null,null,null,null,null,null,null,null,null,null,21,"ENWIN Utilities Ltd."]
[null,null,null,"Test Year",2021,null,null,null,null,null,null,null,null,null,null,null,null,null,null,null,null,null,null,null,null,22,"EPCOR Electricity Distribution Ontario Inc."]
[null,null,null,null,null,null,null,null,null,null,null,null,null,null,null,null,null,null,null,null,null,null,null,null,null,23,"ERTH Power Corporation - ERTH Power Main Rate Zone"]
[null,null,null,"Bridge Year",{"$f":"IF(ISBLANK(E24), \"\", E24-1)","v":2020},null,null,null,null,null,null,null,null,null,null,null,null,null,null,null,null,null,null,null,null,24,"ERTH POWER CORPORATION – GODERICH RATE ZONE"]
[null,null,null,null,null,null,null,null,null,null,null,null,null,null,null,null,null,null,null,null,null,null,null,null,null,25,"Essex Powerlines Corporation"]
[null,null,null,"Last Rebasing Year",2014,null,null,null,null,null,null,null,null,null,null,null,null,null,null,null,null,null,null,null,null,26,"Festival Hydro Inc."]
[null,null,null,null,null,null,null,null,null,null,null,null,null,null,null,null,null,null,null,null,null,null,null,null,null,27,"Fort Frances Power Corporation"]
["Identify the accounting standard used for the test year",null,null,null,null,null,null,null,null,null,null,null,null,null,null,null,null,null,null,null,null,null,null,null,null,28,"Greater Sudbury Hydro Inc."]
[null,null,null,null,null,null,null,null,null,null,null,null,null,null,null,null,null,null,null,null,null,null,null,null,null,29,"Grimsby Power Incorporated"]
[null,null,null,null,null,null,null,null,null,null,null,null,null,null,null,null,null,null,null,null,null,null,null,null,null,30,"Halton Hills Hydro Inc."]
[{"$f":"\"Did \"& E14 &\" update its depreciation and capitalization policies?\"","v":"Did  update its depreciation and capitalization policies?"},null,null,null,null,null,null,null,null,null,null,null,null,null,null,null,null,null,null,null,null,null,null,null,null,31,"Hearst Power Distribution Co. Ltd."]
[null,null,null,null,null,null,null,null,null,null,null,null,null,null,null,null,null,null,null,null,null,null,null,null,null,32,"Hydro 2000 Inc."]
[null,null,null,null,null,null,null,null,null,null,null,null,null,null,null,null,null,null,null,null,null,null,null,null,null,33,"Hydro Hawkesbury Inc."]
["If \"yes\" to cell E34, were the changes in policies reflected in a prior rebasing application?",null,null,null,null,null,null,null,null,null,null,null,null,null,null,null,null,null,null,null,null,null,null,null,null,34,"Hydro One Networks Inc."]
[null,null,null,null,null,null,null,null,null,null,null,null,null,null,null,null,null,null,null,null,null,null,null,null,null,35,"Hydro One Networks Inc.-Former Haldimand County Hydro Inc. Service Area"]
[null,null,null,null,null,null,null,null,null,null,null,null,null,null,null,null,null,null,null,null,null,null,null,null,null,36,"Hydro One Networks Inc.-Former Norfolk Power Distribution Inc. Service Area"]
[{"$f":"\"When did \"&E14&\" update its actual depreciation and capitalization policies?\"","v":"When did  update its actual depreciation and capitalization policies?"},null,null,null,null,null,null,null,null,null,null,null,null,null,null,null,null,null,null,null,null,null,null,null,null,37,"Hydro One Networks Inc.-Former Woodstock Hydro Services Inc. Service Area"]
[null,null,null,null,"2001-01-01",null,null,null,null,null,null,null,null,null,null,null,null,null,null,null,null,null,null,null,null,38,"Hydro One Remote Communites Inc."]
[null,null,null,null,null,null,null,null,null,null,null,null,null,null,null,null,null,null,null,null,null,null,null,null,null,39,"Hydro Ottawa Limited"]
["Identify the year the applicant adopted IFRS for financial reporting purposes",null,null,null,null,null,null,null,null,null,null,null,null,null,null,null,null,null,null,null,null,null,null,null,null,40,"InnPower Corporation"]
[null,null,null,null,null,null,null,null,null,null,null,null,null,null,null,null,null,null,null,null,null,null,null,null,null,41,"Kingston Hydro Corporation"]
[null,null,null,null,null,null,null,null,null,null,null,null,null,null,null,null,null,null,null,null,null,null,null,null,null,42,"Kitchener-Wilmot Hydro Inc."]
[null,null,null,null,null,null,null,null,null,null,null,null,null,null,null,null,null,null,null,null,null,null,null,null,null,43,"Lakefront Utilities Inc."]
[{"$f":"\"Is \" & E14 & \" applying for cost recovery for the test and/or future year(s) for Green Energy initiatives?\"","v":"Is  applying for cost recovery for the test and/or future year(s) for Green Energy initiatives?"},null,null,null,null,null,null,null,null,null,null,null,null,null,null,null,null,null,null,null,null,null,null,null,null,44,"Lakeland Power Distribution Ltd."]
[null,null,null,null,null,null,null,null,null,null,null,null,null,null,null,null,null,null,null,null,null,null,null,null,null,45,"Lakeland Power Distribution Ltd.-Parry Sound Service Area"]
[null,null,null,null,null,null,null,null,null,null,null,null,null,null,null,null,null,null,null,null,null,null,null,null,null,46,"London Hydro Inc."]
[{"$f":"\"Is \" & E14 & \" an embedded distributor?\"","v":"Is  an embedded distributor?"},null,null,null,null,null,null,null,null,null,null,null,null,null,null,null,null,null,null,null,null,null,null,null,null,47,"Milton Hydro Distribution Inc."]
[null,null,null,null,null,null,null,null,null,null,null,null,null,null,null,null,null,null,null,null,null,null,null,null,null,48,"Newmarket-Tay Power Distribution Ltd.-For Former Midland Power Utility Rate Zone"]
[null,null,null,null,null,null,null,null,null,null,null,null,null,null,null,null,null,null,null,null,null,null,null,null,null,49,"Newmarket-Tay Power Distribution Ltd.-For Newmarket-Tay Power Main Rate Zone"]
[null,"Notes",null,null,null,null,null,null,null,null,null,null,null,null,null,null,null,null,null,null,null,null,null,null,null,50,"Niagara Peninsula Energy Inc."]
[null,null,null,null,null,null,null,null,null,null,null,null,null,null,null,null,null,null,null,null,null,null,null,null,null,51,"Niagara-on-the-Lake Hydro Inc."]
[null,null,"Pale green cells represent input cells.",null,null,null,null,null,null,null,null,null,null,null,null,null,null,null,null,null,null,null,null,null,null,52,"North Bay Hydro Distribution Limited - Espanola service territory"]
[null,null,null,null,null,null,null,null,null,null,null,null,null,null,null,null,null,null,null,null,null,null,null,null,null,53,"North Bay Hydro Distribution Limited - North Bay service territory"]
[null,null,"Pale blue cells represent drop-down lists.  The applicant should select the appropriate item from the drop-down list.",null,null,null,null,null,null,null,null,null,null,null,null,null,null,null,null,null,null,null,null,null,null,54,"Northern Ontario Wires Inc."]
[null,null,null,null,null,null,null,null,null,null,null,null,null,null,null,null,null,null,null,null,null,null,null,null,null,55,"Oakville Hydro Electricity Distribution Inc."]
[null,null,"White cells contain fixed values, automatically generated values or formulae. ",null,null,null,null,null,null,null,null,null,null,{"$f":"IF(LEN($G58)>1, (SUMPRODUCT(--($C$81:$C$1003=$C58),--($A$81:$A$1003=$D58), --($B$81:$B$1003=$B58&\"_TOTAL\"), $L$1:$L$889)), \"\")","v":""},{"$f":"IF(LEN($G58)>1, (SUMPRODUCT(--($C$81:$C$1003=$C58),--($A$81:$A$1003=$D58), --($B$81:$B$1003=$B58&\"_TOTAL\"), $M$1:$M$889)), \"\")","v":""},null,null,null,null,null,null,null,null,null,null,56,"Orangeville Hydro Limited"]
[null,null,null,null,null,null,null,null,null,null,null,null,null,"","",null,null,null,null,null,null,null,null,null,null,57,"Orillia Power Distribution Corporation"]
[null,null,null,null,null,null,null,null,null,null,null,null,null,"","",null,null,null,null,null,null,null,null,null,null,58,"Oshawa PUC Networks Inc."]
[null,null,null,null,null,null,null,null,null,null,null,null,null,"","",null,null,null,null,null,null,null,null,null,null,59,"Ottawa River Power Corporation"]
[null,null,null,null,null,null,null,null,null,null,null,null,null,"","",null,null,null,null,null,null,null,null,null,null,60,"Peterborough Distribution Incorporated"]
[null,null,null,null,null,null,null,null,null,null,null,null,null,"","",null,null,null,null,null,null,null,null,null,null,61,"PUC Distribution Inc."]
[null,null,null,null,null,null,null,null,null,null,null,null,null,"","",null,null,null,null,null,null,null,null,null,null,62,"Renfrew Hydro Inc."]
[null,null,null,null,null,null,null,null,null,null,null,null,null,"","",null,null,null,null,null,null,null,null,null,null,63,"Rideau St. Lawrence Distribution Inc."]
[null,null,null,null,null,null,null,null,null,null,null,null,null,"","",null,null,null,null,null,null,null,null,null,null,64,"Sioux Lookout Hydro Inc."]
[null,null,null,null,null,null,null,null,null,null,null,null,null,"","",null,null,null,null,null,null,null,null,null,null,65,"Synergy North Corporation-Kenora Rate Zone"]
[null,null,null,null,null,null,null,null,null,null,null,null,null,"","",null,null,null,null,null,null,null,null,null,null,66,"Synergy North Corporation-Thunder Bay Rate Zone "]
[null,null,null,null,null,null,null,null,null,null,null,null,null,"","",null,null,null,null,null,null,null,null,null,null,67,"Tillsonburg Hydro Inc."]
[null,null,null,null,null,null,null,null,null,null,null,null,null,"","",null,null,null,null,null,null,null,null,null,null,68,"Toronto Hydro-Electric System Limited"]
[null,null,null,null,null,null,null,null,null,null,null,null,null,"","",null,null,null,null,null,null,null,null,null,null,69,"Wasaga Distribution Inc."]
[null,null,null,null,null,null,null,null,null,null,null,null,null,"","",null,null,null,null,null,null,null,null,null,null,70,"Waterloo North Hydro Inc."]
[null,null,null,null,null,null,null,null,null,null,null,null,null,"","",null,null,null,null,null,null,null,null,null,null,71,"Welland Hydro-Electric System Corp."]
[null,null,null,null,null,null,null,null,null,null,null,null,null,"","",null,null,null,null,null,null,null,null,null,null,72,"Wellington North Power Inc."]
[null,null,null,null,null,null,null,null,null,null,null,null,null,"","",null,null,null,null,null,null,null,null,null,null,73,"Westario Power Inc."]
[null,null,null,null,null,null,null,null,null,null,null,null,null,"",""]
[null,null,null,null,null,null,null,null,null,null,null,null,null,"",""]

{"sheet":"Index","index":1,"n_rows":42,"n_cols":6,"rows_kept":42,"cut":false,"hidden":false,"merged":[[41,1,41,5]]}
[]
[]
[]
[]
[]
[]
[]
[]
[]
[]
[]
[]
[]
[]
[1,"LDC Information Sheet",null,null,20,"App.2-G: Service Reliability Indicators"]
[2,"Index",null,null,21,"App.2-H: Other Operating Revenue (TO BE UPDATED AT THE DRAFT RATE ORDER STAGE)"]
[3,"Cost of Service Application Flowchart",null,null,22,"App.2-I: Load Forecast CDM Adjustment Workform"]
[4,"List of Key References",null,null,23,"App.2-IA: Load Forecast Data Instructions"]
[5,"App.2-A: List of Requested Approvals",null,null,24,"App.2-IB:  Actual and Forecast Load and Customer Data"]
[6,"App.2-AA: Capital Projects Table",null,null,25,"App.2-JA: OM&A Summary Analysis (TO BE UPDATED AT THE DRAFT RATE ORDER STAGE) "]
[7,"App.2-AB: Capital Expenditures (TO BE UPDATED AT THE DRAFT RATE ORDER STAGE)",null,null,26,"App.2-JB: Recoverable OM&A Cost Driver Table"]
[8,"App. 2-AC: Customer Engagement Worksheet",null,null,27,"App.2-JC: OM&A Programs Table"]
[9,"App.2-B: General Accounting Instructions",null,null,28,"App.2-K: Employee Costs (TO BE UPDATED AT THE DRAFT RATE ORDER STAGE)"]
[10,"App.2-BA: Fixed Asset Continuity Schedule",null,null,29,"App.2-L: Recoverable OM&A Cost per Customer and per FTE"]
[11,"Appendix 2-BB: Service Life Comparison",null,null,30,"App.2-M: Regulatory Costs Schedule (TO BE UPDATED AT THE DRAFT RATE ORDER STAGE)"]
[12,"App.2-C_DepExp: Depreciation and Amortization Expense",null,null,31,"App.2-N: Shared Services and Corporate Cost Allocation"]
[13,"App.2-D: Overhead Expenses",null,null,32,"App.2-OA: Capital Structure and Cost of Capital"]
[14,"App.2-EA: Account 1575 PP&E Deferral Account (2015 IFRS Adopters) - CONTACT OEB STAFF IF TAB REQUIRED",null,null,33,"App.2-OB: Debt Instruments"]
[15,"App.2-EB: Account 1576 - Accounting Changes Under CGAAP (2012 Changes) - CONTACT OEB STAFF IF TAB REQUIRED",null,null,34,"App.2-Q: Cost of Serving Embedded Distributor(s)"]
[16,"App.2-EC: Account 1576 - Accounting Changes Under CGAAP (2013 Changes) - CONTACT OEB STAFF IF TAB REQUIRED",null,null,35,"App.2-R: Loss Factors"]
[17,"App.2-FA: Renewable Generation Connection Investment Summary (TO BE UPDATED AT THE DRAFT RATE ORDER STAGE)",null,null,36,"App.2-S: Stranded Meter Treatment- CONTACT OEB STAFF IF TAB REQUIRED"]
[18,"App.2-FB: Calculation of Renewable Generation Connection Direct Benefits/Provincial Amount: Renewable Enabling Improvement Investments (TO BE UPDATED AT THE DRAFT RATE ORDER STAGE)",null,null,37,"App.2-Y: Transition to MIFRS Summary Impact - CONTACT OEB STAFF IF TAB REQUIRED"]
[19,"App.2-FC: Calculation of Renewable Generation Connection Direct Benefits/Provincial Amount: Renewable Expansion Investments (TO BE UPDATED AT THE DRAFT RATE ORDER STAGE)",null,null,38,"App.2-YA: One-Time Incremental IFRS Transition Costs - CONTACT OEB STAFF IF TAB REQUIRED"]
[null,null,null,null,39,"App.2-ZA: Commodity Expense"]
[null,null,null,null,40,"App.2-ZB: Cost of Power"]
[]
[]
[]
[]
[]
[]
["Note:","Appendices for the Tariff of Rates and Charges at Current and Proposed Rates, and for the Bill Impacts are now in a separate spreadsheet model. These appendices were formerly 2-Z and 2-W."]

{"sheet":"COS Flowchart","index":2,"n_rows":6,"n_cols":2,"rows_kept":6,"cut":false,"hidden":false,"merged":[[5,1,5,6],[2,1,2,6],[3,1,3,6]]}
[]
[]
[]
[null,"Cost of Service Rate Application Schematic"]
[]
[null,"The Cost of Service Rate Application Schematic is a flowchart that is included as a guide for the components of an application. The schematic demonstrates how demand and costs interrelate to derive the revenue requirement and how the revenue requirement is allocated between classes and through fixed/variable splits to derive rates that will be compensatory for the annual revenue requirement, based on the the forecasted demand.  There is no form to be filled out; therefore, this Schedule is not required to be filed."]

{"sheet":"List of Key References","index":3,"n_rows":4,"n_cols":2,"rows_kept":4,"cut":false,"hidden":false,"merged":[[1,1,1,11],[3,0,3,11]]}
[]
[null,"List of Key References"]
[]
["A list of key references for understanding the Filing Requirements has been embedded in the document below. To access the list of references and associated hyperlinks double-click the icon below."]

{"sheet":"App.2-A_Requested_Approvals","index":4,"n_rows":20,"n_cols":8,"rows_kept":20,"cut":false,"hidden":false,"merged":[[8,1,8,7],[33,5,33,7],[35,5,35,7],[37,5,37,7],[39,5,39,7],[9,1,9,7],[41,5,41,7],[11,1,11,7],[29,5,29,7],[23,5,23,7],[25,5,25,7],[27,5,27,7],[31,5,31,7],[21,5,21,7],[13,1,13,7],[15,1,15,7],[17,1,17,7],[19,5,19,7]]}
[" ",null,null,null,null,null,"File Number:",{"$f":"EBNUMBER","v":0}]
[null,null,null,null,null,null,"Exhibit:"]
[null,null,null,null,null,null,"Tab:"]
[null,null,null,null,null,null,"Schedule:"]
[null,null,null,null,null,null,"Page:"]
[]
[null,null,null,null,null,null,"Date:"]
[]
[null,"Appendix 2-A"]
[null,"List of Requested Approvals"]
[]
[null,"The distributor must fill out the following sheet with the complete list of specific approvals requested and relevant section(s) of the legislation must be provided. All approvals, including accounting orders (deferral and variance accounts) new rate classes, revised specific service charges or retail service charges which the applicant is seeking, must be separately identified, as well being clearly documented in the appropriate sections of the application."]
[]
[null,"Additional requests may be added by copying and pasting blank input rows, as needed."]
[]
[null,"If additional requests arise, or requested approvals are removed, during the processing of the application, the distributor should update this list."]
[]
[null,{"$f":"CONCATENATE('LDC Info'!E14,\" is seeking the following approvals in this application:\")","v":" is seeking the following approvals in this application:"}]
[]
[null,1]

{"sheet":"App.2-AA_Capital Projects","index":5,"n_rows":51,"n_cols":8,"rows_kept":51,"cut":false,"hidden":false,"merged":[[11,0,11,7],[53,0,54,8],[9,0,9,7],[8,0,8,7],[49,0,49,7],[51,0,51,7],[50,0,50,7]]}
[null,null,null,null,null,null,"File Number:",{"$f":"EBNUMBER","v":0}]
[null,null,null,null,null,null,"Exhibit:"]
[null,null,null,null,null,null,"Tab:"]
[null,null,null,null,null,null,"Schedule:"]
[null,null,null,null,null,null,"Page:"]
[]
[null,null,null,null,null,null,"Date:"]
[]
["Appendix 2-AA"]
["Capital Projects Table"]
[]
[]
["Projects",{"$f":"C13-1","v":2016},{"$f":"D13-1","v":2017},{"$f":"E13-1","v":2018},{"$f":"BridgeYear - 1","v":2019},{"$f":"BridgeYear & \" Bridge Year\"","v":"2020 Bridge Year"},{"$f":"TestYear & \" Test Year\"","v":"2021 Test Year"}]
["Reporting Basis"]
["Project Name #1"]
[]
[]
[]
[]
[]
["Sub-Total",{"$f":"SUM(B16:B20)","v":0},0,0,0,0,0]
["Project Name #2"]
[]
[]
[]
[]
[]
["Sub-Total",{"$f":"SUM(B23:B27)","v":0},0,0,0,0,0]
["Project Name #3"]
[]
[]
[]
[]
[]
["Sub-Total",{"$f":"SUM(B30:B34)","v":0},0,0,0,0,0]
["Project Name #4"]
[]
[]
[]
[]
[]
["Sub-Total",{"$f":"SUM(B37:B41)","v":0},0,0,0,0,0]
["Miscellaneous"]
["Total",{"$f":"SUMPRODUCT(--($A15:$A43=\"Sub-Total\"), B$15:B$43)+B43","v":0},0,0,0,0,0]
["Less Renewable Generation Facility Assets and Other Non-Rate-Regulated Utility Assets (input as negative)"]
["Total",{"$f":"B44+B45","v":0},0,0,0,0,0]
[]
["Notes:"]
[]
["1   Please provide a breakdown of the major components of each capital project undertaken in each year.  Please ensure that all projects below the materiality threshold are included in the miscellaneous line.  Add more projects as required."]
["2   The applicant should group projects appropriately and avoid presentations that result in classification of significant components of the capital budget in the miscellaneous category."]

{"sheet":"App.2-AB_Capital Expenditures","index":6,"n_rows":37,"n_cols":33,"rows_kept":37,"cut":false,"hidden":false,"merged":[[34,0,35,32],[37,0,38,32],[36,0,36,32],[29,0,29,32],[30,0,30,32],[31,0,32,32],[33,0,33,32],[8,0,8,32],[9,0,9,32],[13,19,13,21],[13,22,13,24],[13,25,13,27],[13,28,14,28],[13,29,14,29],[12,1,12,27],[13,10,13,12],[13,1,13,3],[12,0,15,0],[12,28,12,32],[13,13,13,15],[13,16,13,18],[13,30,14,30],[13,31,14,31],[27,0,27,32],[25,0,25,32],[13,7,13,9],[15,7,15,8],[13,4,13,6],[15,4,15,5],[15,28,15,32],[13,32,14,32],[15,10,15,11],[15,1,15,2],[26,0,26,32],[15,13,15,14],[15,16,15,17],[15,19,15,20],[15,22,15,23],[15,25,15,26]]}
[null,null,null,null,null,null,null,null,null,null,null,null,null,null,null,null,null,null,null,null,null,null,null,null,null,null,null,null,null,null,"File Number:",null,{"$f":"EBNUMBER","v":0}]
[null,null,null,null,null,null,null,null,null,null,null,null,null,null,null,null,null,null,null,null,null,null,null,null,null,null,null,null,null,null,"Exhibit:"]
[null,null,null,null,null,null,null,null,null,null,null,null,null,null,null,null,null,null,null,null,null,null,null,null,null,null,null,null,null,null,"Tab:"]
[null,null,null,null,null,null,null,null,null,null,null,null,null,null,null,null,null,null,null,null,null,null,null,null,null,null,null,null,null,null,"Schedule:"]
["TO BE UPDATED AT THE DRAFT RATE ORDER STAGE",null,null,null,null,null,null,null,null,null,null,null,null,null,null,null,null,null,null,null,null,null,null,null,null,null,null,null,null,null,"Page:"]
[]
[null,null,null,null,null,null,null,null,null,null,null,null,null,null,null,null,null,null,null,null,null,null,null,null,null,null,null,null,null,null,"Date:"]
[]
["Appendix 2-AB"]
["Table 2 - Capital Expenditure Summary from Chapter 5 Consolidated\nDistribution System Plan Filing Requirements"]
["First year of Forecast Period:"]
[{"$f":"TestYear","v":2021}]
["CATEGORY","Historical Period (previous plan1 & actual)",null,null,null,null,null,null,null,null,null,null,null,null,null,null,null,null,null,null,null,null,null,null,null,null,null,null,"Forecast Period (planned)"]
[null,{"$f":"E14-1","v":2012},null,null,{"$f":"H14-1","v":2013},null,null,{"$f":"K14-1","v":2014},null,null,{"$f":"N14-1","v":2015},null,null,{"$f":"Q14-1","v":2016},null,null,{"$f":"T14-1","v":2017},null,null,{"$f":"W14-1","v":2018},null,null,{"$f":"Z14-1","v":2019},null,null,{"$f":"AC14-1","v":2020},null,null,{"$f":"A12","v":2021},{"$f":"AC14+1","v":2022},{"$f":"AD14+1","v":2023},{"$f":"AE14+1","v":2024},{"$f":"AF14+1","v":2025}]
[null,"Plan","Actual","Var","Plan","Actual","Var","Plan","Actual","Var","Plan","Actual","Var","Plan","Actual","Var","Plan","Actual","Var","Plan","Actual","Var","Plan","Actual","Var","Plan","Actual2","Var"]
[null,"$ '000",null,"%","$ '000",null,"%","$ '000",null,"%","$ '000",null,"%","$ '000",null,"%","$ '000",null,"%","$ '000",null,"%","$ '000",null,"%","$ '000",null,"%","$ '000"]
["System Access",null,null,{"$f":"IF(ISERROR((C17-B17)/B17),\"--\",(C17-B17)/B17)","v":"--"},null,null,{"$f":"IF(ISERROR((F17-E17)/E17),\"--\",(F17-E17)/E17)","v":"--"},null,null,{"$f":"IF(ISERROR((I17-H17)/H17),\"--\",(I17-H17)/H17)","v":"--"},null,null,{"$f":"IF(ISERROR((L17-K17)/K17),\"--\",(L17-K17)/K17)","v":"--"},null,null,{"$f":"IF(ISERROR((O17-N17)/N17),\"--\",(O17-N17)/N17)","v":"--"},null,null,{"$f":"IF(ISERROR((R17-Q17)/Q17),\"--\",(R17-Q17)/Q17)","v":"--"},null,null,{"$f":"IF(ISERROR((U17-T17)/T17),\"--\",(U17-T17)/T17)","v":"--"},null,null,{"$f":"IF(ISERROR((X17-W17)/W17),\"--\",(X17-W17)/W17)","v":"--"},null,null,{"$f":"IF(ISERROR((AA17-Z17)/Z17),\"--\",(AA17-Z17)/Z17)","v":"--"}]
["System Renewal",null,null,{"$f":"IF(ISERROR((C18-B18)/B18),\"--\",(C18-B18)/B18)","v":"--"},null,null,{"$f":"IF(ISERROR((F18-E18)/E18),\"--\",(F18-E18)/E18)","v":"--"},null,null,{"$f":"IF(ISERROR((I18-H18)/H18),\"--\",(I18-H18)/H18)","v":"--"},null,null,{"$f":"IF(ISERROR((L18-K18)/K18),\"--\",(L18-K18)/K18)","v":"--"},null,null,{"$f":"IF(ISERROR((O18-N18)/N18),\"--\",(O18-N18)/N18)","v":"--"},null,null,{"$f":"IF(ISERROR((R18-Q18)/Q18),\"--\",(R18-Q18)/Q18)","v":"--"},null,null,{"$f":"IF(ISERROR((U18-T18)/T18),\"--\",(U18-T18)/T18)","v":"--"},null,null,{"$f":"IF(ISERROR((X18-W18)/W18),\"--\",(X18-W18)/W18)","v":"--"},null,null,{"$f":"IF(ISERROR((AA18-Z18)/Z18),\"--\",(AA18-Z18)/Z18)","v":"--"}]
["System Service",null,null,"--",null,null,"--",null,null,"--",null,null,"--",null,null,"--",null,null,"--",null,null,"--",null,null,"--",null,null,"--"]
["General Plant",null,null,"--",null,null,"--",null,null,"--",null,null,"--",null,null,"--",null,null,"--",null,null,"--",null,null,"--",null,null,"--"]
["TOTAL EXPENDITURE",{"$f":"SUM(B17:B20)","v":0},{"$f":"SUM(C17:C20)","v":0},"--",{"$f":"SUM(E17:E20)","v":0},{"$f":"SUM(F17:F20)","v":0},"--",{"$f":"SUM(H17:H20)","v":0},{"$f":"SUM(I17:I20)","v":0},"--",{"$f":"SUM(K17:K20)","v":0},{"$f":"SUM(L17:L20)","v":0},"--",{"$f":"SUM(N17:N20)","v":0},{"$f":"SUM(O17:O20)","v":0},"--",0,0,"--",0,0,"--",0,0,"--",0,0,"--",0,0,0,0,{"$f":"SUM(AG17:AG20)","v":0}]
["Capital Contributions",null,null,"--",null,null,"--",null,null,"--",null,null,"--",null,null,"--",null,null,"--",null,null,"--",null,null,"--",null,null,"--"]
["Net Capital Expenditures",null,null,"--",null,null,"--",null,null,"--",null,null,"--",null,null,"--",null,null,"--",null,null,"--",null,null,"--",null,null,"--"]
["System O&M",null,null,"--",null,null,"--",null,null,"--",null,null,"--",null,null,"--",null,null,"--",null,null,"--",null,null,"--",null,null,"--"]
[]
["Notes to the Table:"]
["1. Historical “previous plan” data is not required unless a plan has previously been filed. However, use the last OEB-approved, at least on a Total (Capital) Expenditure basis for the last cost of service rebasing year, and the applicant should include their planned budget in each subsequent historical year up to and including the Bridge Year."]
["2. Indicate the number of months of 'actual' data included in the last year of the Historical Period (normally a 'bridge' year):"]
[]
["Explanatory Notes on Variances (complete only if applicable)"]
["Notes on shifts in forecast vs. historical budgets by category"]
[]
[]
["Notes on year over year Plan vs. Actual variances for Total Expenditures"]
[]
[]
["Notes on Plan vs. Actual variance trends for individual expenditure categories"]

{"sheet":"Hidden_CAPEX","index":7,"n_rows":113,"n_cols":9,"rows_kept":113,"cut":false,"hidden":true,"merged":[]}
["Utility Name","EB Number","Test Year","Bridge Year","Last Rebasing Year","Category","Year","Plan","Actual"]
[{"$f":"'LDC Info'!$E$14","v":0},{"$f":"EBNUMBER","v":0},{"$f":"TestYear","v":2021},{"$f":"BridgeYear","v":2020},{"$f":"RebaseYear","v":2014},"System Access",{"$f":"'App.2-AB_Capital Expenditures'!B14","v":2012},{"$f":"'App.2-AB_Capital Expenditures'!B17","v":0},{"$f":"'App.2-AB_Capital Expenditures'!C17","v":0}]
[{"$f":"'LDC Info'!$E$14","v":0},0,2021,2020,2014,"System Renewal",{"$f":"'App.2-AB_Capital Expenditures'!B14","v":2012},{"$f":"'App.2-AB_Capital Expenditures'!B18","v":0},{"$f":"'App.2-AB_Capital Expenditures'!C18","v":0}]
[{"$f":"'LDC Info'!$E$14","v":0},0,2021,2020,2014,"System Service",{"$f":"'App.2-AB_Capital Expenditures'!B14","v":2012},{"$f":"'App.2-AB_Capital Expenditures'!B19","v":0},{"$f":"'App.2-AB_Capital Expenditures'!C19","v":0}]
[{"$f":"'LDC Info'!$E$14","v":0},0,2021,2020,2014,"General Plant",{"$f":"'App.2-AB_Capital Expenditures'!B14","v":2012},{"$f":"'App.2-AB_Capital Expenditures'!B20","v":0},{"$f":"'App.2-AB_Capital Expenditures'!C20","v":0}]
[{"$f":"'LDC Info'!$E$14","v":0},0,2021,2020,2014,"Total Expenditure",{"$f":"'App.2-AB_Capital Expenditures'!B14","v":2012},{"$f":"'App.2-AB_Capital Expenditures'!B21","v":0},{"$f":"'App.2-AB_Capital Expenditures'!C21","v":0}]
[{"$f":"'LDC Info'!$E$14","v":0},0,2021,2020,2014,"Capital Contributions",{"$f":"'App.2-AB_Capital Expenditures'!B14","v":2012},{"$f":"'App.2-AB_Capital Expenditures'!B22","v":0},{"$f":"'App.2-AB_Capital Expenditures'!C22","v":0}]
[{"$f":"'LDC Info'!$E$14","v":0},0,2021,2020,2014,"Net Capital Expenditures ",{"$f":"'App.2-AB_Capital Expenditures'!B14","v":2012},{"$f":"'App.2-AB_Capital Expenditures'!B23","v":0},{"$f":"'App.2-AB_Capital Expenditures'!C23","v":0}]
[{"$f":"'LDC Info'!$E$14","v":0},0,2021,2020,2014,"System O&M",{"$f":"'App.2-AB_Capital Expenditures'!B14","v":2012},{"$f":"'App.2-AB_Capital Expenditures'!B24","v":0},{"$f":"'App.2-AB_Capital Expenditures'!C24","v":0}]
[{"$f":"'LDC Info'!$E$14","v":0},0,2021,2020,2014,"System Access",{"$f":"'App.2-AB_Capital Expenditures'!E14","v":2013},{"$f":"'App.2-AB_Capital Expenditures'!E17","v":0},{"$f":"'App.2-AB_Capital Expenditures'!F17","v":0}]
[{"$f":"'LDC Info'!$E$14","v":0},0,2021,2020,2014,"System Renewal",{"$f":"'App.2-AB_Capital Expenditures'!E14","v":2013},{"$f":"'App.2-AB_Capital Expenditures'!E18","v":0},{"$f":"'App.2-AB_Capital Expenditures'!F18","v":0}]
[{"$f":"'LDC Info'!$E$14","v":0},0,2021,2020,2014,"System Service",{"$f":"'App.2-AB_Capital Expenditures'!E14","v":2013},{"$f":"'App.2-AB_Capital Expenditures'!E19","v":0},{"$f":"'App.2-AB_Capital Expenditures'!F19","v":0}]
[{"$f":"'LDC Info'!$E$14","v":0},0,2021,2020,2014,"General Plant",{"$f":"'App.2-AB_Capital Expenditures'!E14","v":2013},{"$f":"'App.2-AB_Capital Expenditures'!E20","v":0},{"$f":"'App.2-AB_Capital Expenditures'!F20","v":0}]
[{"$f":"'LDC Info'!$E$14","v":0},0,2021,2020,2014,"Total Expenditure",{"$f":"'App.2-AB_Capital Expenditures'!E14","v":2013},{"$f":"'App.2-AB_Capital Expenditures'!E21","v":0},{"$f":"'App.2-AB_Capital Expenditures'!F21","v":0}]
[{"$f":"'LDC Info'!$E$14","v":0},0,2021,2020,2014,"Capital Contributions",{"$f":"'App.2-AB_Capital Expenditures'!E14","v":2013},{"$f":"'App.2-AB_Capital Expenditures'!E22","v":0},{"$f":"'App.2-AB_Capital Expenditures'!F22","v":0}]
[{"$f":"'LDC Info'!$E$14","v":0},0,2021,2020,2014,"Net Capital Expenditures ",{"$f":"'App.2-AB_Capital Expenditures'!E14","v":2013},{"$f":"'App.2-AB_Capital Expenditures'!E23","v":0},{"$f":"'App.2-AB_Capital Expenditures'!F23","v":0}]
[{"$f":"'LDC Info'!$E$14","v":0},0,2021,2020,2014,"System O&M",{"$f":"'App.2-AB_Capital Expenditures'!E14","v":2013},{"$f":"'App.2-AB_Capital Expenditures'!E24","v":0},{"$f":"'App.2-AB_Capital Expenditures'!F24","v":0}]
[{"$f":"'LDC Info'!$E$14","v":0},0,2021,2020,2014,"System Access",{"$f":"'App.2-AB_Capital Expenditures'!H14","v":2014},{"$f":"'App.2-AB_Capital Expenditures'!H17","v":0},{"$f":"'App.2-AB_Capital Expenditures'!I17","v":0}]
[{"$f":"'LDC Info'!$E$14","v":0},0,2021,2020,2014,"System Renewal",{"$f":"'App.2-AB_Capital Expenditures'!H14","v":2014},{"$f":"'App.2-AB_Capital Expenditures'!H18","v":0},{"$f":"'App.2-AB_Capital Expenditures'!I18","v":0}]
[{"$f":"'LDC Info'!$E$14","v":0},0,2021,2020,2014,"System Service",{"$f":"'App.2-AB_Capital Expenditures'!H14","v":2014},{"$f":"'App.2-AB_Capital Expenditures'!H19","v":0},{"$f":"'App.2-AB_Capital Expenditures'!I19","v":0}]
[{"$f":"'LDC Info'!$E$14","v":0},0,2021,2020,2014,"General Plant",{"$f":"'App.2-AB_Capital Expenditures'!H14","v":2014},{"$f":"'App.2-AB_Capital Expenditures'!H20","v":0},{"$f":"'App.2-AB_Capital Expenditures'!I20","v":0}]
[{"$f":"'LDC Info'!$E$14","v":0},0,2021,2020,2014,"Total Expenditure",{"$f":"'App.2-AB_Capital Expenditures'!H14","v":2014},{"$f":"'App.2-AB_Capital Expenditures'!H21","v":0},{"$f":"'App.2-AB_Capital Expenditures'!I21","v":0}]
[{"$f":"'LDC Info'!$E$14","v":0},0,2021,2020,2014,"Capital Contributions",{"$f":"'App.2-AB_Capital Expenditures'!H14","v":2014},{"$f":"'App.2-AB_Capital Expenditures'!H22","v":0},{"$f":"'App.2-AB_Capital Expenditures'!I22","v":0}]
[{"$f":"'LDC Info'!$E$14","v":0},0,2021,2020,2014,"Net Capital Expenditures ",{"$f":"'App.2-AB_Capital Expenditures'!H14","v":2014},{"$f":"'App.2-AB_Capital Expenditures'!H23","v":0},{"$f":"'App.2-AB_Capital Expenditures'!I23","v":0}]
[{"$f":"'LDC Info'!$E$14","v":0},0,2021,2020,2014,"System O&M",{"$f":"'App.2-AB_Capital Expenditures'!H14","v":2014},{"$f":"'App.2-AB_Capital Expenditures'!H24","v":0},{"$f":"'App.2-AB_Capital Expenditures'!I24","v":0}]
[{"$f":"'LDC Info'!$E$14","v":0},0,2021,2020,2014,"System Access",{"$f":"'App.2-AB_Capital Expenditures'!K14","v":2015},{"$f":"'App.2-AB_Capital Expenditures'!K17","v":0},{"$f":"'App.2-AB_Capital Expenditures'!L17","v":0}]
[{"$f":"'LDC Info'!$E$14","v":0},0,2021,2020,2014,"System Renewal",{"$f":"'App.2-AB_Capital Expenditures'!K14","v":2015},{"$f":"'App.2-AB_Capital Expenditures'!K18","v":0},{"$f":"'App.2-AB_Capital Expenditures'!L18","v":0}]
[{"$f":"'LDC Info'!$E$14","v":0},0,2021,2020,2014,"System Service",{"$f":"'App.2-AB_Capital Expenditures'!K14","v":2015},{"$f":"'App.2-AB_Capital Expenditures'!K19","v":0},{"$f":"'App.2-AB_Capital Expenditures'!L19","v":0}]
[{"$f":"'LDC Info'!$E$14","v":0},0,2021,2020,2014,"General Plant",{"$f":"'App.2-AB_Capital Expenditures'!K14","v":2015},{"$f":"'App.2-AB_Capital Expenditures'!K20","v":0},{"$f":"'App.2-AB_Capital Expenditures'!L20","v":0}]
[{"$f":"'LDC Info'!$E$14","v":0},0,2021,2020,2014,"Total Expenditure",{"$f":"'App.2-AB_Capital Expenditures'!K14","v":2015},{"$f":"'App.2-AB_Capital Expenditures'!K21","v":0},{"$f":"'App.2-AB_Capital Expenditures'!L21","v":0}]
[{"$f":"'LDC Info'!$E$14","v":0},0,2021,2020,2014,"Capital Contributions",{"$f":"'App.2-AB_Capital Expenditures'!K14","v":2015},{"$f":"'App.2-AB_Capital Expenditures'!K22","v":0},{"$f":"'App.2-AB_Capital Expenditures'!L22","v":0}]
[{"$f":"'LDC Info'!$E$14","v":0},0,2021,2020,2014,"Net Capital Expenditures ",{"$f":"'App.2-AB_Capital Expenditures'!K14","v":2015},{"$f":"'App.2-AB_Capital Expenditures'!K23","v":0},{"$f":"'App.2-AB_Capital Expenditures'!L23","v":0}]
[{"$f":"'LDC Info'!$E$14","v":0},0,2021,2020,2014,"System O&M",{"$f":"'App.2-AB_Capital Expenditures'!K14","v":2015},{"$f":"'App.2-AB_Capital Expenditures'!K24","v":0},{"$f":"'App.2-AB_Capital Expenditures'!L24","v":0}]
[{"$f":"'LDC Info'!$E$14","v":0},{"$f":"EBNUMBER","v":0},{"$f":"TestYear","v":2021},{"$f":"BridgeYear","v":2020},{"$f":"RebaseYear","v":2014},"System Access",{"$f":"'App.2-AB_Capital Expenditures'!N14","v":2016},{"$f":"'App.2-AB_Capital Expenditures'!N17","v":0},{"$f":"'App.2-AB_Capital Expenditures'!O17","v":0}]
[{"$f":"'LDC Info'!$E$14","v":0},0,2021,2020,2014,"System Renewal",{"$f":"'App.2-AB_Capital Expenditures'!N14","v":2016},{"$f":"'App.2-AB_Capital Expenditures'!N18","v":0},{"$f":"'App.2-AB_Capital Expenditures'!O18","v":0}]
[{"$f":"'LDC Info'!$E$14","v":0},0,2021,2020,2014,"System Service",{"$f":"'App.2-AB_Capital Expenditures'!N14","v":2016},{"$f":"'App.2-AB_Capital Expenditures'!N19","v":0},{"$f":"'App.2-AB_Capital Expenditures'!O19","v":0}]
[{"$f":"'LDC Info'!$E$14","v":0},0,2021,2020,2014,"General Plant",{"$f":"'App.2-AB_Capital Expenditures'!N14","v":2016},{"$f":"'App.2-AB_Capital Expenditures'!N20","v":0},{"$f":"'App.2-AB_Capital Expenditures'!O20","v":0}]
[{"$f":"'LDC Info'!$E$14","v":0},0,2021,2020,2014,"Total Expenditure",{"$f":"'App.2-AB_Capital Expenditures'!N14","v":2016},{"$f":"'App.2-AB_Capital Expenditures'!N21","v":0},{"$f":"'App.2-AB_Capital Expenditures'!O21","v":0}]
[{"$f":"'LDC Info'!$E$14","v":0},0,2021,2020,2014,"Capital Contributions",{"$f":"'App.2-AB_Capital Expenditures'!N14","v":2016},{"$f":"'App.2-AB_Capital Expenditures'!N22","v":0},{"$f":"'App.2-AB_Capital Expenditures'!O22","v":0}]
[{"$f":"'LDC Info'!$E$14","v":0},0,2021,2020,2014,"Net Capital Expenditures ",{"$f":"'App.2-AB_Capital Expenditures'!N14","v":2016},{"$f":"'App.2-AB_Capital Expenditures'!N23","v":0},{"$f":"'App.2-AB_Capital Expenditures'!O23","v":0}]
[{"$f":"'LDC Info'!$E$14","v":0},0,2021,2020,2014,"System O&M",{"$f":"'App.2-AB_Capital Expenditures'!N14","v":2016},{"$f":"'App.2-AB_Capital Expenditures'!N24","v":0},{"$f":"'App.2-AB_Capital Expenditures'!O24","v":0}]
[{"$f":"'LDC Info'!$E$14","v":0},0,2021,2020,2014,"System Access",{"$f":"'App.2-AB_Capital Expenditures'!Q14","v":2017},{"$f":"'App.2-AB_Capital Expenditures'!Q17","v":0},{"$f":"'App.2-AB_Capital Expenditures'!R17","v":0}]
[{"$f":"'LDC Info'!$E$14","v":0},0,2021,2020,2014,"System Renewal",{"$f":"'App.2-AB_Capital Expenditures'!Q14","v":2017},{"$f":"'App.2-AB_Capital Expenditures'!Q18","v":0},{"$f":"'App.2-AB_Capital Expenditures'!R18","v":0}]
[{"$f":"'LDC Info'!$E$14","v":0},0,2021,2020,2014,"System Service",{"$f":"'App.2-AB_Capital Expenditures'!Q14","v":2017},{"$f":"'App.2-AB_Capital Expenditures'!Q19","v":0},{"$f":"'App.2-AB_Capital Expenditures'!R19","v":0}]
[{"$f":"'LDC Info'!$E$14","v":0},0,2021,2020,2014,"General Plant",{"$f":"'App.2-AB_Capital Expenditures'!Q14","v":2017},{"$f":"'App.2-AB_Capital Expenditures'!Q20","v":0},{"$f":"'App.2-AB_Capital Expenditures'!R20","v":0}]
[{"$f":"'LDC Info'!$E$14","v":0},0,2021,2020,2014,"Total Expenditure",{"$f":"'App.2-AB_Capital Expenditures'!Q14","v":2017},{"$f":"'App.2-AB_Capital Expenditures'!Q21","v":0},{"$f":"'App.2-AB_Capital Expenditures'!R21","v":0}]
[{"$f":"'LDC Info'!$E$14","v":0},0,2021,2020,2014,"Capital Contributions",{"$f":"'App.2-AB_Capital Expenditures'!Q14","v":2017},{"$f":"'App.2-AB_Capital Expenditures'!Q22","v":0},{"$f":"'App.2-AB_Capital Expenditures'!R22","v":0}]
[{"$f":"'LDC Info'!$E$14","v":0},0,2021,2020,2014,"Net Capital Expenditures ",{"$f":"'App.2-AB_Capital Expenditures'!Q14","v":2017},{"$f":"'App.2-AB_Capital Expenditures'!Q23","v":0},{"$f":"'App.2-AB_Capital Expenditures'!R23","v":0}]
[{"$f":"'LDC Info'!$E$14","v":0},0,2021,2020,2014,"System O&M",{"$f":"'App.2-AB_Capital Expenditures'!Q14","v":2017},{"$f":"'App.2-AB_Capital Expenditures'!Q24","v":0},{"$f":"'App.2-AB_Capital Expenditures'!R24","v":0}]
[{"$f":"'LDC Info'!$E$14","v":0},0,2021,2020,2014,"System Access",{"$f":"'App.2-AB_Capital Expenditures'!T14","v":2018},{"$f":"'App.2-AB_Capital Expenditures'!T17","v":0},{"$f":"'App.2-AB_Capital Expenditures'!U17","v":0}]
[{"$f":"'LDC Info'!$E$14","v":0},0,2021,2020,2014,"System Renewal",{"$f":"'App.2-AB_Capital Expenditures'!T14","v":2018},{"$f":"'App.2-AB_Capital Expenditures'!T18","v":0},{"$f":"'App.2-AB_Capital Expenditures'!U18","v":0}]
[{"$f":"'LDC Info'!$E$14","v":0},0,2021,2020,2014,"System Service",{"$f":"'App.2-AB_Capital Expenditures'!T14","v":2018},{"$f":"'App.2-AB_Capital Expenditures'!T19","v":0},{"$f":"'App.2-AB_Capital Expenditures'!U19","v":0}]
[{"$f":"'LDC Info'!$E$14","v":0},0,2021,2020,2014,"General Plant",{"$f":"'App.2-AB_Capital Expenditures'!T14","v":2018},{"$f":"'App.2-AB_Capital Expenditures'!T20","v":0},{"$f":"'App.2-AB_Capital Expenditures'!U20","v":0}]
[{"$f":"'LDC Info'!$E$14","v":0},0,2021,2020,2014,"Total Expenditure",{"$f":"'App.2-AB_Capital Expenditures'!T14","v":2018},{"$f":"'App.2-AB_Capital Expenditures'!T21","v":0},{"$f":"'App.2-AB_Capital Expenditures'!U21","v":0}]
[{"$f":"'LDC Info'!$E$14","v":0},0,2021,2020,2014,"Capital Contributions",{"$f":"'App.2-AB_Capital Expenditures'!T14","v":2018},{"$f":"'App.2-AB_Capital Expenditures'!T22","v":0},{"$f":"'App.2-AB_Capital Expenditures'!U22","v":0}]
[{"$f":"'LDC Info'!$E$14","v":0},0,2021,2020,2014,"Net Capital Expenditures ",{"$f":"'App.2-AB_Capital Expenditures'!T14","v":2018},{"$f":"'App.2-AB_Capital Expenditures'!T23","v":0},{"$f":"'App.2-AB_Capital Expenditures'!U23","v":0}]
[{"$f":"'LDC Info'!$E$14","v":0},0,2021,2020,2014,"System O&M",{"$f":"'App.2-AB_Capital Expenditures'!T14","v":2018},{"$f":"'App.2-AB_Capital Expenditures'!T24","v":0},{"$f":"'App.2-AB_Capital Expenditures'!U24","v":0}]
[{"$f":"'LDC Info'!$E$14","v":0},0,2021,2020,2014,"System Access",{"$f":"'App.2-AB_Capital Expenditures'!W14","v":2019},{"$f":"'App.2-AB_Capital Expenditures'!W17","v":0},{"$f":"'App.2-AB_Capital Expenditures'!X17","v":0}]
[{"$f":"'LDC Info'!$E$14","v":0},0,2021,2020,2014,"System Renewal",{"$f":"'App.2-AB_Capital Expenditures'!W14","v":2019},{"$f":"'App.2-AB_Capital Expenditures'!W18","v":0},{"$f":"'App.2-AB_Capital Expenditures'!X18","v":0}]
[{"$f":"'LDC Info'!$E$14","v":0},0,2021,2020,2014,"System Service",{"$f":"'App.2-AB_Capital Expenditures'!W14","v":2019},{"$f":"'App.2-AB_Capital Expenditures'!W19","v":0},{"$f":"'App.2-AB_Capital Expenditures'!X19","v":0}]
[{"$f":"'LDC Info'!$E$14","v":0},0,2021,2020,2014,"General Plant",{"$f":"'App.2-AB_Capital Expenditures'!W14","v":2019},{"$f":"'App.2-AB_Capital Expenditures'!W20","v":0},{"$f":"'App.2-AB_Capital Expenditures'!X20","v":0}]
[{"$f":"'LDC Info'!$E$14","v":0},0,2021,2020,2014,"Total Expenditure",{"$f":"'App.2-AB_Capital Expenditures'!W14","v":2019},{"$f":"'App.2-AB_Capital Expenditures'!W21","v":0},{"$f":"'App.2-AB_Capital Expenditures'!X21","v":0}]
[{"$f":"'LDC Info'!$E$14","v":0},0,2021,2020,2014,"Capital Contributions",{"$f":"'App.2-AB_Capital Expenditures'!W14","v":2019},{"$f":"'App.2-AB_Capital Expenditures'!W22","v":0},{"$f":"'App.2-AB_Capital Expenditures'!X22","v":0}]
[{"$f":"'LDC Info'!$E$14","v":0},0,2021,2020,2014,"Net Capital Expenditures ",{"$f":"'App.2-AB_Capital Expenditures'!W14","v":2019},{"$f":"'App.2-AB_Capital Expenditures'!W23","v":0},{"$f":"'App.2-AB_Capital Expenditures'!X23","v":0}]
[{"$f":"'LDC Info'!$E$14","v":0},0,2021,2020,2014,"System O&M",{"$f":"'App.2-AB_Capital Expenditures'!W14","v":2019},{"$f":"'App.2-AB_Capital Expenditures'!W24","v":0},{"$f":"'App.2-AB_Capital Expenditures'!X24","v":0}]
[{"$f":"'LDC Info'!$E$14","v":0},{"$f":"EBNUMBER","v":0},{"$f":"TestYear","v":2021},{"$f":"BridgeYear","v":2020},{"$f":"RebaseYear","v":2014},"System Access",{"$f":"'App.2-AB_Capital Expenditures'!Z14","v":2020},{"$f":"'App.2-AB_Capital Expenditures'!Z17","v":0},{"$f":"'App.2-AB_Capital Expenditures'!AA17","v":0}]
[{"$f":"'LDC Info'!$E$14","v":0},0,2021,2020,2014,"System Renewal",{"$f":"'App.2-AB_Capital Expenditures'!Z14","v":2020},{"$f":"'App.2-AB_Capital Expenditures'!Z18","v":0},{"$f":"'App.2-AB_Capital Expenditures'!AA18","v":0}]
[{"$f":"'LDC Info'!$E$14","v":0},0,2021,2020,2014,"System Service",{"$f":"'App.2-AB_Capital Expenditures'!Z14","v":2020},{"$f":"'App.2-AB_Capital Expenditures'!Z19","v":0},{"$f":"'App.2-AB_Capital Expenditures'!AA19","v":0}]
[{"$f":"'LDC Info'!$E$14","v":0},0,2021,2020,2014,"General Plant",{"$f":"'App.2-AB_Capital Expenditures'!Z14","v":2020},{"$f":"'App.2-AB_Capital Expenditures'!Z20","v":0},{"$f":"'App.2-AB_Capital Expenditures'!AA20","v":0}]
[{"$f":"'LDC Info'!$E$14","v":0},0,2021,2020,2014,"Total Expenditure",{"$f":"'App.2-AB_Capital Expenditures'!Z14","v":2020},{"$f":"'App.2-AB_Capital Expenditures'!Z21","v":0},{"$f":"'App.2-AB_Capital Expenditures'!AA21","v":0}]
[{"$f":"'LDC Info'!$E$14","v":0},0,2021,2020,2014,"Capital Contributions",{"$f":"'App.2-AB_Capital Expenditures'!Z14","v":2020},{"$f":"'App.2-AB_Capital Expenditures'!Z22","v":0},{"$f":"'App.2-AB_Capital Expenditures'!AA22","v":0}]
[{"$f":"'LDC Info'!$E$14","v":0},0,2021,2020,2014,"Net Capital Expenditures ",{"$f":"'App.2-AB_Capital Expenditures'!Z14","v":2020},{"$f":"'App.2-AB_Capital Expenditures'!Z23","v":0},{"$f":"'App.2-AB_Capital Expenditures'!AA23","v":0}]
[{"$f":"'LDC Info'!$E$14","v":0},0,2021,2020,2014,"System O&M",{"$f":"'App.2-AB_Capital Expenditures'!Z14","v":2020},{"$f":"'App.2-AB_Capital Expenditures'!Z24","v":0},{"$f":"'App.2-AB_Capital Expenditures'!AA24","v":0}]
[{"$f":"'LDC Info'!$E$14","v":0},0,2021,2020,2014,"System Access",{"$f":"'App.2-AB_Capital Expenditures'!AC14","v":2021},{"$f":"'App.2-AB_Capital Expenditures'!AC17","v":0}]
[{"$f":"'LDC Info'!$E$14","v":0},0,2021,2020,2014,"System Renewal",{"$f":"'App.2-AB_Capital Expenditures'!AC14","v":2021},{"$f":"'App.2-AB_Capital Expenditures'!AC18","v":0}]
[{"$f":"'LDC Info'!$E$14","v":0},0,2021,2020,2014,"System Service",{"$f":"'App.2-AB_Capital Expenditures'!AC14","v":2021},{"$f":"'App.2-AB_Capital Expenditures'!AC19","v":0}]
[{"$f":"'LDC Info'!$E$14","v":0},0,2021,2020,2014,"General Plant",{"$f":"'App.2-AB_Capital Expenditures'!AC14","v":2021},{"$f":"'App.2-AB_Capital Expenditures'!AC20","v":0}]
[{"$f":"'LDC Info'!$E$14","v":0},0,2021,2020,2014,"Total Expenditure",{"$f":"'App.2-AB_Capital Expenditures'!AC14","v":2021},{"$f":"'App.2-AB_Capital Expenditures'!AC21","v":0}]
[{"$f":"'LDC Info'!$E$14","v":0},0,2021,2020,2014,"Capital Contributions",{"$f":"'App.2-AB_Capital Expenditures'!AC14","v":2021},{"$f":"'App.2-AB_Capital Expenditures'!AC22","v":0}]
[{"$f":"'LDC Info'!$E$14","v":0},0,2021,2020,2014,"Net Capital Expenditures ",{"$f":"'App.2-AB_Capital Expenditures'!AC14","v":2021},{"$f":"'App.2-AB_Capital Expenditures'!AC23","v":0}]
[{"$f":"'LDC Info'!$E$14","v":0},0,2021,2020,2014,"System O&M",{"$f":"'App.2-AB_Capital Expenditures'!AC14","v":2021},{"$f":"'App.2-AB_Capital Expenditures'!AC24","v":0}]
[{"$f":"'LDC Info'!$E$14","v":0},0,2021,2020,2014,"System Access",{"$f":"'App.2-AB_Capital Expenditures'!AD14","v":2022},{"$f":"'App.2-AB_Capital Expenditures'!AD17","v":0}]
[{"$f":"'LDC Info'!$E$14","v":0},0,2021,2020,2014,"System Renewal",{"$f":"'App.2-AB_Capital Expenditures'!AD14","v":2022},{"$f":"'App.2-AB_Capital Expenditures'!AD18","v":0}]
[{"$f":"'LDC Info'!$E$14","v":0},0,2021,2020,2014,"System Service",{"$f":"'App.2-AB_Capital Expenditures'!AD14","v":2022},{"$f":"'App.2-AB_Capital Expenditures'!AD19","v":0}]
[{"$f":"'LDC Info'!$E$14","v":0},0,2021,2020,2014,"General Plant",{"$f":"'App.2-AB_Capital Expenditures'!AD14","v":2022},{"$f":"'App.2-AB_Capital Expenditures'!AD20","v":0}]
[{"$f":"'LDC Info'!$E$14","v":0},0,2021,2020,2014,"Total Expenditure",{"$f":"'App.2-AB_Capital Expenditures'!AD14","v":2022},{"$f":"'App.2-AB_Capital Expenditures'!AD21","v":0}]
[{"$f":"'LDC Info'!$E$14","v":0},0,2021,2020,2014,"Capital Contributions",{"$f":"'App.2-AB_Capital Expenditures'!AD14","v":2022},{"$f":"'App.2-AB_Capital Expenditures'!AD22","v":0}]
[{"$f":"'LDC Info'!$E$14","v":0},0,2021,2020,2014,"Net Capital Expenditures ",{"$f":"'App.2-AB_Capital Expenditures'!AD14","v":2022},{"$f":"'App.2-AB_Capital Expenditures'!AD23","v":0}]
[{"$f":"'LDC Info'!$E$14","v":0},0,2021,2020,2014,"System O&M",{"$f":"'App.2-AB_Capital Expenditures'!AD14","v":2022},{"$f":"'App.2-AB_Capital Expenditures'!AD24","v":0}]
[{"$f":"'LDC Info'!$E$14","v":0},0,2021,2020,2014,"System Access",{"$f":"'App.2-AB_Capital Expenditures'!AE14","v":2023},{"$f":"'App.2-AB_Capital Expenditures'!AE17","v":0}]
[{"$f":"'LDC Info'!$E$14","v":0},0,2021,2020,2014,"System Renewal",{"$f":"'App.2-AB_Capital Expenditures'!AE14","v":2023},{"$f":"'App.2-AB_Capital Expenditures'!AE18","v":0}]
[{"$f":"'LDC Info'!$E$14","v":0},0,2021,2020,2014,"System Service",{"$f":"'App.2-AB_Capital Expenditures'!AE14","v":2023},{"$f":"'App.2-AB_Capital Expenditures'!AE19","v":0}]
[{"$f":"'LDC Info'!$E$14","v":0},0,2021,2020,2014,"General Plant",{"$f":"'App.2-AB_Capital Expenditures'!AE14","v":2023},{"$f":"'App.2-AB_Capital Expenditures'!AE20","v":0}]
[{"$f":"'LDC Info'!$E$14","v":0},0,2021,2020,2014,"Total Expenditure",{"$f":"'App.2-AB_Capital Expenditures'!AE14","v":2023},{"$f":"'App.2-AB_Capital Expenditures'!AE21","v":0}]
[{"$f":"'LDC Info'!$E$14","v":0},0,2021,2020,2014,"Capital Contributions",{"$f":"'App.2-AB_Capital Expenditures'!AE14","v":2023},{"$f":"'App.2-AB_Capital Expenditures'!AE22","v":0}]
[{"$f":"'LDC Info'!$E$14","v":0},0,2021,2020,2014,"Net Capital Expenditures ",{"$f":"'App.2-AB_Capital Expenditures'!AE14","v":2023},{"$f":"'App.2-AB_Capital Expenditures'!AE23","v":0}]
[{"$f":"'LDC Info'!$E$14","v":0},0,2021,2020,2014,"System O&M",{"$f":"'App.2-AB_Capital Expenditures'!AE14","v":2023},{"$f":"'App.2-AB_Capital Expenditures'!AE24","v":0}]
[{"$f":"'LDC Info'!$E$14","v":0},{"$f":"EBNUMBER","v":0},{"$f":"TestYear","v":2021},{"$f":"BridgeYear","v":2020},{"$f":"RebaseYear","v":2014},"System Access",{"$f":"'App.2-AB_Capital Expenditures'!AF14","v":2024},{"$f":"'App.2-AB_Capital Expenditures'!AF17","v":0}]
[{"$f":"'LDC Info'!$E$14","v":0},0,2021,2020,2014,"System Renewal",{"$f":"'App.2-AB_Capital Expenditures'!AF14","v":2024},{"$f":"'App.2-AB_Capital Expenditures'!AF18","v":0}]
[{"$f":"'LDC Info'!$E$14","v":0},0,2021,2020,2014,"System Service",{"$f":"'App.2-AB_Capital Expenditures'!AF14","v":2024},{"$f":"'App.2-AB_Capital Expenditures'!AF19","v":0}]
[{"$f":"'LDC Info'!$E$14","v":0},0,2021,2020,2014,"General Plant",{"$f":"'App.2-AB_Capital Expenditures'!AF14","v":2024},{"$f":"'App.2-AB_Capital Expenditures'!AF20","v":0}]
[{"$f":"'LDC Info'!$E$14","v":0},0,2021,2020,2014,"Total Expenditure",{"$f":"'App.2-AB_Capital Expenditures'!AF14","v":2024},{"$f":"'App.2-AB_Capital Expenditures'!AF21","v":0}]
[{"$f":"'LDC Info'!$E$14","v":0},0,2021,2020,2014,"Capital Contributions",{"$f":"'App.2-AB_Capital Expenditures'!AF14","v":2024},{"$f":"'App.2-AB_Capital Expenditures'!AF22","v":0}]
[{"$f":"'LDC Info'!$E$14","v":0},0,2021,2020,2014,"Net Capital Expenditures ",{"$f":"'App.2-AB_Capital Expenditures'!AF14","v":2024},{"$f":"'App.2-AB_Capital Expenditures'!AF23","v":0}]
[{"$f":"'LDC Info'!$E$14","v":0},0,2021,2020,2014,"System O&M",{"$f":"'App.2-AB_Capital Expenditures'!AF14","v":2024},{"$f":"'App.2-AB_Capital Expenditures'!AF24","v":0}]
[{"$f":"'LDC Info'!$E$14","v":0},0,2021,2020,2014,"System Access",{"$f":"'App.2-AB_Capital Expenditures'!AG14","v":2025},{"$f":"'App.2-AB_Capital Expenditures'!AG17","v":0}]
[{"$f":"'LDC Info'!$E$14","v":0},0,2021,2020,2014,"System Renewal",{"$f":"'App.2-AB_Capital Expenditures'!AG14","v":2025},{"$f":"'App.2-AB_Capital Expenditures'!AG18","v":0}]
[{"$f":"'LDC Info'!$E$14","v":0},0,2021,2020,2014,"System Service",{"$f":"'App.2-AB_Capital Expenditures'!AG14","v":2025},{"$f":"'App.2-AB_Capital Expenditures'!AG19","v":0}]
[{"$f":"'LDC Info'!$E$14","v":0},0,2021,2020,2014,"General Plant",{"$f":"'App.2-AB_Capital Expenditures'!AG14","v":2025},{"$f":"'App.2-AB_Capital Expenditures'!AG20","v":0}]
[{"$f":"'LDC Info'!$E$14","v":0},0,2021,2020,2014,"Total Expenditure",{"$f":"'App.2-AB_Capital Expenditures'!AG14","v":2025},{"$f":"'App.2-AB_Capital Expenditures'!AG21","v":0}]
[{"$f":"'LDC Info'!$E$14","v":0},0,2021,2020,2014,"Capital Contributions",{"$f":"'App.2-AB_Capital Expenditures'!AG14","v":2025},{"$f":"'App.2-AB_Capital Expenditures'!AG22","v":0}]
[{"$f":"'LDC Info'!$E$14","v":0},0,2021,2020,2014,"Net Capital Expenditures ",{"$f":"'App.2-AB_Capital Expenditures'!AG14","v":2025},{"$f":"'App.2-AB_Capital Expenditures'!AG23","v":0}]
[{"$f":"'LDC Info'!$E$14","v":0},0,2021,2020,2014,"System O&M",{"$f":"'App.2-AB_Capital Expenditures'!AG14","v":2025},{"$f":"'App.2-AB_Capital Expenditures'!AG24","v":0}]

{"sheet":"App.2-AC_Customer Engagement","index":8,"n_rows":45,"n_cols":3,"rows_kept":45,"cut":false,"hidden":false,"merged":[[9,0,9,2],[8,0,8,2]]}
[null,"File Number:",{"$f":"EBNUMBER","v":0}]
[null,"Exhibit:"]
[null,"Tab:"]
[null,"Schedule:"]
[null,"Page:"]
[]
[null,"Date:"]
[]
["Appendix 2-AC"]
["Customer Engagement Activities Summary"]
[]
["Provide a list of customer engagement activities","Provide a list of customer needs and preferences identified through each engagement activity","Actions taken to respond to identified needs and preferences.  If no action was taken, explain why."]
[]
[]
[]
[]
[]
[]
[]
[]
[]
[]
[]
[]
[]
[]
[]
[]
[]
[]
[]
[]
[]
[]
[]
[]
[]
[]
[]
[]
[]
[]
[]
[]
["Note:  Use \"ALT-ENTER\" to go to the next line within a cell"]

{"sheet":"App.2-B_Acctg Instructions","index":9,"n_rows":56,"n_cols":8,"rows_kept":56,"cut":false,"hidden":false,"merged":[[21,0,21,8],[22,0,22,8],[28,0,30,10],[32,0,32,9],[38,0,38,10],[39,0,39,11],[0,0,0,10],[1,0,1,10],[5,0,5,10],[8,4,8,5],[20,0,20,9],[11,0,18,0],[59,0,59,10],[59,11,59,18],[60,0,60,10],[60,11,60,18],[61,11,61,18],[62,0,62,10],[62,11,62,18],[44,1,44,12],[45,1,45,12],[48,1,48,11],[49,0,50,12],[55,0,55,12],[58,0,58,10],[58,11,58,18],[66,0,66,10],[66,11,66,18],[67,0,67,10],[67,11,67,18],[68,0,68,10],[68,11,68,18],[63,0,63,10],[63,11,63,18],[64,0,64,10],[64,11,64,18],[65,0,65,10],[65,11,65,18],[72,0,72,10],[72,11,72,18],[73,0,73,10],[73,11,73,18],[74,0,74,10],[74,11,74,18],[69,0,69,10],[69,11,69,18],[70,0,70,10],[70,11,70,18],[71,0,71,10],[71,11,71,18],[78,11,78,18],[79,0,79,10],[79,11,79,18],[80,0,80,10],[80,11,80,18],[81,0,81,10],[81,11,81,18],[75,0,75,10],[75,11,75,18],[76,0,76,10],[76,11,76,18],[77,0,77,10],[77,11,77,18],[85,0,85,10],[85,11,85,18],[86,0,86,10],[86,11,86,18],[87,0,87,10],[87,11,87,18],[82,0,82,10],[82,11,82,18],[83,0,83,10],[83,11,83,18],[84,0,84,10],[84,11,84,18],[91,0,91,10],[91,11,91,18],[92,0,92,10],[92,11,92,18],[93,0,93,10],[93,11,93,18],[88,0,88,10],[88,11,88,18],[89,0,89,10],[89,11,89,18],[90,0,90,10],[90,11,90,18],[97,0,97,10],[97,11,97,18],[98,0,98,10],[98,11,98,18],[99,0,99,10],[99,11,99,18],[94,0,94,10],[94,11,94,18],[95,0,95,10],[95,11,95,18],[96,0,96,10],[96,11,96,18],[103,0,103,10],[103,11,103,18],[104,0,104,10],[104,11,104,18],[105,0,105,10],[105,11,105,18],[100,0,100,10],[100,11,100,18],[101,0,101,10],[101,11,101,18],[102,0,102,10],[102,11,102,18],[109,0,109,10],[109,11,109,18],[110,0,110,10],[110,11,110,18],[111,0,111,10],[111,11,111,18],[106,0,106,10],[106,11,106,18],[107,0,107,10],[107,11,107,18],[108,0,108,10],[108,11,108,18]]}
["General Instructions to MIFRS Appendices"]
["Types of Schedules to File"]
[]
["The purpose of this tab is to provide general instructions. The specific instructions to each appendix are listed in footnotes of each appendix."]
[]
["The typical applicant is expected to have made capitalization and depreciation policy changes under CGAAP as permitted by the OEB on January 1, 2012 or mandated by the OEB by January 1, 2013, and adopted IFRS for reporting purposes on January 1, 2015 (transition date January 1, 2014).  Most distributors filing for 2021 rates have rebased with these accounting changes reflected in a prior rebasing application.  If that is the case, information relating to pre-accounting policy changes is not generally required.  Most distributors may have rebased under MIFRS. If that is the case, information related to the accounting standard used prior to IFRS is not generally required. The information to be provided by applicants will depend on when the accounting policy changes were made and when they last rebased.  In general, applicants should provide the following information in the appendices: "]
[]
[]
[null,null,null,null,"Reflecting Accounting Policy Changes in Current Application",null,"Reflected Accounting Policy Changes in Prior Application3","Rebased under MIFRS in Prior Application3"]
[null,null,null,null,"Accounting Policy Changes in 2012 and Adopted IFRS in 2015","Accounting Policy Changes in 2013 and Adopted IFRS in 2015","Adopted IFRS in 2015","IFRS Since 2015"]
[null,2021,"Test",null,"MIFRS","MIFRS","MIFRS","MIFRS"]
["Information to be filed in 2019 CoS Application",2020,"Bridge",null,"MIFRS","MIFRS","MIFRS","MIFRS"]
[null,2019,"Bridge",null,"MIFRS","MIFRS","MIFRS","MIFRS"]
[null,2018,"Bridge",null,"MIFRS","MIFRS","MIFRS","MIFRS"]
[null,2017,"Historical",null,"MIFRS","MIFRS","MIFRS","MIFRS"]
[null,2016,"Historical",null,"MIFRS","MIFRS","MIFRS","MIFRS"]
[null,2015,"Historical",null," MIFRS and Revised CGAAP1"," MIFRS and Revised CGAAP1"," MIFRS and Revised CGAAP1","N/A"]
[null,2014,"Historical",null,"Revised CGAAP","CGAAP and Revised CGAAP2","N/A","N/A"]
[null,2013,"Historical",null,"CGAAP and Revised CGAAP2","N/A","N/A","N/A"]
[]
["1) For the transition year (2014), the applicant may file two appendices, one under Revised CGAAP and one under MIFRS, depending on the materiality of impacts. See the specific instructions under each appendix below for further details."]
["2) For applicants that are reflecting accounting policy changes for the first time in a rebasing application, the applicant must file two appendices in the year that the applicant implemented changes to its capitalization and depreciation policies (2012 or 2013), one before and one after the policy changes."]
["3) Applicants should provide CGAAP and Revised CGAAP schedules (i.e. as indicated in the first two columns of the above table) to support balances in Account 1576 if the account has yet to be disposed of."]
[]
[]
["Appendix 2-BA - Fixed Asset Schedule "]
[]
["Applicants are to provide Appendix 2-BA in accordance with the years and corresponding accounting standards noted in the above table to provide a year over year continuity in fixed assets."]
["If this is the first application where the applicant is rebasing under MIFRS, the applicant should file two appendices, one under Revised CGAAP and one under MIFRS for the transition year (2014), if the change between Revised CGAAP and MIFRS is material.  If the change from the accounting standards is not material, the applicant may choose to only provide one appendix under MIFRS.  However, the applicant must also indicate the fixed asset net book value balance under Revised CGAAP, the total dollar value of the change and explain why it is not material."]
[]
[]
[]
["The applicant must establish the continuity of historical cost for gross assets and accumulated depreciation by asset class by ensuring that the opening balance in the year agrees to the closing balance in the prior year."]
[]
[]
["Appendix 2-Cx - Depreciation and Amortization "]
[]
["Applicants are to provide Appendix 2-C in accordance with the years and corresponding accounting standards listed in the above table. "]
["Appendix 2-C is to be used under all of the scenarios presented in the table above. In the appendix, the applicant will need to indicate which scenario applies. The appendix is to be duplicated for each year and for each accounting standard required as per the above table."]
["Depreciation accounting policy changes were mandated by the OEB by January 1, 2013. In general, no further changes to an applicant's depreciation policy (i.e.  assets' service lives) are expected after the OEB mandated changes by January 1, 2013, unless a change is determined to be necessary in accordance with the depreciation review required under IFRS. If the applicant has made any changes to its depreciation policy subsequent to the OEB mandated changes, for the year of the change, applicants must quantify the change in depreciation. If there are significant changes to multiple asset classes, the applicant must complete Appendix 2-C before and after the change. Applicants must also  explain the nature of the change, the reason for the change, quantify the impact of the change."]
[]
["Appendix 2-E - Account 1575, IFRS-CGAAP Transitional PP&E Amounts (2-EA), Account 1576, Accounting Changes Under CGAAP (2-EB, 2-EC) CONTACT OEB STAFF IF TAB REQUIRED"]
[]
["1) For an applicant that has a balance in Account 1576 to dispose:"]
["·       ","If an applicant changed capitalization and depreciation policies effective January 1, 2012, the applicant must complete Appendix 2-EB "]
["·       ","If an applicant changed capitalization and depreciation policies effective January 1, 2013, the applicant must complete Appendix 2-EC"]
[]
["2) For an applicant that has a balance in Account 1575 to dispose:"]
["·       ","The applicant must complete 2-EA"]
[" If the applicant did not make any further PP&E accounting policy changes beyond the capitalization and depreciation policy changes as mandated by the OEB by January 1, 2013 (i.e. no further changes made on transition to IFRS), the applicant must indicate this and does not need to complete Appendix 2-EA."]
[]
[]
[]
["Appendix 2-Y - Summary of Impacts to Revenue Requirement from Transition to MIFRS CONTACT OEB STAFF IF TAB REQUIRED"]
[]
["Applicants must complete Appendix 2-Y if this is the first rebasing application under MIFRS. An applicant must provide a summary of the dollar impacts of MIFRS to each component of the revenue requirement (e.g. rate base, operating costs, etc.), including the overall impact on the proposed revenue requirement.  Accordingly,  the applicant must identify financial differences and resulting revenue requirement impacts arising from the adoption of MIFRS as compared to CGAAP.  If the applicant is reflecting the changes in capitalization and depreciation policies for the first time in a rebasing application as well, then a comparison between MIFRS and CGAAP before the change in accounting policies should be completed.  If the applicant changed capitalization and depreciation policies and reflected these changes in a prior rebasing application, then a comparison between MIFRS and CGAAP after the change in accounting policies should be completed.  "]

{"sheet":"App.2-BA_Fixed Asset Cont","index":10,"n_rows":89,"n_cols":13,"rows_kept":89,"cut":false,"hidden":false,"merged":[[84,1,86,12],[75,1,76,12],[78,1,78,12],[8,0,8,12],[9,0,9,12],[14,3,14,6],[61,2,61,8],[62,2,62,8],[72,1,73,12],[82,1,82,12]]}
[null,null,null,null,null,null,null,null,null,null,null,"File Number:",{"$f":"EBNUMBER","v":0}]
[null,null,null,null,null,null,null,null,null,null,null,"Exhibit:"]
[null,null,null,null,null,null,null,null,null,null,null,"Tab:"]
[null,null,null,null,null,null,null,null,null,null,null,"Schedule:"]
[null,null,null,null,null,null,null,null,null,null,null,"Page:"]
[]
[null,null,null,null,null,null,null,null,null,null,null,"Date:"]
[]
["Appendix 2-BA"]
["Fixed Asset Continuity Schedule 1 "]
[]
[null,null,null,null,"Accounting Standard","CGAAP"]
[null,null,null,null,"Year "]
[]
[null,null,null,"Cost",null,null,null,null,null,"Accumulated Depreciation"]
["CCA Class 2","OEB Account 3","Description 3","Opening Balance","Additions 4","Disposals 6","Closing Balance",null,"Opening Balance","Additions","Disposals 6","Closing Balance","Net Book Value"]
[null,1609,"Capital Contributions Paid",null,null,null,{"$f":"D17+E17+F17","v":0},null,null,null,null,{"$f":"I17+J17+K17","v":0},{"$f":"G17+L17","v":0}]
[12,1611,"Computer Software (Formally known as Account 1925)",null,null,null,{"$f":"D18+E18+F18","v":0},null,null,null,null,{"$f":"I18+J18+K18","v":0},{"$f":"G18+L18","v":0}]
["CEC",1612,"Land Rights (Formally known as Account 1906)",null,null,null,{"$f":"D19+E19+F19","v":0},null,null,null,null,{"$f":"I19+J19+K19","v":0},{"$f":"G19+L19","v":0}]
["N/A",1805,"Land",null,null,null,{"$f":"D20+E20+F20","v":0},null,null,null,null,{"$f":"I20+J20+K20","v":0},{"$f":"G20+L20","v":0}]
[47,1808,"Buildings",null,null,null,{"$f":"D21+E21+F21","v":0},null,null,null,null,{"$f":"I21+J21+K21","v":0},{"$f":"G21+L21","v":0}]
[13,1810,"Leasehold Improvements",null,null,null,0,null,null,null,null,0,0]
[47,1815,"Transformer Station Equipment >50 kV",null,null,null,0,null,null,null,null,0,0]
[47,1820,"Distribution Station Equipment <50 kV",null,null,null,0,null,null,null,null,0,0]
[47,1825,"Storage Battery Equipment",null,null,null,0,null,null,null,null,0,0]
[47,1830,"Poles, Towers & Fixtures",null,null,null,0,null,null,null,null,0,0]
[47,1835,"Overhead Conductors & Devices",null,null,null,0,null,null,null,null,0,0]
[47,1840,"Underground Conduit",null,null,null,0,null,null,null,null,0,0]
[47,1845,"Underground Conductors & Devices",null,null,null,0,null,null,null,null,0,0]
[47,1850,"Line Transformers",null,null,null,0,null,null,null,null,0,0]
[47,1855,"Services (Overhead & Underground)",null,null,null,0,null,null,null,null,0,0]
[47,1860,"Meters",null,null,null,0,null,null,null,null,0,0]
[47,1860,"Meters (Smart Meters)",null,null,null,0,null,null,null,null,0,0]
["N/A",1905,"Land",null,null,null,0,null,null,null,null,0,0]
[47,1908,"Buildings & Fixtures",null,null,null,0,null,null,null,null,0,0]
[13,1910,"Leasehold Improvements",null,null,null,0,null,null,null,null,0,0]
[8,1915,"Office Furniture & Equipment (10 years)",null,null,null,0,null,null,null,null,0,0]
[8,1915,"Office Furniture & Equipment (5 years)",null,null,null,0,null,null,null,null,0,0]
[10,1920,"Computer Equipment - Hardware",null,null,null,0,null,null,null,null,0,0]
[45,1920,"Computer Equip.-Hardware(Post Mar. 22/04)",null,null,null,0,null,null,null,null,0,0]
[50,1920,"Computer Equip.-Hardware(Post Mar. 19/07)",null,null,null,0,null,null,null,null,0,0]
[10,1930,"Transportation Equipment",null,null,null,0,null,null,null,null,0,0]
[8,1935,"Stores Equipment",null,null,null,0,null,null,null,null,0,0]
[8,1940,"Tools, Shop & Garage Equipment",null,null,null,0,null,null,null,null,0,0]
[8,1945,"Measurement & Testing Equipment",null,null,null,0,null,null,null,null,0,0]
[8,1950,"Power Operated Equipment",null,null,null,0,null,null,null,null,0,0]
[8,1955,"Communications Equipment",null,null,null,0,null,null,null,null,0,0]
[8,1955,"Communication Equipment (Smart Meters)",null,null,null,0,null,null,null,null,0,0]
[8,1960,"Miscellaneous Equipment ",null,null,null,0,null,null,null,null,0,0]
[47,1970,"Load Management Controls Customer Premises",null,null,null,0,null,null,null,null,0,0]
[47,1975,"Load Management Controls Utility Premises",null,null,null,0,null,null,null,null,0,0]
[47,1980,"System Supervisor Equipment",null,null,null,0,null,null,null,null,0,0]
[47,1985,"Miscellaneous Fixed Assets",null,null,null,0,null,null,null,null,0,0]
[47,1990,"Other Tangible Property",null,null,null,0,null,null,null,null,0,0]
[47,1995,"Contributions & Grants",null,null,null,0,null,null,null,null,0,0]
[47,2440,"Deferred Revenue5",null,null,null,0,null,null,null,null,{"$f":"I56+J56+K56","v":0},{"$f":"G56+L56","v":0}]
[null,2005,"Property Under Finance Lease7",null,null,null,0,null,null,null,null,0,0]
[null,null,"Sub-Total",{"$f":"SUM(D17:D57)","v":0},{"$f":"SUM(E17:E57)","v":0},{"$f":"SUM(F17:F57)","v":0},{"$f":"SUM(G17:G57)","v":0},null,{"$f":"SUM(I17:I57)","v":0},{"$f":"SUM(J17:J57)","v":0},{"$f":"SUM(K17:K57)","v":0},{"$f":"SUM(L17:L57)","v":0},{"$f":"SUM(M17:M57)","v":0}]
[null,null,"Less Socialized Renewable Energy Generation Investments (input as negative)",null,null,null,{"$f":"D59+E59+F59","v":0},null,null,null,null,{"$f":"I59+J59+K59","v":0},{"$f":"G59+L59","v":0}]
[null,null,"Less Other Non Rate-Regulated Utility Assets (input as negative)",null,null,null,0,null,null,null,null,{"$f":"I60+J60+K60","v":0},0]
[null,null,"Total PP&E",{"$f":"SUM(D58:D60)","v":0},{"$f":"SUM(E58:E60)","v":0},{"$f":"SUM(F58:F60)","v":0},{"$f":"SUM(G58:G60)","v":0},null,{"$f":"SUM(I58:I60)","v":0},{"$f":"SUM(J58:J60)","v":0},{"$f":"SUM(K58:K60)","v":0},{"$f":"SUM(L58:L60)","v":0},{"$f":"SUM(M58:M60)","v":0}]
[null,null,"Depreciation Expense adj. from gain or loss on the retirement of assets (pool of like assets), if applicable6"]
[null,null,"Total",null,null,null,null,null,null,{"$f":"J61+J62","v":0}]
[]
[null,null,null,null,null,null,null,null,"Less: Fully Allocated Depreciation"]
[10,null,"Transportation",null,null,null,null,null,"Transportation"]
[8,null,"Stores Equipment",null,null,null,null,null,"Stores Equipment"]
[47,null,"Deferred Revenue",null,null,null,null,null,"Deferred Revenue"]
[null,null,null,null,null,null,null,null,"Net Depreciation",null,{"$f":"J63-K66-K67-K68","v":0}]
[]
["Notes:"]
[]
[1,"Tables in the format outlined above covering all fixed asset accounts should be submitted for the Test Year, Bridge Year and all relevant historical years.  At a minimum , the applicant must provide data for the earlier of: 1) all historical years back to its last rebasing; or 2) at least three years of historical actuals, in addition to Bridge Year and Test Year forecasts."]
[]
[]
[2,"The \"CCA Class\" for fixed assets should generally agree with the CCA Class used for tax purposes in Tax Returns. Fixed Assets sub-components may be used where the underlying asset components are classified under multiple CCA Classes for tax purposes. If an applicant uses any different classes from those shown in the table, an explanation should be provided. (also see note 3)."]
[]
[]
[3,"The table may need to be customized for a utility's asset categories or for any new asset accounts announced or authorized by the OEB."]
[]
[4,"The additions in column (E) must not include construction work in progress (CWIP)."]
[]
[5,"Effective on the date of IFRS adoption, customer contributions will no longer be recorded in Account 1995 Contributions & Grants, but will be recorded in Account 2440, Deferred Revenues.\nAmortization of deferred revenue will be removed from the depreciation expense shown on this fixed asset continuity schedule as it should be included as income in Appendix 2-H Other Revenues."]
[]
[6,"The applicant must ensure that all asset disposals have been clearly identified in the Chapter 2 Appendices for all historic, bridge and test years.  Where a distributor for general financial reporting purposes under IFRS has accounted for the amount of gain or loss on the retirement of assets in a pool of like assets as a charge or credit to income, for reporting and rate application filings, the distributor shall reclassify such gains and losses as depreciation expense, and disclose the amount separately."]
[]
[]
[]
[7,"This account includes the amount recorded under finance leases for plant leased from others and used by the utility in its utility operations."]

{"sheet":"Appendix 2-BB Service Life  ","index":11,"n_rows":107,"n_cols":17,"rows_kept":107,"cut":false,"hidden":false,"merged":[[100,2,100,4],[100,6,100,7],[103,0,103,7],[97,2,97,4],[97,6,97,7],[98,2,98,4],[98,6,98,7],[99,2,99,4],[99,6,99,7],[94,2,94,4],[94,6,94,7],[95,2,95,4],[95,6,95,7],[96,2,96,4],[96,6,96,7],[92,1,93,1],[92,2,93,2],[92,3,92,4],[92,6,92,7],[93,3,93,4],[93,6,93,7],[88,1,91,1],[88,2,91,2],[88,3,88,4],[88,6,88,7],[89,3,89,4],[89,6,89,7],[90,3,90,4],[90,6,90,7],[91,3,91,4],[91,6,91,7],[86,1,87,1],[86,2,87,2],[86,3,86,4],[86,6,86,7],[87,3,87,4],[87,6,87,7],[82,1,85,1],[82,2,85,2],[82,3,82,4],[82,6,82,7],[83,3,83,4],[83,6,83,7],[84,3,84,4],[84,6,84,7],[85,3,85,4],[85,6,85,7],[80,2,80,4],[80,6,80,7],[81,2,81,4],[81,5,81,7],[74,13,74,14],[74,15,74,16],[75,2,75,4],[76,2,76,4],[76,6,76,7],[74,10,75,10],[74,11,74,12],[77,6,77,7],[78,3,78,4],[72,0,72,7],[74,2,74,4],[74,5,75,7],[74,9,75,9],[78,6,78,7],[79,3,79,4],[79,6,79,7],[69,2,69,4],[60,2,60,4],[61,2,61,4],[62,1,63,1],[62,2,63,2],[62,3,62,4],[63,3,63,4],[77,1,79,1],[77,2,79,2],[77,3,77,4],[59,2,59,4],[49,2,49,4],[50,0,68,0],[50,2,50,4],[51,2,51,4],[52,2,52,4],[53,2,53,4],[54,2,54,4],[55,2,55,4],[64,2,64,4],[65,2,65,4],[66,2,66,4],[67,2,67,4],[68,2,68,4],[33,0,49,0],[33,1,35,1],[33,2,35,2],[33,3,33,4],[34,3,34,4],[43,2,43,4],[44,2,44,4],[45,2,45,4],[46,2,46,4],[47,2,47,4],[48,2,48,4],[56,2,56,4],[57,1,58,1],[57,2,58,2],[57,3,57,4],[58,3,58,4],[38,1,40,1],[38,2,40,2],[38,3,38,4],[39,3,39,4],[40,3,40,4],[41,1,42,1],[41,3,41,4],[42,3,42,4],[19,1,21,1],[19,2,21,2],[19,3,19,4],[20,3,21,3],[22,1,24,1],[22,2,24,2],[22,3,22,4],[23,3,24,3],[32,2,32,4],[16,2,18,2],[16,3,16,4],[17,3,18,3],[25,2,25,4],[26,2,26,4],[27,2,27,4],[28,2,28,4],[29,2,29,4],[30,2,30,4],[106,1,106,2],[0,15,0,16],[1,15,1,16],[2,15,2,16],[3,15,3,16],[4,15,4,16],[6,15,6,16],[14,11,14,12],[14,13,14,14],[31,2,31,4],[14,2,14,4],[14,5,14,7],[14,9,15,9],[14,10,15,10],[8,0,8,16],[9,0,9,16],[10,0,10,16],[14,15,14,16],[15,2,15,4],[35,3,35,4],[36,2,36,4],[37,2,37,4],[16,0,32,0],[16,1,18,1]]}
[null,null,null,null,null,null,null,null,null,null,null,null,null,"File Number:",null,{"$f":"'LDC Info'!E16","v":0}]
[null,null,null,null,null,null,null,null,null,null,null,null,null,"Exhibit:"]
[null,null,null,null,null,null,null,null,null,null,null,null,null,"Tab:"]
[null,null,null,null,null,null,null,null,null,null,null,null,null,"Schedule:"]
[null,null,null,null,null,null,null,null,null,null,null,null,null,"Page:"]
[]
[null,null,null,null,null,null,null,null,null,null,null,null,null,"Date:"]
[]
["Appendix 2-BB"]
["Service Life Comparison"]
["Table F-1 from Kinetrics Report1"]
[]
[]
[]
[null,null,"Asset Details",null,null,"Useful Life",null,null,null,"USoA Account Number","USoA Account Description","Current",null,"Proposed",null,"Outside Range of Min, Max TUL?"]
["Parent*","#","Category| Component | Type",null,null,"MIN UL","TUL","MAX UL",null,null,null,"Years","Rate","Years","Rate","Below Min TUL","Above Max TUL"]
["OH",1,"Fully Dressed Wood Poles","Overall",null,35,45,75,null,null,null,null,{"$f":"IF(ISERROR(1/L17), \"\", 1/L17)","v":""},null,{"$f":"IF(ISERROR(1/N17), \"\", 1/N17)","v":""},{"$f":"IF(ISBLANK(N17),\"\",IF(N17<F17,\"Yes\",\"No\"))","v":""},{"$f":"IF(ISBLANK(N17),\"\",IF(N17>H17,\"Yes\",\"No\"))","v":""}]
[null,null,null,"Cross Arm","Wood",20,40,55,null,null,null,null,{"$f":"IF(ISERROR(1/L18), \"\", 1/L18)","v":""},null,{"$f":"IF(ISERROR(1/N18), \"\", 1/N18)","v":""},{"$f":"IF(ISBLANK(N18),\"\",IF(N18<F18,\"Yes\",\"No\"))","v":""},{"$f":"IF(ISBLANK(N18),\"\",IF(N18>H18,\"Yes\",\"No\"))","v":""}]
[null,null,null,null,"Steel",30,70,95,null,null,null,null,"",null,"","",""]
[null,2,"Fully Dressed Concrete Poles","Overall",null,50,60,80,null,null,null,null,"",null,"","",""]
[null,null,null,"Cross Arm","Wood",20,40,55,null,null,null,null,"",null,"","",""]
[null,null,null,null,"Steel",30,70,95,null,null,null,null,"",null,"","",""]
[null,3,"Fully Dressed Steel Poles","Overall",null,60,60,80,null,null,null,null,"",null,"","",""]
[null,null,null,"Cross Arm","Wood",20,40,55,null,null,null,null,"",null,"","",""]
[null,null,null,null,"Steel",30,70,95,null,null,null,null,"",null,"","",""]
[null,4,"OH Line Switch",null,null,30,45,55,null,null,null,null,"",null,"","",""]
[null,5,"OH Line Switch Motor",null,null,15,25,25,null,null,null,null,"",null,"","",""]
[null,6,"OH Line Switch RTU",null,null,15,20,20,null,null,null,null,"",null,"","",""]
[null,7,"OH Integral Switches",null,null,35,45,60,null,null,null,null,"",null,"","",""]
[null,8,"OH Conductors",null,null,50,60,75,null,null,null,null,"",null,"","",""]
[null,9,"OH Transformers & Voltage Regulators",null,null,30,40,60,null,null,null,null,"",null,"","",""]
[null,10,"OH Shunt Capacitor Banks",null,null,25,30,40,null,null,null,null,"",null,"","",""]
[null,11,"Reclosers",null,null,25,40,55,null,null,null,null,"",null,"","",""]
["TS & MS",12,"Power Transformers","Overall",null,30,45,60,null,null,null,null,"",null,"","",""]
[null,null,null,"Bushing",null,10,20,30,null,null,null,null,"",null,"","",""]
[null,null,null,"Tap Changer",null,20,30,60,null,null,null,null,"",null,"","",""]
[null,13,"Station Service Transformer",null,null,30,45,55,null,null,null,null,"",null,"","",""]
[null,14,"Station Grounding Transformer",null,null,30,40,40,null,null,null,null,"",null,"","",""]
[null,15,"Station DC System","Overall",null,10,20,30,null,null,null,null,"",null,"","",""]
[null,null,null,"Battery Bank",null,10,15,15,null,null,null,null,"",null,"","",""]
[null,null,null,"Charger",null,20,20,30,null,null,null,null,"",null,"","",""]
[null,16,"Station Metal Clad Switchgear","Overall",null,30,40,60,null,null,null,null,"",null,"","",""]
[null,null,null,"Removable Breaker",null,25,40,60,null,null,null,null,"",null,"","",""]
[null,17,"Station Independent Breakers",null,null,35,45,65,null,null,null,null,"",null,"","",""]
[null,18,"Station Switch",null,null,30,50,60,null,null,null,null,"",null,"","",""]
[null,19,"Electromechanical Relays",null,null,25,35,50,null,null,null,null,"",null,"","",""]
[null,20,"Solid State Relays",null,null,10,30,45,null,null,null,null,"",null,"","",""]
[null,21,"Digital & Numeric Relays",null,null,15,20,20,null,null,null,null,"",null,"","",""]
[null,22,"Rigid Busbars",null,null,30,55,60,null,null,null,null,"",null,"","",""]
[null,23,"Steel Structure",null,null,35,50,90,null,null,null,null,"",null,"","",""]
["UG",24,"Primary Paper Insulated Lead Covered (PILC) Cables",null,null,60,65,75,null,null,null,null,"",null,"","",""]
[null,25,"Primary Ethylene-Propylene Rubber (EPR) Cables",null,null,20,25,25,null,null,null,null,"",null,"","",""]
[null,26,"Primary Non-Tree Retardant (TR) Cross Linked \nPolyethylene (XLPE) Cables Direct Buried",null,null,20,25,30,null,null,null,null,"",null,"","",""]
[null,27,"Primary Non-TR XLPE Cables in Duct",null,null,20,25,30,null,null,null,null,"",null,"","",""]
[null,30,"Secondary PILC Cables",null,null,70,75,80,null,null,null,null,"",null,"","",""]
[null,31,"Secondary Cables Direct Buried",null,null,25,35,40,null,null,null,null,"",null,"","",""]
[null,32,"Secondary Cables in Duct",null,null,35,40,60,null,null,null,null,"",null,"","",""]
[null,33,"Network Tranformers","Overall",null,20,35,50,null,null,null,null,"",null,"","",""]
[null,null,null,"Protector",null,20,35,40,null,null,null,null,"",null,"","",""]
[null,34,"Pad-Mounted Transformers",null,null,25,40,45,null,null,null,null,"",null,"","",""]
[null,35,"Submersible/Vault Transformers",null,null,25,35,45,null,null,null,null,"",null,"","",""]
[null,36,"UG Foundation",null,null,35,55,70,null,null,null,null,"",null,"","",""]
[null,37,"UG Vaults","Overall",null,40,60,80,null,null,null,null,"",null,"","",""]
[null,null,null,"Roof",null,20,30,45,null,null,null,null,"",null,"","",""]
[null,38,"UG Vault Switches",null,null,20,35,50,null,null,null,null,"",null,"","",""]
[null,39,"Pad-Mounted Switchgear",null,null,20,30,45,null,null,null,null,"",null,"","",""]
[null,40,"Ducts",null,null,30,50,85,null,null,null,null,"",null,"","",""]
[null,41,"Concrete Encased Duct Banks",null,null,35,55,80,null,null,null,null,"",null,"","",""]
[null,42,"Cable Chambers",null,null,50,60,80,null,null,null,null,"",null,"","",""]
["S",43,"Remote SCADA",null,null,15,20,30,null,null,null,null,"",null,"","",""]
[]
[]
["Table F-2 from Kinetrics Report1"]
[]
[null,null,"Asset Details",null,null,"Useful Life Range",null,null,null,"USoA Account Number","USoA Account Description","Current",null,"Proposed",null,"Outside Range of Min, Max TUL?"]
[null,"#","Category| Component | Type",null,null,null,null,null,null,null,null,"Years","Rate","Years","Rate","Below Min Range","Above Max Range"]
[null,1,"Office Equipment",null,null,5,15,null,null,null,null,null,{"$f":"IF(ISERROR(1/L77), \"\", 1/L77)","v":""},null,{"$f":"IF(ISERROR(1/N77), \"\", 1/N77)","v":""},{"$f":"IF(ISBLANK(N77),\"\",IF(N77<F77,\"Yes\",\"No\"))","v":""},{"$f":"IF(ISBLANK(N77),\"\",IF(N77>G77,\"Yes\",\"No\"))","v":""}]
[null,2,"Vehicles","Trucks & Buckets",null,5,15,null,null,null,null,null,{"$f":"IF(ISERROR(1/L78), \"\", 1/L78)","v":""},null,{"$f":"IF(ISERROR(1/N78), \"\", 1/N78)","v":""},{"$f":"IF(ISBLANK(N78),\"\",IF(N78<F78,\"Yes\",\"No\"))","v":""},{"$f":"IF(ISBLANK(N78),\"\",IF(N78>G78,\"Yes\",\"No\"))","v":""}]
[null,null,null,"Trailers",null,5,20,null,null,null,null,null,"",null,"","",""]
[null,null,null,"Vans",null,5,10,null,null,null,null,null,"",null,"","",""]
[null,3,"Administrative Buildings",null,null,50,75,null,null,null,null,null,"",null,"","",""]
[null,4,"Leasehold Improvements",null,null,"Lease dependent",null,null,null,null,null,null,"",null,"",{"$f":"IF(ISBLANK(N82),\"\",IF(N82<F82,\"Yes\",\"No\"))","v":""},{"$f":"IF(ISBLANK(N82),\"\",IF(N82>G82,\"Yes\",\"No\"))","v":""}]
[null,5,"Station Buildings","Station Buildings",null,50,75,null,null,null,null,null,"",null,"","",""]
[null,null,null,"Parking",null,25,30,null,null,null,null,null,"",null,"","",""]
[null,null,null,"Fence",null,25,60,null,null,null,null,null,"",null,"","",""]
[null,null,null,"Roof",null,20,30,null,null,null,null,null,"",null,"","",""]
[null,6,"Computer Equipment","Hardware",null,3,5,null,null,null,null,null,"",null,"","",""]
[null,null,null,"Software",null,2,5,null,null,null,null,null,"",null,"","",""]
[null,7,"Equipment","Power Operated",null,5,10,null,null,null,null,null,"",null,"","",""]
[null,null,null,"Stores",null,5,10,null,null,null,null,null,"",null,"","",""]
[null,null,null,"Tools, Shop, Garage Equipment",null,5,10,null,null,null,null,null,"",null,"","",""]
[null,null,null,"Measurement & Testing Equipment",null,5,10,null,null,null,null,null,"",null,"","",""]
[null,8,"Communication","Towers",null,60,70,null,null,null,null,null,"",null,"","",""]
[null,null,null,"Wireless",null,2,10,null,null,null,null,null,"",null,"","",""]
[null,9,"Residential Energy Meters",null,null,25,35,null,null,null,null,null,"",null,"","",""]
[null,10,"Industrial/Commercial Energy Meters",null,null,25,35,null,null,null,null,null,"",null,"","",""]
[null,11,"Wholesale Energy Meters",null,null,15,30,null,null,null,null,null,"",null,"","",""]
[null,12,"Current & Potential Transformer (CT & PT)",null,null,35,50,null,null,null,null,null,"",null,"","",""]
[null,13,"Smart Meters",null,null,5,15,null,null,null,null,null,"",null,"","",""]
[null,14,"Repeaters - Smart Metering",null,null,10,15,null,null,null,null,null,"",null,"","",""]
[null,15,"Data Collectors - Smart Metering",null,null,15,20,null,null,null,null,null,"",null,"","",""]
[]
[]
["* TS & MS = Transformer and Municipal Stations UG = Underground Systems S = Monitoring and Control Systems"]
[]
["Note 1:","Tables F-1 and F-2 above are to be used as a reference in order to complete columns J, K, L and N."]
[null,"See pages 17-19 of Kinetrics Report"]

{"sheet":"App.2-C_DepExp","index":12,"n_rows":77,"n_cols":25,"rows_kept":77,"cut":false,"hidden":false,"merged":[[14,0,14,1],[14,2,14,16],[8,0,8,18],[9,0,9,18],[10,0,10,18],[13,0,13,1],[13,2,13,16],[15,0,15,1],[15,2,15,16],[16,0,16,1],[16,2,16,16],[19,2,19,8],[19,9,19,12],[19,13,19,16],[17,0,17,1],[17,2,17,16],[72,1,72,18],[74,1,74,18],[20,0,21,0],[20,1,21,1],[65,1,65,18],[69,1,69,18],[70,1,70,18],[71,1,71,18]]}
[]
[]
[]
[]
[]
[]
[]
[]
["Appendix 2-C",null,null,null,null,null,null,null,null,null,null,null,null,null,null,null,null,null,null,null,null,null,null,null,"CGAAP"]
["Depreciation and Amortization Expense",null,null,null,null,null,null,null,null,null,null,null,null,null,null,null,null,null,null,null,null,null,null,null,"Revised CGAAP"]
[null,null,null,null,null,null,null,null,null,null,null,null,null,null,null,null,null,null,null,null,null,null,null,null,"MIFRS"]
["This appendix is to be completed in conjunction with the accounting instructions in Appendix 2-B"]
[]
["Scenario that applies",null,"Applicable Years and Accounting Standard",null,null,null,null,null,null,null,null,null,null,null,null,null,null,"Year Reflected in Schedule Below","Accounting Standard Reflected in Schedule Below",null,null,null,null,null,2012]
["Rebasing for the first time with depreciation policy changes made in 2012.",null,{"$f":"\"This appendix must be duplicated and completed for the years 2012 to \" & TestYear & \". The appendix for 2012 is to be completed under CGAAP (prior to changes in depreciation policies).\" &\" The appendix for 2012 to 2014 must be completed under Revised CGAAP (after changes in depreciation policies). The appendix for 2014 to \" & TestYear & \" is to be completed under MIFRS (2014 if changes to MIFRS are material).\"","v":"This appendix must be duplicated and completed for the years 2012 to 2021. The appendix for 2012 is to be completed under CGAAP (prior to changes in depreciation policies). The appendix for 2012 to 2014 must be completed under Revised CGAAP (after changes in depreciation policies). The appendix for 2014 to 2021 is to be completed under MIFRS (2014 if changes to MIFRS are material)."},null,null,null,null,null,null,null,null,null,null,null,null,null,null,null,null,null,null,null,null,null,2013]
["Rebasing for the first time with depreciation policy changes made in 2013.",null,{"$f":"\"This appendix must be duplicated and completed for the years 2013 to \" & TestYear & \". The appendix for 2013 is to be completed under CGAAP (prior to changes in depreciation policies).\"&\" The appendix for 2013 to 2014 must be completed under Revised CGAAP (after changes in depreciation policies). The appendix for 2014 to \" & TestYear & \" is to be completed under MIFRS (2014 if changes to MIFRS are material).\"","v":"This appendix must be duplicated and completed for the years 2013 to 2021. The appendix for 2013 is to be completed under CGAAP (prior to changes in depreciation policies). The appendix for 2013 to 2014 must be completed under Revised CGAAP (after changes in depreciation policies). The appendix for 2014 to 2021 is to be completed under MIFRS (2014 if changes to MIFRS are material)."},null,null,null,null,null,null,null,null,null,null,null,null,null,null,null,null,null,null,null,null,null,2014]
["Already rebased with depreciation policy changes in a prior rate application and rebasing MIFRS for the first time.",null,"This appendix must be completed for 2014 to the test year. The appendix for 2014 is to be completed under Revised CGAAP (after changes in depreciation policies). The appendix for 2014 to the test year is to be completed under MIFRS (2014 if changes to MIFRS are material).",null,null,null,null,null,null,null,null,null,null,null,null,null,null,null,null,null,null,null,null,null,2015]
["Already rebased under MIFRS in a prior rate application",null,{"$f":"\"This appendix must be completed under MIFRS for each year for the earlier of: 1) all historical years back to its last rebasing; or 2) at least three years of historical actuals, in addition to Bridge Year and Test Year forecasts.\"","v":"This appendix must be completed under MIFRS for each year for the earlier of: 1) all historical years back to its last rebasing; or 2) at least three years of historical actuals, in addition to Bridge Year and Test Year forecasts."},null,null,null,null,null,null,null,null,null,null,null,null,null,null,null,null,null,null,null,null,null,2016]
[null,null,null,null,null,null,null,null,null,null,null,null,null,null,null,null,null,null,null,null,null,null,null,null,2017]
[null,null,"Book Values",null,null,null,null,null,null,"Service Lives",null,null,null,"Depreciation Expense",null,null,null,null,null,null,null,null,null,null,2018]
["Account","Description","Opening Net  Book Value of Existing Assets as at Date of Policy Change (Jan. 1) 1","Less Fully Depreciated 7","Net Amount of Existing Assets Before Policy Change to be Depreciated ","Opening Gross Book Value of Assets Acquired After Policy Change 2","Less Fully Depreciated 8","Net Amount of Assets Acquired After Policy Change to be Depreciated ","Current Year Additions","Average Remaining Life of Assets Existing Before Policy Change 3","Depreciation Rate Assets Acquired After Policy Change","Life of Assets Acquired After Policy Change 4","Depreciation Rate on New Additions","Depreciation Expense on Assets Existing Before Policy Change","Depreciation Expense on Assets Acquired After Policy Change","Depreciation Expense on Current Year Additions 5","Total Current Year Depreciation Expense ","Depreciation Expense per Appendix 2-BA Fixed Assets, Column J \n ","Variance 6"]
[null,null,"a","b","c = a-b","d","e","f = d- e","g","h","i = 1/h","j","k = 1/j","l = c/h","m = f/j","n = g*0.5/j","o = l+m+n","p","q = p-o"]
[1611,"Computer Software (Formally known as Account 1925)",null,null,{"$f":"C23-D23","v":0},null,null,{"$f":"F23-G23","v":0},null,null,{"$f":"IF(J23=0,0,1/J23)","v":0},null,{"$f":"IF(L23=0,0,1/L23)","v":0},{"$f":"IF(J23=0,0,+E23/J23)","v":0},{"$f":"IF(L23=0,0,+H23/L23)","v":0},{"$f":"IF(L23=0,0,+(I23*0.5)/L23)","v":0},{"$f":"IF(ISERROR(+N23+O23+P23), 0, +N23+O23+P23)","v":0},null,{"$f":"IF(ISERROR(+R23-Q23), 0, +R23-Q23)","v":0}]
[1612,"Land Rights (Formally known as Account 1906)",null,null,{"$f":"C24-D24","v":0},null,null,{"$f":"F24-G24","v":0},null,null,{"$f":"IF(J24=0,0,1/J24)","v":0},null,{"$f":"IF(L24=0,0,1/L24)","v":0},{"$f":"IF(J24=0,0,+E24/J24)","v":0},{"$f":"IF(L24=0,0,+H24/L24)","v":0},{"$f":"IF(L24=0,0,+(I24*0.5)/L24)","v":0},{"$f":"IF(ISERROR(+N24+O24+P24), 0, +N24+O24+P24)","v":0},null,{"$f":"IF(ISERROR(+R24-Q24), 0, +R24-Q24)","v":0}]
[1805,"Land",null,null,0,null,null,0,null,null,0,null,0,0,{"$f":"IF(L25=0,0,+H25/L25)","v":0},0,0,null,0]
[1808,"Buildings",null,null,0,null,null,0,null,null,0,null,0,0,0,0,0,null,0]
[1810,"Leasehold Improvements",null,null,0,null,null,0,null,null,0,null,0,0,0,0,0,null,0]
[1815,"Transformer Station Equipment >50 kV",null,null,0,null,null,0,null,null,0,null,0,0,0,0,0,null,0]
[1820,"Distribution Station Equipment <50 kV",null,null,0,null,null,0,null,null,0,null,0,0,0,0,0,null,0]
[1825,"Storage Battery Equipment",null,null,0,null,null,0,null,null,0,null,0,0,0,0,0,null,0]
[1830,"Poles, Towers & Fixtures",null,null,0,null,null,0,null,null,0,null,0,0,0,0,0,null,0]
[1835,"Overhead Conductors & Devices",null,null,0,null,null,0,null,null,0,null,0,0,0,0,0,null,0]
[1840,"Underground Conduit",null,null,0,null,null,0,null,null,0,null,0,0,0,0,0,null,0]
[1845,"Underground Conductors & Devices",null,null,0,null,null,0,null,null,0,null,0,0,0,0,0,null,0]
[1850,"Line Transformers",null,null,0,null,null,0,null,null,0,null,0,0,0,0,0,null,0]
[1855,"Services (Overhead & Underground)",null,null,0,null,null,0,null,null,0,null,0,0,0,0,0,null,0]
[1860,"Meters",null,null,0,null,null,0,null,null,0,null,0,0,0,0,0,null,0]
[1860,"Meters (Smart Meters)",null,null,0,null,null,0,null,null,0,null,0,0,0,0,0,null,0]
[1905,"Land",null,null,0,null,null,0,null,null,0,null,0,0,0,0,0,null,0]
[1908,"Buildings & Fixtures",null,null,0,null,null,0,null,null,0,null,0,0,0,0,0,null,0]
[1910,"Leasehold Improvements",null,null,0,null,null,0,null,null,0,null,0,0,0,0,0,null,0]
[1915,"Office Furniture & Equipment (10 years)",null,null,0,null,null,0,null,null,0,null,0,0,0,0,0,null,0]
[1915,"Office Furniture & Equipment (5 years)",null,null,0,null,null,0,null,null,0,null,0,0,0,0,0,null,0]
[1920,"Computer Equipment - Hardware",null,null,0,null,null,0,null,null,0,null,0,0,0,0,0,null,0]
[1920,"Computer Equip.-Hardware(Post Mar. 22/04)",null,null,0,null,null,0,null,null,0,null,0,0,0,0,0,null,0]
[1920,"Computer Equip.-Hardware(Post Mar. 19/07)",null,null,0,null,null,0,null,null,0,null,0,0,0,0,0,null,0]
[1930,"Transportation Equipment",null,null,0,null,null,0,null,null,0,null,0,0,0,0,0,null,0]
[1935,"Stores Equipment",null,null,0,null,null,0,null,null,0,null,0,0,0,0,0,null,0]
[1940,"Tools, Shop & Garage Equipment",null,null,0,null,null,0,null,null,0,null,0,0,0,0,0,null,0]
[1945,"Measurement & Testing Equipment",null,null,0,null,null,0,null,null,0,null,0,0,0,0,0,null,0]
[1950,"Power Operated Equipment",null,null,0,null,null,0,null,null,0,null,0,0,0,0,0,null,0]
[1955,"Communications Equipment",null,null,0,null,null,0,null,null,0,null,0,0,0,0,0,null,0]
[1955,"Communication Equipment (Smart Meters)",null,null,0,null,null,0,null,null,0,null,0,0,0,0,0,null,0]
[1960,"Miscellaneous Equipment ",null,null,0,null,null,0,null,null,0,null,0,0,0,0,0,null,0]
[1970,"Load Management Controls Customer Premises",null,null,0,null,null,0,null,null,0,null,0,0,0,0,0,null,0]
[1975,"Load Management Controls Utility Premises",null,null,0,null,null,0,null,null,0,null,0,0,0,0,0,null,0]
[1980,"System Supervisor Equipment",null,null,0,null,null,0,null,null,0,null,0,0,0,0,0,null,0]
[1985,"Miscellaneous Fixed Assets",null,null,0,null,null,0,null,null,0,null,0,0,0,0,0,null,0]
[1990,"Other Tangible Property",null,null,0,null,null,0,null,null,0,null,0,0,0,0,0,null,0]
[1995,"Contributions & Grants",null,null,0,null,null,0,null,null,0,null,0,0,0,0,0,null,0]
[2005,"Property Under Finance Lease",null,null,0,null,null,0,null,null,0,null,0,0,{"$f":"IF(L61=0,0,+H61/L61)","v":0},{"$f":"IF(L61=0,0,+(I61*0.5)/L61)","v":0},{"$f":"IF(ISERROR(+N61+O61+P61), 0, +N61+O61+P61)","v":0},null,0]
[null,"Total",{"$f":"SUM(C23:C61)","v":0},{"$f":"SUM(D23:D61)","v":0},{"$f":"SUM(E23:E61)","v":0},0,0,0,0,null,null,null,null,{"$f":"SUM(N23:N61)","v":0},{"$f":"SUM(O23:O61)","v":0},0,0,0,0]
[]
[]
["General:","Applicants are to complete this appendix to show the reasonability of the depreciation expense that is included in rate base via. Accumulated depreciation and the revenue requirement."]
[null,"Applicants must provide a breakdown of depreciation and amortization expense in the above format for all relevant accounts.  Balances presented in the table should exclude asset retirement obligations (AROs) and the related depreciation and accretion expense. These should be disclosed separately consistent with the Notes of historical Audited Financial Statements."]
[]
[]
["Notes:"]
[1,"This is the net book value of assets that existed as at the date of the utility's change in depreciation policies (i.e. as at Jan. 1, 2012 or Jan. 1, 2013).  These assets are to be depreciated at the average remaining service life. This amount will not change in years subsequent to the date of the utility's change in depreciation policies.  This column is expected to be used until the assets that existed as at the date of the utility's change in depreciation policies are fully depreciated."]
[2,"This is the opening gross book value of assets that have been acquired after the date of the utility's change in depreciation policies (i.e. additions starting in 2012/2013 for those who changed policies Jan. 1, 2012/2013). These assets are to be depreciated at the revised service life. The amount is expected to be equal to the opening gross book value of the prior year plus the prior year's additions."]
[3,"A recalculation should be performed to determine the average remaining life of opening balance of assets (i.e. excluding current year's additions) under the change in policies under CGAAP.  For example, Asset A had a useful life of 20 years under CGAAP without the change in policies.  On January 1 of the year of policy changes, Asset A was 3 years depreciated. As a result, Asset A would have a remaining service life of 17 years (20 years less 3 years) as at January 1 of the year of policy changes.  Due to making the change in policies under CGAAP, management re-assessed the asset useful lives and concluded that the revised useful life of Asset A is now 30 years. Therefore, the average remaining useful life of the opening balance of Asset A is determined to be 27 years (30 years less 3 years) under the revised CGAAP as at January 1 of the year of policy changes."]
[4,"The useful life used should be consistent with the OEB's regulatory accounting policies as set out in the  Accounting Procedures Handbook for Electricity Distributors, effective Jan. 1, 2012 and also with the Report of the Board, Transition to International Financial Reporting Standards, EB-2008-0408, and the Kinectrics Report."]
[5,"OEB policy of the \"half-year\" rule - the applicant must ensure that additions in the year attract a half-year depreciation expense in the first year.  Deviations from this standard practice must be supported in the application."]
[6,"The applicant must provide an explanation of material variances in evidence."]
[7,"This should include assets in column A (excel column C) that become fully depreciated since the date of the policy change.  The amount input in b (excel column D) should equal the net book value of the asset as at the date of depreciation policy change"]
[8,"This should include assets in column D (excel column F) that have become fully depreciated.  The amount input in e (excel column G) should equal the gross book value of the asset"]

{"sheet":"App.2-D_Overhead","index":13,"n_rows":49,"n_cols":8,"rows_kept":49,"cut":false,"hidden":false,"merged":[[8,0,8,7],[9,0,9,7],[13,0,15,0],[30,0,32,0],[30,7,32,7],[11,0,11,5],[28,0,28,5],[63,0,64,0],[49,0,50,0],[49,1,50,1],[52,0,53,0],[55,0,56,0],[58,0,61,0]]}
[null,null,null,null,null,null,"File Number:",{"$f":"EBNUMBER","v":0}]
[null,null,null,null,null,null,"Exhibit:"]
[null,null,null,null,null,null,"Tab:"]
[null,null,null,null,null,null,"Schedule:"]
[null,null,null,null,null,null,"Page:"]
[]
[null,null,null,null,null,null,"Date:"]
[]
["Appendix 2-D"]
["Overhead Expense"]
[]
["Applicants are to provide a breakdown of OM&A before capitalization in the below table.  OM&A before capitalization may be broken down by cost center, program, drivers or another format best suited to focus on capitalized vs. uncapitalized OM&A."]
[]
[" OM&A Before Capitalization"]
[null,{"$f":"F15-4","v":2017},{"$f":"F15-3","v":2018},{"$f":"F15-2","v":2019},{"$f":"F15-1","v":2020},{"$f":"TestYear","v":2021}]
[null,"Historical Year","Historical Year","Historical Year","Bridge Year","Test Year"]
[]
[]
[]
[]
[]
[]
[]
[]
[]
[]
["Total OM&A Before Capitalization (B)",{"$f":"SUM(B17:B26)","v":0},{"$f":"SUM(C17:C26)","v":0},{"$f":"SUM(D17:D26)","v":0},{"$f":"SUM(E17:E26)","v":0},{"$f":"SUM(F17:F26)","v":0}]
[]
["Applicants are to provide a breakdown of capitalized OM&A in the below table. Capitalized OM&A may be broken down using the categories listed in the table below if possible. Otherwise, applicants are to provide its own break down of capitalized OM&A."]
[]
["Capitalized OM&A",null,null,null,null,null,"Directly","Explanation for Change in Overhead Capitalized"]
[null,{"$f":"F32-4","v":2017},{"$f":"F32-3","v":2018},{"$f":"F32-2","v":2019},{"$f":"F32-1","v":2020},{"$f":"TestYear","v":2021},"Attributable?"]
[null,"Historical Year","Historical Year","Historical Year","Bridge Year","Test Year","(Yes/No)"]
["employee benefits"]
["costs of site preparation"]
["initial delivery and handling costs"]
["costs of testing whether the asset is functioning properly"]
["professional fees"]
[]
["costs of opening a new facility"]
["costs of introducing a new product or service (including costs of advertising and promotional activities)"]
["costs of conducting business in a new location or with a new class of customer (including costs of staff training)"]
["administration and other general overhead costs"]
[]
["Insert description of additional item(s) and new rows if needed"]
[]
["Total Capitalized OM&A (A)",{"$f":"SUM(B34:B46)","v":0},{"$f":"SUM(C34:C46)","v":0},{"$f":"SUM(D34:D46)","v":0},{"$f":"SUM(E34:E46)","v":0},{"$f":"SUM(F34:F46)","v":0}]
[]
["% of Capitalized OM&A (=A/B)",{"$f":"IF(ISERROR(B47/B27),\"0%\",B47/B27)","v":"0%"},{"$f":"IF(ISERROR(C47/C27),\"0%\",C47/C27)","v":"0%"},{"$f":"IF(ISERROR(D47/D27),\"0%\",D47/D27)","v":"0%"},{"$f":"IF(ISERROR(E47/E27),\"0%\",E47/E27)","v":"0%"},{"$f":"IF(ISERROR(F47/F27),\"0%\",F47/F27)","v":"0%"}]

{"sheet":"App.2-EA_Account 1575 (2015)","index":14,"n_rows":47,"n_cols":9,"rows_kept":47,"cut":false,"hidden":true,"merged":[[20,1,20,5],[8,0,8,8],[9,0,9,8],[10,0,10,8],[12,0,12,8],[14,0,14,8],[47,0,47,9],[52,0,53,8],[25,1,26,5],[31,1,31,5],[37,6,38,7],[37,8,38,8]]}
[null,null,null,null,null,null,null,"File Number:",{"$f":"EBNUMBER","v":0}]
[null,null,null,null,null,null,null,"Exhibit:"]
[null,null,null,null,null,null,null,"Tab:"]
[null,null,null,null,null,null,null,"Schedule:"]
[null,null,null,null,null,null,null,"Page:"]
[]
[null,null,null,null,null,null,null,"Date:"]
[]
["Appendix 2-EA"]
["Account 1575 - IFRS-CGAAP Transitional PP&E Amounts"]
["2015 Adopters of IFRS for Financial Reporting Purposes"]
[]
["For applicants that adopted IFRS on January 1, 2015 for financial reporting purposes"]
[]
[]
[]
[null,2014,{"$f":"TestYear-3","v":2018},{"$f":"TestYear-2","v":2019},{"$f":"CONCATENATE(TestYear-1,\" Bridge Year\")","v":"2020 Bridge Year"},{"$f":"CONCATENATE(TestYear,\" Rebasing Year\")","v":"2021 Rebasing Year"}]
["Reporting Basis","CGAAP","CGAAP","CGAAP","MIFRS","MIFRS"]
[null,"Actual","Actual","Actual","Forecast","Forecast"]
[null,null,null,"$","$"]
["PP&E Values under CGAAP"]
["            Opening net PP&E - Note 1",null,{"$f":"+B25","v":0},{"$f":"+C25","v":0},{"$f":"+D25","v":0}]
["            Net Additions - Note 4"]
["            Net Depreciation (amounts should be negative) - Note 4"]
["            Closing net PP&E (1)",{"$f":"SUM(B22:B24)","v":0},{"$f":"SUM(C22:C24)","v":0},{"$f":"SUM(D22:D24)","v":0},{"$f":"SUM(E22:E24)","v":0}]
[]
["PP&E Values under MIFRS (Starts from 2014, the transition year)"]
["            Opening net PP&E  - Note 1",null,{"$f":"+B31","v":0},{"$f":"+C31","v":0},{"$f":"+D31","v":0}]
["            Net Additions - Note 4"]
["            Net Depreciation (amounts should be negative) - Note 4"]
["            Closing net PP&E (2)",{"$f":"SUM(B28:B30)","v":0},{"$f":"SUM(C28:C30)","v":0},{"$f":"SUM(D28:D30)","v":0},{"$f":"SUM(E28:E30)","v":0}]
[]
["Difference in Closing net PP&E, former CGAAP vs. revised CGAAP ",{"$f":"B25-B31","v":0},{"$f":"C25-C31","v":0},{"$f":"D25-D31","v":0},{"$f":"E25-E31","v":0}]
[]
[]
["Effect on Deferral and Variance Account Rate Riders"]
["Closing balance in Account 1575",null,null,null,null,{"$f":"IF(ISERROR(E33), 0, E33)","v":0},null,"WACC"]
["Return on Rate Base Associated with Account 1575 balance at WACC  - Note 2",null,null,null,null,{"$f":"E33*I37*I38","v":0},"# of years of rate rider disposition period"]
["     Amount included in Deferral and Variance Account Rate Rider Calculation",null,null,null,null,{"$f":"F37+F38","v":0}]
[]
["Notes:"]
["1  For an applicant that adopted IFRS on January 1, 2015, the PP&E values as of January 1, 2014 under both CGAAP and MIFRS should be the same. "]
["2 Return on rate base associated with deferred balance is calculated as:"]
["     the deferral account closing balance as of 2017 x WACC X # of years of rate rider disposition period"]
["     * Please note that the calculation should be adjusted once WACC is updated and finalized in the rate application."]
["3  The  PP&E deferral account is cleared by including the total balance in the deferral and variance account rate rider calculation."]
["4  Net additions are additions net of disposals; Net depreciation is additions to depreciation net of disposals."]

{"sheet":"App.2-EB_Account 1576 (2012)","index":15,"n_rows":48,"n_cols":12,"rows_kept":48,"cut":false,"hidden":true,"merged":[[41,0,41,12],[45,0,45,10],[8,0,8,11],[9,0,9,11],[10,0,10,11],[12,0,13,11],[14,0,14,11],[20,1,20,8],[25,1,26,8],[31,1,31,8],[37,9,38,10],[37,11,38,11]]}
[null,null,null,null,null,null,null,null,null,null,"File Number:",{"$f":"EBNUMBER","v":0}]
[null,null,null,null,null,null,null,null,null,null,"Exhibit:"]
[null,null,null,null,null,null,null,null,null,null,"Tab:"]
[null,null,null,null,null,null,null,null,null,null,"Schedule:"]
[null,null,null,null,null,null,null,null,null,null,"Page:"]
[]
[null,null,null,null,null,null,null,null,null,null,"Date:"]
[]
["Appendix 2-EB"]
["Account 1576 - Accounting Changes under CGAAP"]
["2012 Changes in Accounting Policies under CGAAP"]
[]
["For applicants with a balance in Account 1576 and made capitalization and depreciation expense accounting policy changes under CGAAP effective January 1, 2012.  This is the first time the applicant is rebasing with changes in these accounting policies."]
[]
[]
[]
[null,"Prior Years Rebasing",2012,2013,2014,2015,2016,2017,"2018 Rebasing Year"]
["Reporting Basis","CGAAP","CGAAP","CGAAP","CGAAP","MIFRS - Note 5","MIFRS","MIFRS","MIFRS"]
[null,"Forecast","Actual","Actual","Actual","Actual","Actual","Forecast","Forecast"]
[null,null,"$","$","$","$","$","$"]
["PP&E Values under former CGAAP"]
["            Opening net PP&E - Note 1",null,null,{"$f":"+C25","v":0},{"$f":"+D25","v":0},{"$f":"+E25","v":0},{"$f":"+F25","v":0},{"$f":"+G25","v":0}]
["            Net Additions - Note 4"]
["            Net Depreciation (amounts should be negative) - Note 4"]
["            Closing net PP&E (1)",null,{"$f":"C22+C23+C24","v":0},0,0,0,0,0]
[]
["PP&E Values under revised CGAAP (Starts from 2012)"]
["            Opening net PP&E  - Note 1",null,null,{"$f":"+C31","v":0},{"$f":"+D31","v":0},{"$f":"+E31","v":0},{"$f":"+F31","v":0},{"$f":"+G31","v":0}]
["            Net Additions - Note 4"]
["            Net Depreciation (amounts should be negative) - Note 4"]
["            Closing net PP&E (2)",null,{"$f":"SUM(C28:C30)","v":0},0,0,0,0,0]
[]
["Difference in Closing net PP&E, former CGAAP vs. revised CGAAP ",null,{"$f":"C25-C31","v":0},0,0,0,0,0]
[]
[]
["Effect on Deferral and Variance Account Rate Riders"]
["Closing balance in Account 1576",null,null,null,null,null,null,null,{"$f":"IF(ISERROR(H33), 0, H33)","v":0},null,"WACC"]
["Return on Rate Base Associated with Account 1576 balance at WACC  - Note 2",null,null,null,null,null,null,null,{"$f":"H33*L37*L38","v":0},"# of years of rate rider disposition period"]
["     Amount included in Deferral and Variance Account Rate Rider Calculation",null,null,null,null,null,null,null,{"$f":"I37+I38","v":0}]
[]
["Notes:"]
["1  For an applicant that made the capitalization and depreciation expense accounting policy changes on January 1, 2012, the PP&E values as of January 1, 2012 under both former CGAAP and revised CGAAP should be the same. "]
["2 Return on rate base associated with Account 1576 balance is calculated as:"]
["     the variance account ending balance as of 2017 x WACC X # of years of rate rider disposition period"]
["     * Please note that the calculation should be adjusted once WACC is updated and finalized in the rate application."]
["3  Account 1576 is cleared by including the total balance in the deferral and variance account rate rider calculation."]
["4  Net additions are additions net of disposals; Net depreciation is additions to depreciation net of disposals."]
["5 Differences due to the adoption of MIFRS are to be shown separately in Account 1575 in Appendix 2-EA as Accounts 1575 and 1576 cannot be used interchangably."]

{"sheet":"App.2-EC_Account 1576 (2013)","index":16,"n_rows":48,"n_cols":11,"rows_kept":48,"cut":false,"hidden":true,"merged":[[45,0,45,9],[8,0,8,10],[9,0,9,10],[10,0,10,10],[12,0,12,10],[14,0,14,10],[37,10,38,10],[20,1,20,7],[25,1,26,7],[31,1,31,7],[37,8,38,9],[41,0,41,11]]}
[null,null,null,null,null,null,null,null,null,"File Number:",{"$f":"EBNUMBER","v":0}]
[null,null,null,null,null,null,null,null,null,"Exhibit:"]
[null,null,null,null,null,null,null,null,null,"Tab:"]
[null,null,null,null,null,null,null,null,null,"Schedule:"]
[null,null,null,null,null,null,null,null,null,"Page:"]
[]
[null,null,null,null,null,null,null,null,null,"Date:"]
[]
["Appendix 2-EC"]
["Account 1576 - Accounting Changes under CGAAP"]
["2013 Changes in Accounting Policies under CGAAP"]
[]
["For applicants with a balance in Account 1576 and made capitalization and depreciation expense accounting policy changes under CGAAP effective January 1, 2013.  This is the first time the applicant is rebasing with changes in these accounting policies."]
[]
[]
[]
[null,"Prior Years Rebasing",2013,2014,2015,2016,2017,"2018 Rebasing Year"]
["Reporting Basis","CGAAP","CGAAP","CGAAP","MIFRS - Note 5","MIFRS","MIFRS","MIFRS"]
[null,"Actual","Actual","Actual","Actual","Actual","Forecast","Forecast"]
[null,null,"$","$",null,"$"]
["PP&E Values under former CGAAP"]
["            Opening net PP&E - Note 1",null,null,{"$f":"+C25","v":0},{"$f":"+D25","v":0},{"$f":"+E25","v":0},{"$f":"+F25","v":0}]
["            Net Additions - Note 4"]
["            Net Depreciation (amounts should be negative) - Note 4"]
["            Closing net PP&E (1)",null,{"$f":"C22+C23+C24","v":0},{"$f":"D22+D23+D24","v":0},{"$f":"E22+E23+E24","v":0},{"$f":"F22+F23+F24","v":0},{"$f":"G22+G23+G24","v":0}]
[]
["PP&E Values under revised CGAAP (Starts from 2012)"]
["            Opening net PP&E  - Note 1",null,null,{"$f":"+C31","v":0},{"$f":"+D31","v":0},{"$f":"+E31","v":0},{"$f":"+F31","v":0}]
["            Net Additions - Note 4"]
["            Net Depreciation (amounts should be negative) - Note 4"]
["            Closing net PP&E (2)",null,{"$f":"SUM(C28:C30)","v":0},{"$f":"SUM(D28:D30)","v":0},{"$f":"SUM(E28:E30)","v":0},{"$f":"SUM(F28:F30)","v":0},{"$f":"SUM(G28:G30)","v":0}]
[]
["Difference in Closing net PP&E, former CGAAP vs. revised CGAAP ",null,{"$f":"C25-C31","v":0},{"$f":"D25-D31","v":0},{"$f":"E25-E31","v":0},{"$f":"F25-F31","v":0},{"$f":"G25-G31","v":0}]
[]
[]
["Effect on Deferral and Variance Account Rate Riders"]
["Closing balance in Account 1576",null,null,null,null,null,null,{"$f":"IF(ISERROR(G33), 0, G33)","v":0},null,"WACC"]
["Return on Rate Base Associated with Account 1576 balance at WACC  - Note 2",null,null,null,null,null,null,{"$f":"G33*K37*K38","v":0},"# of years of rate rider disposition period"]
["     Amount included in Deferral and Variance Account Rate Rider Calculation",null,null,null,null,null,null,{"$f":"H37+H38","v":0}]
[]
["Notes:"]
["1  For an applicant that made the capitalization and depreciation expense accounting policy changes on January 1, 2013, the PP&E values as of January 1, 2013 under both former CGAAP and revised CGAAP should be the same. "]
["2 Return on rate base associated with Account 1576 balance is calculated as:"]
["     the variance account ending balance as of 2017 x WACC X # of years of rate rider disposition period"]
["     * Please note that the calculation should be adjusted once WACC is updated and finalized in the rate application."]
["3  Account 1576 is cleared by including the total balance in the deferral and variance account rate rider calculation."]
["4  Net additions are additions net of disposals; Net depreciation is additions to depreciation net of disposals."]
["5 Differences due to the adoption of MIFRS are to be shown separately in Account 1575 in Appendix 2-EA as Accounts 1575 and 1576 cannot be used interchangably."]

{"sheet":"Hidden_REG Invest.","index":17,"n_rows":61,"n_cols":8,"rows_kept":61,"cut":false,"hidden":true,"merged":[]}
["Utility Name","EB Number","Test Year","Bridge Year","Last Rebasing Year","Renewable Generation Connection Investment Summary","Year","Amount"]
[{"$f":"'LDC Info'!$E$14","v":0},{"$f":"EBNUMBER","v":0},{"$f":"TestYear","v":2021},{"$f":"BridgeYear","v":2020},{"$f":"RebaseYear","v":2014},"REI Investments_A_Total Capital Costs",{"$f":"'App.2-FA Proposed REG Invest.'!$C$31","v":2016},{"$f":"'App.2-FA Proposed REG Invest.'!C62","v":0}]
[{"$f":"'LDC Info'!$E$14","v":0},0,2021,2020,2014,"REI Investments_A_Total OM&A Start-Up",{"$f":"'App.2-FA Proposed REG Invest.'!$C$31","v":2016},{"$f":"'App.2-FA Proposed REG Invest.'!$C63","v":0}]
[{"$f":"'LDC Info'!$E$14","v":0},0,2021,2020,2014,"REI Investments_A_Total OM&A Ongoing",{"$f":"'App.2-FA Proposed REG Invest.'!$C$31","v":2016},{"$f":"'App.2-FA Proposed REG Invest.'!$C64","v":0}]
[{"$f":"'LDC Info'!$E$14","v":0},0,2021,2020,2014,"REI Investments_A_Total Capital Costs",{"$f":"'App.2-FA Proposed REG Invest.'!$D$31","v":2017},{"$f":"'App.2-FA Proposed REG Invest.'!D62","v":0}]
[{"$f":"'LDC Info'!$E$14","v":0},0,2021,2020,2014,"REI Investments_A_Total OM&A Start-Up",{"$f":"'App.2-FA Proposed REG Invest.'!$D$31","v":2017},{"$f":"'App.2-FA Proposed REG Invest.'!D63","v":0}]
[{"$f":"'LDC Info'!$E$14","v":0},0,2021,2020,2014,"REI Investments_A_Total OM&A Ongoing",{"$f":"'App.2-FA Proposed REG Invest.'!$D$31","v":2017},{"$f":"'App.2-FA Proposed REG Invest.'!D64","v":0}]
[{"$f":"'LDC Info'!$E$14","v":0},0,2021,2020,2014,"REI Investments_A_Total Capital Costs",{"$f":"'App.2-FA Proposed REG Invest.'!$E$31","v":2018},{"$f":"'App.2-FA Proposed REG Invest.'!E62","v":0}]
[{"$f":"'LDC Info'!$E$14","v":0},0,2021,2020,2014,"REI Investments_A_Total OM&A Start-Up",{"$f":"'App.2-FA Proposed REG Invest.'!$E$31","v":2018},{"$f":"'App.2-FA Proposed REG Invest.'!E63","v":0}]
[{"$f":"'LDC Info'!$E$14","v":0},0,2021,2020,2014,"REI Investments_A_Total OM&A Ongoing",{"$f":"'App.2-FA Proposed REG Invest.'!$E$31","v":2018},{"$f":"'App.2-FA Proposed REG Invest.'!E64","v":0}]
[{"$f":"'LDC Info'!$E$14","v":0},0,2021,2020,2014,"REI Investments_A_Total Capital Costs",{"$f":"'App.2-FA Proposed REG Invest.'!$F$31","v":2019},{"$f":"'App.2-FA Proposed REG Invest.'!F62","v":0}]
[{"$f":"'LDC Info'!$E$14","v":0},0,2021,2020,2014,"REI Investments_A_Total OM&A Start-Up",{"$f":"'App.2-FA Proposed REG Invest.'!$F$31","v":2019},{"$f":"'App.2-FA Proposed REG Invest.'!F63","v":0}]
[{"$f":"'LDC Info'!$E$14","v":0},0,2021,2020,2014,"REI Investments_A_Total OM&A Ongoing",{"$f":"'App.2-FA Proposed REG Invest.'!$F$31","v":2019},{"$f":"'App.2-FA Proposed REG Invest.'!F64","v":0}]
[{"$f":"'LDC Info'!$E$14","v":0},0,2021,2020,2014,"REI Investments_A_Total Capital Costs",{"$f":"'App.2-FA Proposed REG Invest.'!$G$31","v":2020},{"$f":"'App.2-FA Proposed REG Invest.'!G62","v":0}]
[{"$f":"'LDC Info'!$E$14","v":0},0,2021,2020,2014,"REI Investments_A_Total OM&A Start-Up",{"$f":"'App.2-FA Proposed REG Invest.'!$G$31","v":2020},{"$f":"'App.2-FA Proposed REG Invest.'!G63","v":0}]
[{"$f":"'LDC Info'!$E$14","v":0},0,2021,2020,2014,"REI Investments_A_Total OM&A Ongoing",{"$f":"'App.2-FA Proposed REG Invest.'!$G$31","v":2020},{"$f":"'App.2-FA Proposed REG Invest.'!G64","v":0}]
[{"$f":"'LDC Info'!$E$14","v":0},0,2021,2020,2014,"REI Investments_A_Total Capital Costs",{"$f":"'App.2-FA Proposed REG Invest.'!$H$31","v":2021},{"$f":"'App.2-FA Proposed REG Invest.'!H62","v":0}]
[{"$f":"'LDC Info'!$E$14","v":0},0,2021,2020,2014,"REI Investments_A_Total OM&A Start-Up",{"$f":"'App.2-FA Proposed REG Invest.'!$H$31","v":2021},{"$f":"'App.2-FA Proposed REG Invest.'!H63","v":0}]
[{"$f":"'LDC Info'!$E$14","v":0},0,2021,2020,2014,"REI Investments_A_Total OM&A Ongoing",{"$f":"'App.2-FA Proposed REG Invest.'!$H$31","v":2021},{"$f":"'App.2-FA Proposed REG Invest.'!H64","v":0}]
[{"$f":"'LDC Info'!$E$14","v":0},0,2021,2020,2014,"REI Investments_A_Total Capital Costs",{"$f":"'App.2-FA Proposed REG Invest.'!$I$31","v":2022},{"$f":"'App.2-FA Proposed REG Invest.'!I62","v":0}]
[{"$f":"'LDC Info'!$E$14","v":0},0,2021,2020,2014,"REI Investments_A_Total OM&A Start-Up",{"$f":"'App.2-FA Proposed REG Invest.'!$I$31","v":2022},{"$f":"'App.2-FA Proposed REG Invest.'!I63","v":0}]
[{"$f":"'LDC Info'!$E$14","v":0},0,2021,2020,2014,"REI Investments_A_Total OM&A Ongoing",{"$f":"'App.2-FA Proposed REG Invest.'!$I$31","v":2022},{"$f":"'App.2-FA Proposed REG Invest.'!I64","v":0}]
[{"$f":"'LDC Info'!$E$14","v":0},0,2021,2020,2014,"REI Investments_A_Total Capital Costs",{"$f":"'App.2-FA Proposed REG Invest.'!$J$31","v":2023},{"$f":"'App.2-FA Proposed REG Invest.'!J62","v":0}]
[{"$f":"'LDC Info'!$E$14","v":0},0,2021,2020,2014,"REI Investments_A_Total OM&A Start-Up",{"$f":"'App.2-FA Proposed REG Invest.'!$J$31","v":2023},{"$f":"'App.2-FA Proposed REG Invest.'!J63","v":0}]
[{"$f":"'LDC Info'!$E$14","v":0},0,2021,2020,2014,"REI Investments_A_Total OM&A Ongoing",{"$f":"'App.2-FA Proposed REG Invest.'!$J$31","v":2023},{"$f":"'App.2-FA Proposed REG Invest.'!J64","v":0}]
[{"$f":"'LDC Info'!$E$14","v":0},0,2021,2020,2014,"REI Investments_A_Total Capital Costs",{"$f":"'App.2-FA Proposed REG Invest.'!$K$31","v":2024},{"$f":"'App.2-FA Proposed REG Invest.'!K62","v":0}]
[{"$f":"'LDC Info'!$E$14","v":0},0,2021,2020,2014,"REI Investments_A_Total OM&A Start-Up",{"$f":"'App.2-FA Proposed REG Invest.'!$K$31","v":2024},{"$f":"'App.2-FA Proposed REG Invest.'!K63","v":0}]
[{"$f":"'LDC Info'!$E$14","v":0},0,2021,2020,2014,"REI Investments_A_Total OM&A Ongoing",{"$f":"'App.2-FA Proposed REG Invest.'!$K$31","v":2024},{"$f":"'App.2-FA Proposed REG Invest.'!K64","v":0}]
[{"$f":"'LDC Info'!$E$14","v":0},0,2021,2020,2014,"REI Investments_A_Total Capital Costs",{"$f":"'App.2-FA Proposed REG Invest.'!$L$31","v":2025},{"$f":"'App.2-FA Proposed REG Invest.'!L62","v":0}]
[{"$f":"'LDC Info'!$E$14","v":0},0,2021,2020,2014,"REI Investments_A_Total OM&A Start-Up",{"$f":"'App.2-FA Proposed REG Invest.'!$L$31","v":2025},{"$f":"'App.2-FA Proposed REG Invest.'!L63","v":0}]
[{"$f":"'LDC Info'!$E$14","v":0},0,2021,2020,2014,"REI Investments_A_Total OM&A Ongoing",{"$f":"'App.2-FA Proposed REG Invest.'!$L$31","v":2025},{"$f":"'App.2-FA Proposed REG Invest.'!L64","v":0}]
[{"$f":"'LDC Info'!$E$14","v":0},0,2021,2020,2014,"Expansion Investments_B_Total Capital Costs",{"$f":"'App.2-FA Proposed REG Invest.'!$C$31","v":2016},{"$f":"'App.2-FA Proposed REG Invest.'!C99","v":0}]
[{"$f":"'LDC Info'!$E$14","v":0},0,2021,2020,2014,"Expansion Investments_B_Total OM&A Start-Up",{"$f":"'App.2-FA Proposed REG Invest.'!$C$31","v":2016},{"$f":"'App.2-FA Proposed REG Invest.'!C100","v":0}]
[{"$f":"'LDC Info'!$E$14","v":0},0,2021,2020,2014,"Expansion Investments_B_Total OM&A Ongoing",{"$f":"'App.2-FA Proposed REG Invest.'!$C$31","v":2016},{"$f":"'App.2-FA Proposed REG Invest.'!C101","v":0}]
[{"$f":"'LDC Info'!$E$14","v":0},0,2021,2020,2014,"Expansion Investments_B_Total Capital Costs",{"$f":"'App.2-FA Proposed REG Invest.'!$D$31","v":2017},{"$f":"'App.2-FA Proposed REG Invest.'!D99","v":0}]
[{"$f":"'LDC Info'!$E$14","v":0},0,2021,2020,2014,"Expansion Investments_B_Total OM&A Start-Up",{"$f":"'App.2-FA Proposed REG Invest.'!$D$31","v":2017},{"$f":"'App.2-FA Proposed REG Invest.'!D100","v":0}]
[{"$f":"'LDC Info'!$E$14","v":0},0,2021,2020,2014,"Expansion Investments_B_Total OM&A Ongoing",{"$f":"'App.2-FA Proposed REG Invest.'!$D$31","v":2017},{"$f":"'App.2-FA Proposed REG Invest.'!D101","v":0}]
[{"$f":"'LDC Info'!$E$14","v":0},0,2021,2020,2014,"Expansion Investments_B_Total Capital Costs",{"$f":"'App.2-FA Proposed REG Invest.'!$E$31","v":2018},{"$f":"'App.2-FA Proposed REG Invest.'!E99","v":0}]
[{"$f":"'LDC Info'!$E$14","v":0},0,2021,2020,2014,"Expansion Investments_B_Total OM&A Start-Up",{"$f":"'App.2-FA Proposed REG Invest.'!$E$31","v":2018},{"$f":"'App.2-FA Proposed REG Invest.'!E100","v":0}]
[{"$f":"'LDC Info'!$E$14","v":0},0,2021,2020,2014,"Expansion Investments_B_Total OM&A Ongoing",{"$f":"'App.2-FA Proposed REG Invest.'!$E$31","v":2018},{"$f":"'App.2-FA Proposed REG Invest.'!E101","v":0}]
[{"$f":"'LDC Info'!$E$14","v":0},0,2021,2020,2014,"Expansion Investments_B_Total Capital Costs",{"$f":"'App.2-FA Proposed REG Invest.'!$F$31","v":2019},{"$f":"'App.2-FA Proposed REG Invest.'!F99","v":0}]
[{"$f":"'LDC Info'!$E$14","v":0},0,2021,2020,2014,"Expansion Investments_B_Total OM&A Start-Up",{"$f":"'App.2-FA Proposed REG Invest.'!$F$31","v":2019},{"$f":"'App.2-FA Proposed REG Invest.'!F100","v":0}]
[{"$f":"'LDC Info'!$E$14","v":0},0,2021,2020,2014,"Expansion Investments_B_Total OM&A Ongoing",{"$f":"'App.2-FA Proposed REG Invest.'!$F$31","v":2019},{"$f":"'App.2-FA Proposed REG Invest.'!F101","v":0}]
[{"$f":"'LDC Info'!$E$14","v":0},0,2021,2020,2014,"Expansion Investments_B_Total Capital Costs",{"$f":"'App.2-FA Proposed REG Invest.'!$G$31","v":2020},{"$f":"'App.2-FA Proposed REG Invest.'!G99","v":0}]
[{"$f":"'LDC Info'!$E$14","v":0},0,2021,2020,2014,"Expansion Investments_B_Total OM&A Start-Up",{"$f":"'App.2-FA Proposed REG Invest.'!$G$31","v":2020},{"$f":"'App.2-FA Proposed REG Invest.'!G100","v":0}]
[{"$f":"'LDC Info'!$E$14","v":0},0,2021,2020,2014,"Expansion Investments_B_Total OM&A Ongoing",{"$f":"'App.2-FA Proposed REG Invest.'!$G$31","v":2020},{"$f":"'App.2-FA Proposed REG Invest.'!G101","v":0}]
[{"$f":"'LDC Info'!$E$14","v":0},0,2021,2020,2014,"Expansion Investments_B_Total Capital Costs",{"$f":"'App.2-FA Proposed REG Invest.'!$H$31","v":2021},{"$f":"'App.2-FA Proposed REG Invest.'!H99","v":0}]
[{"$f":"'LDC Info'!$E$14","v":0},0,2021,2020,2014,"Expansion Investments_B_Total OM&A Start-Up",{"$f":"'App.2-FA Proposed REG Invest.'!$H$31","v":2021},{"$f":"'App.2-FA Proposed REG Invest.'!H100","v":0}]
[{"$f":"'LDC Info'!$E$14","v":0},0,2021,2020,2014,"Expansion Investments_B_Total OM&A Ongoing",{"$f":"'App.2-FA Proposed REG Invest.'!$H$31","v":2021},{"$f":"'App.2-FA Proposed REG Invest.'!H101","v":0}]
[{"$f":"'LDC Info'!$E$14","v":0},0,2021,2020,2014,"Expansion Investments_B_Total Capital Costs",{"$f":"'App.2-FA Proposed REG Invest.'!$I$31","v":2022},{"$f":"'App.2-FA Proposed REG Invest.'!I99","v":0}]
[{"$f":"'LDC Info'!$E$14","v":0},0,2021,2020,2014,"Expansion Investments_B_Total OM&A Start-Up",{"$f":"'App.2-FA Proposed REG Invest.'!$I$31","v":2022},{"$f":"'App.2-FA Proposed REG Invest.'!I100","v":0}]
[{"$f":"'LDC Info'!$E$14","v":0},0,2021,2020,2014,"Expansion Investments_B_Total OM&A Ongoing",{"$f":"'App.2-FA Proposed REG Invest.'!$I$31","v":2022},{"$f":"'App.2-FA Proposed REG Invest.'!I101","v":0}]
[{"$f":"'LDC Info'!$E$14","v":0},0,2021,2020,2014,"Expansion Investments_B_Total Capital Costs",{"$f":"'App.2-FA Proposed REG Invest.'!$J$31","v":2023},{"$f":"'App.2-FA Proposed REG Invest.'!J99","v":0}]
[{"$f":"'LDC Info'!$E$14","v":0},0,2021,2020,2014,"Expansion Investments_B_Total OM&A Start-Up",{"$f":"'App.2-FA Proposed REG Invest.'!$J$31","v":2023},{"$f":"'App.2-FA Proposed REG Invest.'!J100","v":0}]
[{"$f":"'LDC Info'!$E$14","v":0},0,2021,2020,2014,"Expansion Investments_B_Total OM&A Ongoing",{"$f":"'App.2-FA Proposed REG Invest.'!$J$31","v":2023},{"$f":"'App.2-FA Proposed REG Invest.'!J101","v":0}]
[{"$f":"'LDC Info'!$E$14","v":0},0,2021,2020,2014,"Expansion Investments_B_Total Capital Costs",{"$f":"'App.2-FA Proposed REG Invest.'!$K$31","v":2024},{"$f":"'App.2-FA Proposed REG Invest.'!K99","v":0}]
[{"$f":"'LDC Info'!$E$14","v":0},0,2021,2020,2014,"Expansion Investments_B_Total OM&A Start-Up",{"$f":"'App.2-FA Proposed REG Invest.'!$K$31","v":2024},{"$f":"'App.2-FA Proposed REG Invest.'!K100","v":0}]
[{"$f":"'LDC Info'!$E$14","v":0},0,2021,2020,2014,"Expansion Investments_B_Total OM&A Ongoing",{"$f":"'App.2-FA Proposed REG Invest.'!$K$31","v":2024},{"$f":"'App.2-FA Proposed REG Invest.'!K101","v":0}]
[{"$f":"'LDC Info'!$E$14","v":0},0,2021,2020,2014,"Expansion Investments_B_Total Capital Costs",{"$f":"'App.2-FA Proposed REG Invest.'!$L$31","v":2025},{"$f":"'App.2-FA Proposed REG Invest.'!L99","v":0}]
[{"$f":"'LDC Info'!$E$14","v":0},0,2021,2020,2014,"Expansion Investments_B_Total OM&A Start-Up",{"$f":"'App.2-FA Proposed REG Invest.'!$L$31","v":2025},{"$f":"'App.2-FA Proposed REG Invest.'!L100","v":0}]
[{"$f":"'LDC Info'!$E$14","v":0},0,2021,2020,2014,"Expansion Investments_B_Total OM&A Ongoing",{"$f":"'App.2-FA Proposed REG Invest.'!$L$31","v":2025},{"$f":"'App.2-FA Proposed REG Invest.'!L101","v":0}]

{"sheet":"Hidden_REG Improvement","index":18,"n_rows":11,"n_cols":8,"rows_kept":11,"cut":false,"hidden":true,"merged":[]}
["Utility Name","EB Number","Test Year","Bridge Year","Last Rebasing Year","Renewable Generation Connection Direct Benefits/Provincial Amount Renewable Enabling Improvement Investments","Year","Amount"]
[{"$f":"'LDC Info'!$E$14","v":0},{"$f":"EBNUMBER","v":0},{"$f":"TestYear","v":2021},{"$f":"BridgeYear","v":2020},{"$f":"RebaseYear","v":2014},"Provincial Rate Protection",{"$f":"'App.2-FB Calc of REG Improvemnt'!D17","v":2016},{"$f":"'App.2-FB Calc of REG Improvemnt'!F$44","v":0}]
[{"$f":"'LDC Info'!$E$14","v":0},0,2021,2020,2014,"Provincial Rate Protection",{"$f":"'App.2-FB Calc of REG Improvemnt'!G17","v":2017},{"$f":"'App.2-FB Calc of REG Improvemnt'!I$44","v":0}]
[{"$f":"'LDC Info'!$E$14","v":0},0,2021,2020,2014,"Provincial Rate Protection",{"$f":"'App.2-FB Calc of REG Improvemnt'!J17","v":2018},{"$f":"'App.2-FB Calc of REG Improvemnt'!L$44","v":0}]
[{"$f":"'LDC Info'!$E$14","v":0},0,2021,2020,2014,"Provincial Rate Protection",{"$f":"'App.2-FB Calc of REG Improvemnt'!M17","v":2019},{"$f":"'App.2-FB Calc of REG Improvemnt'!O$44","v":0}]
[{"$f":"'LDC Info'!$E$14","v":0},0,2021,2020,2014,"Provincial Rate Protection",{"$f":"'App.2-FB Calc of REG Improvemnt'!P17","v":2020},{"$f":"'App.2-FB Calc of REG Improvemnt'!R$44","v":0}]
[{"$f":"'LDC Info'!$E$14","v":0},0,2021,2020,2014,"Provincial Rate Protection",{"$f":"'App.2-FB Calc of REG Improvemnt'!S17","v":2021},{"$f":"'App.2-FB Calc of REG Improvemnt'!U$44","v":0}]
[{"$f":"'LDC Info'!$E$14","v":0},0,2021,2020,2014,"Provincial Rate Protection",{"$f":"'App.2-FB Calc of REG Improvemnt'!V17","v":2022},{"$f":"'App.2-FB Calc of REG Improvemnt'!X$44","v":0}]
[{"$f":"'LDC Info'!$E$14","v":0},0,2021,2020,2014,"Provincial Rate Protection",{"$f":"'App.2-FB Calc of REG Improvemnt'!Y17","v":2023},{"$f":"'App.2-FB Calc of REG Improvemnt'!AA$44","v":0}]
[{"$f":"'LDC Info'!$E$14","v":0},0,2021,2020,2014,"Provincial Rate Protection",{"$f":"'App.2-FB Calc of REG Improvemnt'!AB17","v":2024},{"$f":"'App.2-FB Calc of REG Improvemnt'!AD$44","v":0}]
[{"$f":"'LDC Info'!$E$14","v":0},0,2021,2020,2014,"Provincial Rate Protection",{"$f":"'App.2-FB Calc of REG Improvemnt'!AE17","v":2025},{"$f":"'App.2-FB Calc of REG Improvemnt'!AG$44","v":0}]

{"sheet":"Hidden_REG Expansion","index":19,"n_rows":11,"n_cols":8,"rows_kept":11,"cut":false,"hidden":true,"merged":[]}
["Utility Name","EB Number","Test Year","Bridge Year","Last Rebasing Year","Calculation of Renewable Generation Connection Direct Benefits/Provincial Amount Renewable Expansion Investments","Year","Amount"]
[{"$f":"'LDC Info'!$E$14","v":0},{"$f":"EBNUMBER","v":0},{"$f":"TestYear","v":2021},{"$f":"BridgeYear","v":2020},{"$f":"RebaseYear","v":2014},"Provincial Rate Protection",{"$f":"'App.2-FC Calc of REG Expansion'!D$17","v":2016},{"$f":"'App.2-FC Calc of REG Expansion'!F$44","v":0}]
[{"$f":"'LDC Info'!$E$14","v":0},0,2021,2020,2014,"Provincial Rate Protection",{"$f":"'App.2-FC Calc of REG Expansion'!G$17","v":2017},{"$f":"'App.2-FC Calc of REG Expansion'!I$44","v":0}]
[{"$f":"'LDC Info'!$E$14","v":0},0,2021,2020,2014,"Provincial Rate Protection",{"$f":"'App.2-FC Calc of REG Expansion'!J$17","v":2018},{"$f":"'App.2-FC Calc of REG Expansion'!L$44","v":0}]
[{"$f":"'LDC Info'!$E$14","v":0},0,2021,2020,2014,"Provincial Rate Protection",{"$f":"'App.2-FC Calc of REG Expansion'!M$17","v":2019},{"$f":"'App.2-FC Calc of REG Expansion'!O$44","v":0}]
[{"$f":"'LDC Info'!$E$14","v":0},0,2021,2020,2014,"Provincial Rate Protection",{"$f":"'App.2-FC Calc of REG Expansion'!P$17","v":2020},{"$f":"'App.2-FC Calc of REG Expansion'!R$44","v":0}]
[{"$f":"'LDC Info'!$E$14","v":0},0,2021,2020,2014,"Provincial Rate Protection",{"$f":"'App.2-FC Calc of REG Expansion'!S$17","v":2021},{"$f":"'App.2-FC Calc of REG Expansion'!U$44","v":0}]
[{"$f":"'LDC Info'!$E$14","v":0},0,2021,2020,2014,"Provincial Rate Protection",{"$f":"'App.2-FC Calc of REG Expansion'!V$17","v":2022},{"$f":"'App.2-FC Calc of REG Expansion'!X$44","v":0}]
[{"$f":"'LDC Info'!$E$14","v":0},0,2021,2020,2014,"Provincial Rate Protection",{"$f":"'App.2-FC Calc of REG Expansion'!Y$17","v":2023},{"$f":"'App.2-FC Calc of REG Expansion'!AA$44","v":0}]
[{"$f":"'LDC Info'!$E$14","v":0},0,2021,2020,2014,"Provincial Rate Protection",{"$f":"'App.2-FC Calc of REG Expansion'!AB$17","v":2024},{"$f":"'App.2-FC Calc of REG Expansion'!AD$44","v":0}]
[{"$f":"'LDC Info'!$E$14","v":0},0,2021,2020,2014,"Provincial Rate Protection",{"$f":"'App.2-FC Calc of REG Expansion'!AE$17","v":2025},{"$f":"'App.2-FC Calc of REG Expansion'!AG$44","v":0}]

{"sheet":"App.2-FA Proposed REG Invest.","index":20,"n_rows":101,"n_cols":12,"rows_kept":101,"cut":false,"hidden":false,"merged":[[16,0,16,10],[17,0,17,9],[18,0,18,8],[8,0,8,11],[9,0,9,11],[11,0,11,7],[12,0,12,7],[13,0,13,6],[14,0,14,6]]}
[null,null,null,null,null,null,null,null,null,null,"File Number:",0]
[null,null,null,null,null,null,null,null,null,null,"Exhibit:"]
[null,null,null,null,null,null,null,null,null,null,"Tab:"]
["TO BE UPDATED AT DRAFT RATE ORDER STAGE",null,null,null,null,null,null,null,null,null,"Schedule:"]
[null,null,null,null,null,null,null,null,null,null,"Page:"]
[]
[null,null,null,null,null,null,null,null,null,null,"Date:"]
[]
["Appendix 2-FA"]
["Renewable Generation Connection Investment Summary (past investments or over the future rate setting period)"]
[]
["Enter the details of the Renewable Generation Connection projects as described in the appropriate section of the Filing Requirements."]
["All costs entered on this page will be transferred to the appropriate cells in the appendices that follow."]
["For Part A, Renewable Enabling Improvements (REI), these amounts will be transferred to Appendix 2 - FB"]
["For Part B, Expansions, these amounts will be transferred to Appendix 2 - FC"]
[]
["If there are more than five projects proposed to be in-service in a certain year, please amend the tables below and ensure that the formulae for the Total Amounts in any given rate year are updated."]
["Based on the current methodology and allocation, amounts allocated represent 6% for REI Connection Investments and 17% for Expansion Investments. (EB-2009-0349, 6-10-2010, p. 15, note 9)"]
["Ensure that OM&A costs below are not included in Recoverable OM&A (App. 2-JA)"]
["There are two scenarios described below.  Separate sets of spreadsheets (2-FA, 2-FB, 2-FC) should be submited for each scenario as required."]
["Scenario 1:  ","Past Investments with No Recovery.  The distributor has made investments in the past (during the IRM Years), but has not received approval for these projects and therefore did not receive"]
[null,"revenue from the IESO under Regulation 330/09 and did not receive ratepayer revenue for the direct benefit portion of the investment."]
[null,"The WCA percentage, debt percentages, interest rates, kWh, tax rates, amortization period, CCA Class and percentage should correspond to the distributor's last Cost of Service approval. "]
[null,"The Direct Benefit portion of the calculated Revenue Requirement for each year should be summed and can be applied for recovery from the distributor's ratepayers through a rate rider."]
[null,"The Provincial Recovery portion of the calculated Revenue Requirement for each year should be summed and can be applied for recovery from the IESO through a separate order."]
[]
["Scenario 2:","Investments in the Test Year and Beyond.  Distributor plans to make investments in 2021 and/or beyond.  These investments should be added to 2-FA in the appropriate year."]
[null,"The WCA percentage, debt percentages, interest rates, kWh, tax rates, amortization period, CCA Class and percentage should correspond to the distributor's current application. "]
[]
["Part A",null,"","","","","","Test Year","","","",""]
["REI Investments (Direct Benefit at 6%)",null,{"$f":"D31-1","v":2016},{"$f":"E31-1","v":2017},{"$f":"F31-1","v":2018},{"$f":"G31-1","v":2019},{"$f":"H31-1","v":2020},{"$f":"'LDC Info'!$E$24","v":2021},{"$f":"H31+1","v":2022},{"$f":"I31+1","v":2023},{"$f":"J31+1","v":2024},{"$f":"K31+1","v":2025}]
["Project 1"]
["Name: REI Connection Project"]
["Capital Costs",null,0,0,0,0,0,0,0,0,0,0]
["Incremental OM&A (Start-Up)",null,0,0,0,0,0,0,0,0,0,0]
["Incremental OM&A (Ongoing)",null,0,0,0,0,0,0,0,0,0,0]
[]
["Project 2"]
["Name: REI Connection Project"]
["Capital Costs",null,0,0,0,0,0,0,0,0,0,0]
["Incremental OM&A (Start-Up)",null,0,0,0,0,0,0,0,0,0,0]
["Incremental OM&A (Ongoing)",null,0,0,0,0,0,0,0,0,0,0]
[]
["Project 3"]
["Name: REI Connection Project"]
["Capital Costs",null,0,0,0,0,0,0,0,0,0,0]
["Incremental OM&A (Start-Up)",null,0,0,0,0,0,0,0,0,0,0]
["Incremental OM&A (Ongoing)",null,0,0,0,0,0,0,0,0,0,0]
[]
["Project 4"]
["Name: REI Connection Project"]
["Capital Costs",null,0,0,0,0,0,0,0,0,0,0]
["Incremental OM&A (Start-Up)",null,0,0,0,0,0,0,0,0,0,0]
["Incremental OM&A (Ongoing)",null,0,0,0,0,0,0,0,0,0,0]
[]
["Project 5"]
["Name: REI Connection Project"]
["Capital Costs",null,0,0,0,0,0,0,0,0,0,0]
["Incremental OM&A (Start-Up)",null,0,0,0,0,0,0,0,0,0,0]
["Incremental OM&A (Ongoing)",null,0,0,0,0,0,0,0,0,0,0]
[]
["Total Capital Costs",null,{"$f":"SUM(C58,C52,C46,C40,C34)","v":0},0,0,0,0,0,0,0,0,0]
["Total Incremental OM&A (Start-Up)",null,0,0,0,0,0,0,0,0,0,0]
["Total Incremental OM&A (Ongoing)",null,0,0,0,0,0,0,0,0,0,0]
[]
[]
["Part B",null,"","","","","","Test Year","","","",""]
["Expansion Investments (Direct Benefit at 17%)",null,{"$f":"D68-1","v":2016},{"$f":"E68-1","v":2017},{"$f":"F68-1","v":2018},{"$f":"G68-1","v":2019},{"$f":"H68-1","v":2020},{"$f":"H31","v":2021},{"$f":"H68+1","v":2022},{"$f":"I68+1","v":2023},{"$f":"J68+1","v":2024},{"$f":"K68+1","v":2025}]
["Project 1"]
["Name: Expansion Connection Project"]
["Capital Costs",null,0,0,0,0,0,0,0,0,0,0]
["Incremental OM&A (Start-Up)",null,0,0,0,0,0,0,0,0,0,0]
["Incremental OM&A (Ongoing)",null,0,0,0,0,0,0,0,0,0,0]
[]
["Project 2"]
["Name: Expansion Connection Project"]
["Capital Costs",null,0,0,0,0,0,0,0,0,0,0]
["Incremental OM&A (Start-Up)",null,0,0,0,0,0,0,0,0,0,0]
["Incremental OM&A (Ongoing)",null,0,0,0,0,0,0,0,0,0,0]
[]
["Project 3"]
["Name: Expansion Connection Project"]
["Capital Costs",null,0,0,0,0,0,0,0,0,0,0]
["Incremental OM&A (Start-Up)",null,0,0,0,0,0,0,0,0,0,0]
["Incremental OM&A (Ongoing)",null,0,0,0,0,0,0,0,0,0,0]
[]
["Project 4"]
["Name: Expansion Connection Project"]
["Capital Costs",null,0,0,0,0,0,0,0,0,0,0]
["Incremental OM&A (Start-Up)",null,0,0,0,0,0,0,0,0,0,0]
["Incremental OM&A (Ongoing)",null,0,0,0,0,0,0,0,0,0,0]
[]
["Project 5"]
["Name: Expansion Connection Project"]
["Capital Costs",null,0,0,0,0,0,0,0,0,0,0]
["Incremental OM&A (Start-Up)",null,0,0,0,0,0,0,0,0,0,0]
["Incremental OM&A (Ongoing)",null,0,0,0,0,0,0,0,0,0,0]
[]
["Total Capital Costs",null,{"$f":"SUM(C95,C89,C83,C77,C71)","v":0},0,0,0,0,0,0,0,0,0]
["Total Incremental OM&A (Start-Up)",null,0,0,0,0,0,0,0,0,0,0]
["Total Incremental OM&A (Ongoing)",null,0,0,0,0,0,0,0,0,0,0]

{"sheet":"App.2-FB Calc of REG Improvemnt","index":21,"n_rows":96,"n_cols":36,"rows_kept":96,"cut":false,"hidden":false,"merged":[[15,18,15,20],[16,30,16,32],[47,0,48,15],[8,0,8,21],[9,0,9,21],[11,0,11,21],[12,0,12,21],[14,0,14,21],[16,3,16,5],[16,6,16,8],[16,9,16,11],[16,12,16,14],[16,15,16,17],[16,18,16,20],[16,21,16,23],[16,24,16,26],[16,33,16,35],[52,34,52,35],[52,31,52,32],[52,16,52,17],[50,0,50,1],[52,4,52,5],[52,7,52,8],[52,10,52,11],[52,13,52,14],[51,16,51,17],[16,27,16,29],[52,19,52,20],[52,22,52,23],[52,25,52,26],[52,28,52,29],[51,19,51,20]]}
[null,null,null,null,null,null,null,null,null,null,null,null,null,null,null,null,null,"File Number:",0]
[null,null,null,null,null,null,null,null,null,null,null,null,null,null,null,null,null,"Exhibit:"]
[null,null,null,null,null,null,null,null,null,null,null,null,null,null,null,null,null,"Tab:"]
["TO BE UPDATED AT DRAFT RATE ORDER STAGE",null,null,null,null,null,null,null,null,null,null,null,null,null,null,null,null,"Schedule:"]
[null,null,null,null,null,null,null,null,null,null,null,null,null,null,null,null,null,"Page:"]
[]
[null,null,null,null,null,null,null,null,null,null,null,null,null,null,null,null,null,"Date:"]
[]
["Appendix 2-FB"]
["Calculation of Renewable Generation Connection Direct Benefits/Provincial Amount: Renewable Enabling Improvement Investments"]
[]
["This table will calculate the distributor/provincial shares of the investments entered in Part A of Appendix 2-FA."]
["Enter values in green shaded cells: WCA percentage, debt percentages, interest rates, kWh, tax rates, amortization period, CCA Class and percentage."]
["For historical investments, enter these variables that were approved in your last cost of service test year.  For 2021 and beyond, enter variables as in the application."]
["Rate Riders related to the direct benefit portion of the renewable investments are not calculated for the Test Year as these assets and costs are already in the distributor's rate base/revenue requirement."]
[null,null,null,null,null,null,null,null,null,null,null,null,null,null,null,null,null,null,"Test Year"]
[null,null,null,{"$f":"G17-1","v":2016},null,null,{"$f":"J17-1","v":2017},null,null,{"$f":"M17-1","v":2018},null,null,{"$f":"P17-1","v":2019},null,null,{"$f":"S17-1","v":2020},null,null,{"$f":"'LDC Info'!$E$24","v":2021},null,null,{"$f":"S17+1","v":2022},null,null,{"$f":"V17+1","v":2023},2016,null,{"$f":"Y17+1","v":2024},null,null,{"$f":"AB17+1","v":2025},null,null,{"$f":"AE17+1","v":2026}]
[null,null,null,null,"Direct Benefit","Provincial",null,"Direct Benefit","Provincial",null,"Direct Benefit","Provincial",null,"Direct Benefit","Provincial",null,"Direct Benefit","Provincial",null,"Direct Benefit","Provincial",null,"Direct Benefit","Provincial",null,"Direct Benefit","Provincial",null,"Direct Benefit","Provincial",null,"Direct Benefit","Provincial",null,"Direct Benefit","Provincial"]
[null,null,null,"Total",0.06,0.94,"Total",0.06,0.94,"Total",0.06,0.94,"Total",0.06,0.94,"Total",0.06,0.94,"Total",0.06,0.94,"Total",0.06,0.94,"Total",0.06,0.94,"Total",0.06,0.94,"Total",0.06,0.94,"Total",0.06,0.94]
["Net Fixed Assets (average)",null,null,{"$f":"E83","v":0},{"$f":"D20*E19","v":0},{"$f":"D20*F19","v":0},{"$f":"F83","v":0},{"$f":"G20*H19","v":0},{"$f":"G20*I19","v":0},{"$f":"G83","v":0},{"$f":"J20*K19","v":0},{"$f":"J20*L19","v":0},{"$f":"H83","v":0},{"$f":"M20*N19","v":0},{"$f":"M20*O19","v":0},{"$f":"I83","v":0},{"$f":"P20*Q19","v":0},{"$f":"P20*R19","v":0},{"$f":"J83","v":0},{"$f":"S20*T19","v":0},{"$f":"S20*U19","v":0},{"$f":"K83","v":0},{"$f":"V20*W19","v":0},{"$f":"V20*X19","v":0},{"$f":"L83","v":0},{"$f":"Y20*Z19","v":0},{"$f":"Y20*AA19","v":0},{"$f":"M83","v":0},{"$f":"AB20*AC19","v":0},{"$f":"AB20*AD19","v":0},{"$f":"N83","v":0},{"$f":"AE20*AF19","v":0},{"$f":"AE20*AG19","v":0},{"$f":"O83","v":0},{"$f":"AH20*AI19","v":0},{"$f":"AH20*AJ19","v":0}]
["Incremental OM&A (on-going, N/A for Provincial Recovery)",null,null,0,{"$f":"D21*E19","v":0},{"$f":"D21*F19","v":0},0,{"$f":"G21*H19","v":0},{"$f":"G21*I19","v":0},0,{"$f":"J21*K19","v":0},{"$f":"J21*L19","v":0},0,{"$f":"M21*N19","v":0},{"$f":"M21*O19","v":0},0,{"$f":"P21*Q19","v":0},{"$f":"P21*R19","v":0},0,{"$f":"S21*T19","v":0},{"$f":"S21*U19","v":0},0,{"$f":"V21*W19","v":0},{"$f":"V21*X19","v":0},0,{"$f":"Y21*Z19","v":0},{"$f":"Y21*AA19","v":0},0,{"$f":"AB21*AC19","v":0},{"$f":"AB21*AD19","v":0},0,{"$f":"AE21*AF19","v":0},{"$f":"AE21*AG19","v":0},0,{"$f":"AH21*AI19","v":0},{"$f":"AH21*AJ19","v":0}]
["Incremental OM&A (start-up, applicable for Provincial Recovery)",null,null,0,{"$f":"D22*E19","v":0},{"$f":"D22*F19","v":0},0,{"$f":"G22*H19","v":0},{"$f":"G22*I19","v":0},0,{"$f":"J22*K19","v":0},{"$f":"J22*L19","v":0},0,{"$f":"M22*N19","v":0},{"$f":"M22*O19","v":0},0,{"$f":"P22*Q19","v":0},{"$f":"P22*R19","v":0},0,{"$f":"S22*T19","v":0},{"$f":"S22*U19","v":0},0,{"$f":"V22*W19","v":0},{"$f":"V22*X19","v":0},0,{"$f":"Y22*Z19","v":0},{"$f":"Y22*AA19","v":0},0,{"$f":"AB22*AC19","v":0},{"$f":"AB22*AD19","v":0},0,{"$f":"AE22*AF19","v":0},{"$f":"AE22*AG19","v":0},0,{"$f":"AH22*AI19","v":0},{"$f":"AH22*AJ19","v":0}]
["Rebasing Year vs. Test Year",{"$f":"'LDC Info'!E28","v":2014},{"$f":"'LDC Info'!E24","v":2021}]
["Allowance for Working Capital (enter rate)",null,null,null,{"$f":"IF(AND(D$17>=$B$23, D$17<$C$23),(E21+E22)*$B$24,(E21+E22)*$C$24)","v":0},{"$f":"IF(AND(D$17>=$B$23, D$17<$C$23),(F22)*$B$24,(F22)*$C$24)","v":0},null,{"$f":"IF(AND(G$17>=$B$23, G$17<$C$23),(H21+H22)*$B$24,(H21+H22)*$C$24)","v":0},{"$f":"IF(AND(G$17>=$B$23, G$17<$C$23),(I22)*$B$24,(I22)*$C$24)","v":0},null,{"$f":"IF(AND(J$17>=$B$23, J$17<$C$23),(K21+K22)*$B$24,(K21+K22)*$C$24)","v":0},{"$f":"IF(AND(J$17>=$B$23, J$17<$C$23),(L22)*$B$24,(L22)*$C$24)","v":0},null,{"$f":"IF(AND(M$17>=$B$23, M$17<$C$23),(N21+N22)*$B$24,(N21+N22)*$C$24)","v":0},{"$f":"IF(AND(M$17>=$B$23, M$17<$C$23),(O22)*$B$24,(O22)*$C$24)","v":0},null,{"$f":"IF(AND(P$17>=$B$23, P$17<$C$23),(Q21+Q22)*$B$24,(Q21+Q22)*$C$24)","v":0},{"$f":"IF(AND(P$17>=$B$23, P$17<$C$23),(R22)*$B$24,(R22)*$C$24)","v":0},null,{"$f":"IF(AND(S$17>=$B$23, S$17<$C$23),(T21+T22)*$B$24,(T21+T22)*$C$24)","v":0},{"$f":"IF(AND(S$17>=$B$23, S$17<$C$23),(U22)*$B$24,(U22)*$C$24)","v":0},null,{"$f":"IF(AND(V$17>=$B$23, V$17<$C$23),(W21+W22)*$B$24,(W21+W22)*$C$24)","v":0},{"$f":"IF(AND(V$17>=$B$23, V$17<$C$23),(X22)*$B$24,(X22)*$C$24)","v":0},null,{"$f":"IF(AND(Y$17>=$B$23, Y$17<$C$23),(Z21+Z22)*$B$24,(Z21+Z22)*$C$24)","v":0},{"$f":"IF(AND(Y$17>=$B$23, Y$17<$C$23),(AA22)*$B$24,(AA22)*$C$24)","v":0},null,{"$f":"IF(AND(AB$17>=$B$23, AB$17<$C$23),(AC21+AC22)*$B$24,(AC21+AC22)*$C$24)","v":0},{"$f":"IF(AND(AB$17>=$B$23, AB$17<$C$23),(AD22)*$B$24,(AD22)*$C$24)","v":0},null,{"$f":"IF(AND(AE$17>=$B$23, AE$17<$C$23),(AF21+AF22)*$B$24,(AF21+AF22)*$C$24)","v":0},{"$f":"IF(AND(AE$17>=$B$23, AE$17<$C$23),(AG22)*$B$24,(AG22)*$C$24)","v":0},null,{"$f":"IF(AND(AH$17>=$B$23, AH$17<$C$23),(AI21+AI22)*$B$24,(AI21+AI22)*$C$24)","v":0},{"$f":"IF(AND(AH$17>=$B$23, AH$17<$C$23),(AJ22)*$B$24,(AJ22)*$C$24)","v":0}]
["Rate Base",null,null,null,{"$f":"SUM(E20+E24)","v":0},{"$f":"SUM(F20+F24)","v":0},null,{"$f":"SUM(H20+H24)","v":0},{"$f":"SUM(I20+I24)","v":0},null,{"$f":"SUM(K20+K24)","v":0},{"$f":"SUM(L20+L24)","v":0},null,{"$f":"SUM(N20+N24)","v":0},{"$f":"SUM(O20+O24)","v":0},null,{"$f":"SUM(Q20+Q24)","v":0},{"$f":"SUM(R20+R24)","v":0},null,{"$f":"SUM(T20+T24)","v":0},{"$f":"SUM(U20+U24)","v":0},null,{"$f":"SUM(W20+W24)","v":0},{"$f":"SUM(X20+X24)","v":0},null,{"$f":"SUM(Z20+Z24)","v":0},{"$f":"SUM(AA20+AA24)","v":0},null,{"$f":"SUM(AC20+AC24)","v":0},{"$f":"SUM(AD20+AD24)","v":0},null,{"$f":"SUM(AF20+AF24)","v":0},{"$f":"SUM(AG20+AG24)","v":0},null,{"$f":"SUM(AI20+AI24)","v":0},{"$f":"SUM(AJ20+AJ24)","v":0}]
[]
["Rebasing Year vs. Test Year",{"$f":"B23","v":2014},{"$f":"C23","v":2021}]
["Deemed ST Debt ",0.04,0.04,null,{"$f":"E25*$B$28","v":0},{"$f":"F25*$B$28","v":0},null,{"$f":"H25*$B$28","v":0},{"$f":"I25*$B$28","v":0},null,{"$f":"K25*$B$28","v":0},{"$f":"L25*$B$28","v":0},null,{"$f":"N25*$B$28","v":0},{"$f":"O25*$B$28","v":0},null,{"$f":"Q25*$B$28","v":0},{"$f":"R25*$B$28","v":0},null,{"$f":"T25*$C$28","v":0},{"$f":"U25*$C$28","v":0},null,{"$f":"W25*$C$28","v":0},{"$f":"X25*$C$28","v":0},null,{"$f":"Z25*$C$28","v":0},{"$f":"AA25*$C$28","v":0},null,{"$f":"AC25*$C$28","v":0},{"$f":"AD25*$C$28","v":0},null,{"$f":"AF25*$C$28","v":0},{"$f":"AG25*$C$28","v":0},null,{"$f":"AI25*$C$28","v":0},{"$f":"AJ25*$C$28","v":0}]
["Deemed LT Debt ",0.56000000000000005,0.56000000000000005,null,{"$f":"E25*$B$29","v":0},{"$f":"F25*$B$29","v":0},null,{"$f":"H25*$B$29","v":0},{"$f":"I25*$B$29","v":0},null,{"$f":"K25*$B$29","v":0},{"$f":"L25*$B$29","v":0},null,{"$f":"N25*$B$29","v":0},{"$f":"O25*$B$29","v":0},null,{"$f":"Q25*$B$29","v":0},{"$f":"R25*$B$29","v":0},null,{"$f":"T25*$C$29","v":0},{"$f":"U25*$C$29","v":0},null,{"$f":"W25*$C$29","v":0},{"$f":"X25*$C$29","v":0},null,{"$f":"Z25*$C$29","v":0},{"$f":"AA25*$C$29","v":0},null,{"$f":"AC25*$C$29","v":0},{"$f":"AD25*$C$29","v":0},null,{"$f":"AF25*$C$29","v":0},{"$f":"AG25*$C$29","v":0},null,{"$f":"AI25*$C$29","v":0},{"$f":"AJ25*$C$29","v":0}]
["Deemed Equity ",0.4,0.4,null,{"$f":"E25*$B$30","v":0},{"$f":"F25*$B$30","v":0},null,{"$f":"H25*$B$30","v":0},{"$f":"I25*$B$30","v":0},null,{"$f":"K25*$B$30","v":0},{"$f":"L25*$B$30","v":0},null,{"$f":"N25*$B$30","v":0},{"$f":"O25*$B$30","v":0},null,{"$f":"Q25*$B$30","v":0},{"$f":"R25*$B$30","v":0},null,{"$f":"T25*$C$30","v":0},{"$f":"U25*$C$30","v":0},null,{"$f":"W25*$C$30","v":0},{"$f":"X25*$C$30","v":0},null,{"$f":"Z25*$C$30","v":0},{"$f":"AA25*$C$30","v":0},null,{"$f":"AC25*$C$30","v":0},{"$f":"AD25*$C$30","v":0},null,{"$f":"AF25*$C$30","v":0},{"$f":"AG25*$C$30","v":0},null,{"$f":"AI25*$C$30","v":0},{"$f":"AJ25*$C$30","v":0}]
[]
["ST Interest (enter rate)",null,null,null,{"$f":"E28*$B32","v":0},0,null,0,0,null,0,0,null,0,0,null,0,0,null,{"$f":"T28*$C32","v":0},0,null,{"$f":"W28*$C32","v":0},0,null,{"$f":"Z28*$C32","v":0},0,null,{"$f":"AC28*$C32","v":0},0,null,{"$f":"AF28*$C32","v":0},0,null,{"$f":"AI28*$C32","v":0},0]
["LT Interest (enter rate)",null,null,null,0,0,null,0,0,null,0,0,null,0,0,null,0,0,null,0,0,null,0,0,null,0,0,null,0,0,null,0,0,null,{"$f":"AI29*$C33","v":0},0]
["Return on Equity (enter rate)",null,null,null,0,0,null,0,0,null,0,0,null,0,0,null,0,0,null,0,0,null,0,0,null,0,0,null,0,0,null,0,0,null,{"$f":"AI30*$C34","v":0},0]
["Cost of Capital Total",null,null,null,{"$f":"SUM(E32:E34)","v":0},{"$f":"SUM(F32:F34)","v":0},null,{"$f":"SUM(H32:H34)","v":0},{"$f":"SUM(I32:I34)","v":0},null,{"$f":"SUM(K32:K34)","v":0},{"$f":"SUM(L32:L34)","v":0},null,{"$f":"SUM(N32:N34)","v":0},{"$f":"SUM(O32:O34)","v":0},null,{"$f":"SUM(Q32:Q34)","v":0},{"$f":"SUM(R32:R34)","v":0},null,{"$f":"SUM(T32:T34)","v":0},{"$f":"SUM(U32:U34)","v":0},null,{"$f":"SUM(W32:W34)","v":0},{"$f":"SUM(X32:X34)","v":0},null,{"$f":"SUM(Z32:Z34)","v":0},{"$f":"SUM(AA32:AA34)","v":0},null,{"$f":"SUM(AC32:AC34)","v":0},{"$f":"SUM(AD32:AD34)","v":0},null,{"$f":"SUM(AF32:AF34)","v":0},{"$f":"SUM(AG32:AG34)","v":0},null,{"$f":"SUM(AI32:AI34)","v":0},{"$f":"SUM(AJ32:AJ34)","v":0}]
[]
["OM&A",null,null,null,{"$f":"E21+E22","v":0},{"$f":"F22","v":0},null,{"$f":"H21+H22","v":0},{"$f":"I22","v":0},null,{"$f":"K21+K22","v":0},{"$f":"L22","v":0},null,{"$f":"N21+N22","v":0},{"$f":"O22","v":0},null,{"$f":"Q21+Q22","v":0},{"$f":"R22","v":0},null,{"$f":"T21+T22","v":0},{"$f":"U22","v":0},null,{"$f":"W21+W22","v":0},{"$f":"X22","v":0},null,{"$f":"Z21+Z22","v":0},{"$f":"AA22","v":0},null,{"$f":"AC21+AC22","v":0},{"$f":"AD22","v":0},null,{"$f":"AF21+AF22","v":0},{"$f":"AG22","v":0},null,{"$f":"AI21+AI22","v":0},{"$f":"AJ22","v":0}]
["Amortization",null,null,{"$f":"+E77+E78","v":0},{"$f":"D38*E$19","v":0},{"$f":"D38*F$19","v":0},{"$f":"+F77+F78","v":0},{"$f":"G38*H$19","v":0},{"$f":"G38*I$19","v":0},{"$f":"+G77+G78","v":0},{"$f":"J38*K$19","v":0},{"$f":"J38*L$19","v":0},{"$f":"+H77+H78","v":0},{"$f":"M38*N$19","v":0},{"$f":"M38*O$19","v":0},{"$f":"+I77+I78","v":0},{"$f":"P38*Q$19","v":0},{"$f":"P38*R$19","v":0},{"$f":"+J77+J78","v":0},{"$f":"S38*T$19","v":0},{"$f":"S38*U$19","v":0},{"$f":"+K77+K78","v":0},{"$f":"V38*W$19","v":0},{"$f":"V38*X$19","v":0},{"$f":"+L77+L78","v":0},{"$f":"Y38*Z$19","v":0},{"$f":"Y38*AA$19","v":0},{"$f":"+M77+M78","v":0},{"$f":"AB38*AC$19","v":0},{"$f":"AB38*AD$19","v":0},{"$f":"+N77+N78","v":0},{"$f":"AE38*AF$19","v":0},{"$f":"AE38*AG$19","v":0},{"$f":"+O77+O78","v":0},{"$f":"AH38*AI$19","v":0},{"$f":"AH38*AJ$19","v":0}]
["Grossed-up PILs",null,null,null,{"$f":"+E66","v":0},{"$f":"+F66","v":0},null,{"$f":"+H66","v":0},{"$f":"+I66","v":0},null,{"$f":"+K66","v":0},{"$f":"+L66","v":0},null,{"$f":"+N66","v":0},{"$f":"+O66","v":0},null,{"$f":"+Q66","v":0},{"$f":"+R66","v":0},null,{"$f":"+T66","v":0},{"$f":"+U66","v":0},null,{"$f":"+W66","v":0},{"$f":"+X66","v":0},null,{"$f":"+Z66","v":0},{"$f":"+AA66","v":0},null,{"$f":"+AC66","v":0},{"$f":"+AD66","v":0},null,{"$f":"+AF66","v":0},{"$f":"+AG66","v":0},null,{"$f":"+AI66","v":0},{"$f":"+AJ66","v":0}]
[]
["Revenue Requirement",null,null,null,{"$f":"SUM(E35:E39)","v":0},{"$f":"SUM(F35:F39)","v":0},null,{"$f":"SUM(H35:H39)","v":0},0,null,{"$f":"SUM(K35:K39)","v":0},0,null,{"$f":"SUM(N35:N39)","v":0},0,null,{"$f":"SUM(Q35:Q39)","v":0},0,null,{"$f":"SUM(T35:T39)","v":0},0,null,{"$f":"SUM(W35:W39)","v":0},0,null,{"$f":"SUM(Z35:Z39)","v":0},0,null,{"$f":"SUM(AC35:AC39)","v":0},0,null,{"$f":"SUM(AF35:AF39)","v":0},0,null,{"$f":"SUM(AI35:AI39)","v":0},0]
[]
[]
["Provincial Rate Protection",null,null,null,null,{"$f":"F41","v":0},null,null,{"$f":"I41","v":0},null,null,{"$f":"L41","v":0},null,null,{"$f":"O41","v":0},null,null,{"$f":"R41","v":0},null,null,{"$f":"U41","v":0},null,null,{"$f":"X41","v":0},null,null,{"$f":"AA41","v":0},null,null,{"$f":"AD41","v":0},null,null,{"$f":"AG41","v":0},null,null,{"$f":"AJ41","v":0}]
[]
["Monthly Amount Paid by IESO",null,null,null,null,{"$f":"F44/12","v":0},null,null,{"$f":"I44/12","v":0},null,null,{"$f":"L44/12","v":0},null,null,{"$f":"O44/12","v":0},null,null,{"$f":"R44/12","v":0},null,null,{"$f":"U44/12","v":0},null,null,{"$f":"X44/12","v":0},null,null,{"$f":"AA44/12","v":0},null,null,{"$f":"AD44/12","v":0},null,null,{"$f":"AG44/12","v":0},null,null,{"$f":"AJ44/12","v":0}]
[]
["Note 1: The distributor should follow the regulatory accounting set out in the Accounting Procedure Handbook Guidance FAQs issued in March 2015. Q10 of the APH FAQs states that: “For approved eligible investments as defined under O.Reg. 330/09 under the OEB Act, a variance account will continue to be used for the purpose of recording variances between the revenue requirement based on actual costs of approved eligible investments and the revenue received from the IESO.” The answer for Q10 provides the accounting guidance for this variance account: “Distributors that have included eligible investments to connect qualifying facilities in their DS plans are to establish the variance Account 1533 Renewable Generation Connection Funding Adder Deferral Account, Sub-account Provincial Rate Protection Payment Variances following OEB approval for investments forecast to enter service beyond the test year for purposes of implementing rate protection pursuant to O.Reg. 330/09. The purpose of this variance account is to track the variance between the distributor’s revenue requirement associated with the portion of the actual capital and/or operating costs that are eligible for rate protection, as incurred by the distributor for eligible renewable enabling and expansion investments, and the rate protection payments collected from the IESO.” The answer further provides the journal entries to record the variances. Distributors should follow the instructions in the answer for recording the journal entries in the variance account 1533."]
[]
["Note 2: For the Test Year, Costs and Revenues of the Direct Benefit are to be included in the test year applicant Rate Base and Revenues."]
[]
["PILs Calculation",null,null,null,null,null,null,null,null,null,null,null,null,null,null,null,null,null,null,"Test Year"]
[null,null,null,null,{"$f":"G17-1","v":2016},null,null,{"$f":"G17","v":2017},null,null,{"$f":"J17","v":2018},null,null,{"$f":"M17","v":2019},null,null,{"$f":"P17","v":2020},null,null,{"$f":"S17","v":2021},null,null,{"$f":"V17","v":2022},null,null,{"$f":"Y17","v":2023},null,null,{"$f":"AB17","v":2024},null,null,{"$f":"AE17","v":2025},null,null,{"$f":"AH17","v":2026}]
["Income Tax",null,null,null,"Direct Benefit","Provincial",null,"Direct Benefit","Provincial",null,"Direct Benefit","Provincial",null,"Direct Benefit","Provincial",null,"Direct Benefit","Provincial",null,"Direct Benefit","Provincial",null,"Direct Benefit","Provincial",null,"Direct Benefit","Provincial",null,"Direct Benefit","Provincial",null,"Direct Benefit","Provincial",null,"Direct Benefit","Provincial"]
[null,null,null,null,null,null,null,null,null,null,null,null,null,null,null,null,null,null,null,null,null,null,null,null,null,null,null,"Total",null,null,"Total",null,null,"Total"]
["Net Income - ROE on Rate Base",null,null,null,{"$f":"E34","v":0},{"$f":"F34","v":0},null,{"$f":"H34","v":0},{"$f":"I34","v":0},null,{"$f":"K34","v":0},{"$f":"L34","v":0},null,{"$f":"N34","v":0},{"$f":"O34","v":0},null,{"$f":"Q34","v":0},{"$f":"R34","v":0},null,{"$f":"T34","v":0},{"$f":"U34","v":0},null,{"$f":"W34","v":0},{"$f":"X34","v":0},null,{"$f":"Z34","v":0},{"$f":"AA34","v":0},null,{"$f":"AC34","v":0},{"$f":"AD34","v":0},null,{"$f":"AF34","v":0},{"$f":"AG34","v":0},null,{"$f":"AI34","v":0},{"$f":"AJ34","v":0}]
["Amortization (6% DB and 94% P)",null,null,null,{"$f":"E38","v":0},{"$f":"F38","v":0},null,{"$f":"H38","v":0},{"$f":"I38","v":0},null,{"$f":"K38","v":0},{"$f":"L38","v":0},null,{"$f":"N38","v":0},{"$f":"O38","v":0},null,{"$f":"Q38","v":0},{"$f":"R38","v":0},null,{"$f":"T38","v":0},{"$f":"U38","v":0},null,{"$f":"W38","v":0},{"$f":"X38","v":0},null,{"$f":"Z38","v":0},{"$f":"AA38","v":0},null,{"$f":"AC38","v":0},{"$f":"AD38","v":0},null,{"$f":"AF38","v":0},{"$f":"AG38","v":0},null,{"$f":"AI38","v":0},{"$f":"AJ38","v":0}]
["CCA (6% DB and 94% P)",null,null,null,{"$f":"-E95*$E$19","v":0},{"$f":"-E95*$F$19","v":0},null,{"$f":"-F95*$E$19","v":0},{"$f":"-F95*$F$19","v":0},null,{"$f":"-G95*$E$19","v":0},{"$f":"-G95*$F$19","v":0},null,{"$f":"-H95*$E$19","v":0},{"$f":"-H95*$F$19","v":0},null,{"$f":"-I95*$E$19","v":0},{"$f":"-I95*$F$19","v":0},null,{"$f":"-J95*$E$19","v":0},{"$f":"-J95*$F$19","v":0},null,{"$f":"-K95*$E$19","v":0},{"$f":"-K95*$F$19","v":0},null,{"$f":"-L95*$E$19","v":0},{"$f":"-L95*$F$19","v":0},null,{"$f":"-M95*$E$19","v":0},{"$f":"-M95*$F$19","v":0},null,{"$f":"-N95*$E$19","v":0},{"$f":"-N95*$F$19","v":0},null,{"$f":"-Q95*$E$19","v":0},{"$f":"-Q95*$F$19","v":0}]
["Taxable income",null,null,null,{"$f":"SUM(E56:E58)","v":0},{"$f":"SUM(F56:F58)","v":0},null,{"$f":"SUM(H56:H58)","v":0},0,null,{"$f":"SUM(K56:K58)","v":0},0,null,{"$f":"SUM(N56:N58)","v":0},0,null,{"$f":"SUM(Q56:Q58)","v":0},0,null,{"$f":"SUM(T56:T58)","v":0},0,null,{"$f":"SUM(W56:W58)","v":0},0,null,{"$f":"SUM(Z56:Z58)","v":0},{"$f":"SUM(AA56:AA58)","v":0},null,{"$f":"SUM(AC56:AC58)","v":0},{"$f":"SUM(AD56:AD58)","v":0},null,{"$f":"SUM(AF56:AF58)","v":0},{"$f":"SUM(AG56:AG58)","v":0},null,{"$f":"SUM(AI56:AI58)","v":0},{"$f":"SUM(AJ56:AJ58)","v":0}]
[null,{"$f":"B27","v":2014},{"$f":"C27","v":2021}]
["Tax Rate  (to be entered)",null,null,null,{"$f":"IF(AND(E$53>=$B$60, E$53<$C$60),$B$61,$C$61)","v":0},{"$f":"IF(AND(E$53>=$B$60, E$53<$C$60),$B$61,$C$61)","v":0},null,{"$f":"IF(AND(H$53>=$B$60, H$53<$C$60),$B$61,$C$61)","v":0},{"$f":"IF(AND(H$53>=$B$60, H$53<$C$60),$B$61,$C$61)","v":0},null,{"$f":"IF(AND(K$53>=$B$60, K$53<$C$60),$B$61,$C$61)","v":0},{"$f":"IF(AND(K$53>=$B$60, K$53<$C$60),$B$61,$C$61)","v":0},null,{"$f":"IF(AND(N$53>=$B$60, N$53<$C$60),$B$61,$C$61)","v":0},{"$f":"IF(AND(N$53>=$B$60, N$53<$C$60),$B$61,$C$61)","v":0},null,{"$f":"IF(AND(Q$53>=$B$60, Q$53<$C$60),$B$61,$C$61)","v":0},{"$f":"IF(AND(Q$53>=$B$60, Q$53<$C$60),$B$61,$C$61)","v":0},null,{"$f":"IF(AND(T$53>=$B$60, T$53<$C$60),$B$61,$C$61)","v":0},{"$f":"IF(AND(T$53>=$B$60, T$53<$C$60),$B$61,$C$61)","v":0},null,{"$f":"IF(AND(W$53>=$B$60, W$53<$C$60),$B$61,$C$61)","v":0},{"$f":"IF(AND(W$53>=$B$60, W$53<$C$60),$B$61,$C$61)","v":0},null,{"$f":"IF(AND(Z$53>=$B$60, Z$53<$C$60),$B$61,$C$61)","v":0},{"$f":"IF(AND(Z$53>=$B$60, Z$53<$C$60),$B$61,$C$61)","v":0},null,{"$f":"IF(AND(AC$53>=$B$60, AC$53<$C$60),$B$61,$C$61)","v":0},{"$f":"IF(AND(AC$53>=$B$60, AC$53<$C$60),$B$61,$C$61)","v":0},null,{"$f":"IF(AND(AF$53>=$B$60, AF$53<$C$60),$B$61,$C$61)","v":0},{"$f":"IF(AND(AF$53>=$B$60, AF$53<$C$60),$B$61,$C$61)","v":0},null,{"$f":"IF(AND(AI$53>=$B$60, AI$53<$C$60),$B$61,$C$61)","v":0},{"$f":"IF(AND(AI$53>=$B$60, AI$53<$C$60),$B$61,$C$61)","v":0}]
[]
["Income Taxes Payable",null,null,null,{"$f":"E59*E61","v":0},{"$f":"F59*F61","v":0},null,{"$f":"H59*H61","v":0},{"$f":"I59*I61","v":0},null,{"$f":"K59*K61","v":0},{"$f":"L59*L61","v":0},null,{"$f":"N59*N61","v":0},{"$f":"O59*O61","v":0},null,{"$f":"Q59*Q61","v":0},{"$f":"R59*R61","v":0},null,{"$f":"T59*T61","v":0},{"$f":"U59*U61","v":0},null,{"$f":"W59*W61","v":0},{"$f":"X59*X61","v":0},null,{"$f":"Z59*Z61","v":0},{"$f":"AA59*AA61","v":0},null,{"$f":"AC59*AC61","v":0},{"$f":"AD59*AD61","v":0},null,{"$f":"AF59*AF61","v":0},{"$f":"AG59*AG61","v":0},null,{"$f":"AI59*AI61","v":0},{"$f":"AJ59*AJ61","v":0}]
["Gross Up"]
["Income Taxes Payable",null,null,null,{"$f":"E63/(1-E61)","v":0},{"$f":"F63/(1-F61)","v":0},null,{"$f":"H63/(1-H61)","v":0},{"$f":"I63/(1-I61)","v":0},null,{"$f":"K63/(1-K61)","v":0},{"$f":"L63/(1-L61)","v":0},null,{"$f":"N63/(1-N61)","v":0},{"$f":"O63/(1-O61)","v":0},null,{"$f":"Q63/(1-Q61)","v":0},{"$f":"R63/(1-R61)","v":0},null,{"$f":"T63/(1-T61)","v":0},{"$f":"U63/(1-U61)","v":0},null,{"$f":"W63/(1-W61)","v":0},{"$f":"X63/(1-X61)","v":0},null,{"$f":"Z63/(1-Z61)","v":0},{"$f":"AA63/(1-AA61)","v":0},null,{"$f":"AC63/(1-AC61)","v":0},{"$f":"AD63/(1-AD61)","v":0},null,{"$f":"AF63/(1-AF61)","v":0},{"$f":"AG63/(1-AG61)","v":0},null,{"$f":"AI63/(1-AI61)","v":0},{"$f":"AJ63/(1-AJ61)","v":0}]
["Grossed Up PILs",null,null,null,{"$f":"+E65","v":0},{"$f":"+F65","v":0},null,{"$f":"+H65","v":0},{"$f":"+I65","v":0},null,{"$f":"+K65","v":0},0,null,{"$f":"+N65","v":0},0,null,{"$f":"+Q65","v":0},0,null,{"$f":"+T65","v":0},0,null,{"$f":"+W65","v":0},0,null,{"$f":"+Z65","v":0},0,null,{"$f":"+AC65","v":0},0,null,{"$f":"+AF65","v":0},0,null,{"$f":"+AI65","v":0},0]
[]
[null,null,null,null,null,null,null,null,null,"Test Year"]
[null,null,null,null,{"$f":"F69-1","v":2016},{"$f":"G69-1","v":2017},{"$f":"H69-1","v":2018},{"$f":"I69-1","v":2019},{"$f":"J69-1","v":2020},{"$f":"'LDC Info'!E24","v":2021},{"$f":"J69+1","v":2022},{"$f":"K69+1","v":2023},{"$f":"L69+1","v":2024},{"$f":"M69+1","v":2025},{"$f":"N69+1","v":2026}]
["Net Fixed Assets"]
["Enter applicable amortization in years:",40]
["Opening Gross Fixed Assets",null,null,null,null,{"$f":"E74","v":0},0,0,0,0,0,0,0,0,0]
["Capital Additions",null,null,null,{"$f":"'App.2-FA Proposed REG Invest.'!C62","v":0},{"$f":"'App.2-FA Proposed REG Invest.'!D62","v":0},{"$f":"'App.2-FA Proposed REG Invest.'!E62","v":0},{"$f":"'App.2-FA Proposed REG Invest.'!F62","v":0},{"$f":"'App.2-FA Proposed REG Invest.'!G62","v":0},{"$f":"'App.2-FA Proposed REG Invest.'!H62","v":0},{"$f":"'App.2-FA Proposed REG Invest.'!I62","v":0},{"$f":"'App.2-FA Proposed REG Invest.'!J62","v":0},{"$f":"'App.2-FA Proposed REG Invest.'!K62","v":0},{"$f":"'App.2-FA Proposed REG Invest.'!L62","v":0},{"$f":"'App.2-FA Proposed REG Invest.'!M62","v":0}]
["Closing Gross Fixed Assets",null,null,null,{"$f":"SUM(E72:E73)","v":0},0,0,0,0,0,0,0,0,0,{"$f":"SUM(O72:O73)","v":0}]
[]
["Opening Accumulated Amortization",null,null,null,null,{"$f":"+E79","v":0},{"$f":"+F79","v":0},0,0,0,0,0,0,0,0]
["Current Year Amortization (before additions)",null,null,null,{"$f":"IF(ISERROR(E72/$B$71), 0, E72/$B$71)","v":0},{"$f":"IF(ISERROR(F72/$B$71), 0, F72/$B$71)","v":0},0,0,0,0,0,0,0,0,{"$f":"IF(ISERROR(O72/$B$71), 0, O72/$B$71)","v":0}]
["Capital Additions Amortization (half year)",null,null,null,{"$f":"E73/$B$71/2","v":0},{"$f":"F73/$B$71/2","v":0},0,0,0,0,0,0,0,0,{"$f":"O73/$B$71/2","v":0}]
["Closing Accumulated Amortization",null,null,null,{"$f":"SUM(E76+E77+E78)","v":0},0,0,0,0,0,0,0,0,0,{"$f":"SUM(O76+O77+O78)","v":0}]
[]
["Opening Net Fixed Assets",null,null,null,{"$f":"E72-E76","v":0},0,0,0,0,0,0,0,0,0,{"$f":"O72-O76","v":0}]
["Closing Net Fixed Assets",null,null,null,{"$f":"E74-E79","v":0},0,0,0,0,0,0,0,0,0,{"$f":"O74-O79","v":0}]
["Average Net Fixed Assets",null,null,null,{"$f":"SUM(E81:E82)/2","v":0},0,0,0,0,0,0,0,0,0,{"$f":"SUM(O81:O82)/2","v":0}]
[]
["UCC for PILs Calculation",null,null,null,null,null,null,null,null,"Test Year"]
[null,null,null,null,{"$f":"E69","v":2016},{"$f":"F69","v":2017},{"$f":"G69","v":2018},2019,2020,2021,2022,2023,2024,2025,{"$f":"O69","v":2026}]
[]
["Opening UCC",null,null,null,{"$f":"E72","v":0},{"$f":"E96","v":0},0,0,0,0,0,0,0,0,0]
["Capital Additions",null,null,null,{"$f":"E73","v":0},0,0,0,0,0,0,0,0,0,{"$f":"O73","v":0}]
["UCC Before Half Year Rule",null,null,null,{"$f":"SUM(E88:E89)","v":0},0,0,0,0,0,0,0,0,0,{"$f":"SUM(O88:O89)","v":0}]
["Capital Additions (half year)",null,null,null,{"$f":"E89/2","v":0},0,0,0,0,0,0,0,0,0,{"$f":"O89/2","v":0}]
["Reduced UCC",null,null,null,{"$f":"E90-E91","v":0},0,0,0,0,0,0,0,0,0,{"$f":"O90-O91","v":0}]
["CCA Rate Class (to be entered)"]
["CCA Rate  (to be entered)"]
["CCA",null,null,null,{"$f":"E92*$B$94","v":0},{"$f":"F92*$B$94","v":0},0,0,0,0,0,0,0,0,{"$f":"O92*$B$94","v":0}]
["Closing UCC",null,null,null,{"$f":"E90-E95","v":0},0,0,0,0,0,0,0,0,0,{"$f":"O90-O95","v":0}]

{"sheet":"App.2-FC Calc of REG Expansion","index":22,"n_rows":96,"n_cols":36,"rows_kept":96,"cut":false,"hidden":false,"merged":[[15,18,15,20],[51,19,51,20],[16,30,16,32],[47,0,48,15],[8,0,8,21],[9,0,9,21],[11,0,11,21],[12,0,12,21],[14,0,14,21],[16,3,16,5],[16,6,16,8],[16,9,16,11],[16,12,16,14],[16,15,16,17],[16,18,16,20],[16,21,16,23],[16,33,16,35],[52,34,52,35],[52,31,52,32],[52,16,52,17],[50,0,50,1],[52,4,52,5],[52,7,52,8],[52,10,52,11],[52,13,52,14],[16,24,16,26],[16,27,16,29],[52,19,52,20],[52,22,52,23],[52,25,52,26],[52,28,52,29]]}
[null,null,null,null,null,null,null,null,null,null,null,null,null,null,null,null,null,"File Number:",0]
[null,null,null,null,null,null,null,null,null,null,null,null,null,null,null,null,null,"Exhibit:"]
[null,null,null,null,null,null,null,null,null,null,null,null,null,null,null,null,null,"Tab:"]
["TO BE UPDATED AT DRAFT RATE ORDER STAGE",null,null,null,null,null,null,null,null,null,null,null,null,null,null,null,null,"Schedule:"]
[null,null,null,null,null,null,null,null,null,null,null,null,null,null,null,null,null,"Page:"]
[]
[null,null,null,null,null,null,null,null,null,null,null,null,null,null,null,null,null,"Date:"]
[]
["Appendix 2-FC"]
["Calculation of Renewable Generation Connection Direct Benefits/Provincial Amount: Renewable Expansion Investments"]
[]
["This table will calculate the distributor/provincial shares of the investments entered in Part B of Appendix 2-FA."]
["Enter values in green shaded cells: WCA percentage, debt percentages, interest rates, kWh, tax rates, amortization period, CCA Class and percentage."]
["For historical investments, enter these variables that were approved in your last cost of service test year.  For 2021 and beyond, enter variables as in the application."]
["Rate Riders related to the direct benefit portion of the renewable investments are not calculated for the Test Year as these assets and costs are already in the distributor's rate base/revenue requirement."]
[null,null,null,null,null,null,null,null,null,null,null,null,null,null,null,null,null,null,"Test Year"]
[null,null,null,{"$f":"G17-1","v":2016},null,null,{"$f":"J17-1","v":2017},null,null,{"$f":"M17-1","v":2018},null,null,{"$f":"P17-1","v":2019},null,null,{"$f":"S17-1","v":2020},null,null,{"$f":"'LDC Info'!$E$24","v":2021},null,null,{"$f":"S17+1","v":2022},null,null,{"$f":"V17+1","v":2023},2016,null,{"$f":"Y17+1","v":2024},null,null,{"$f":"AB17+1","v":2025},null,null,{"$f":"AE17+1","v":2026}]
[null,null,null,null,"Direct Benefit","Provincial",null,"Direct Benefit","Provincial",null,"Direct Benefit","Provincial",null,"Direct Benefit","Provincial",null,"Direct Benefit","Provincial",null,"Direct Benefit","Provincial",null,"Direct Benefit","Provincial",null,"Direct Benefit","Provincial",null,"Direct Benefit","Provincial",null,"Direct Benefit","Provincial",null,"Direct Benefit","Provincial"]
[null,null,null,"Total",0.17,0.83,"Total",0.17,0.83,"Total",0.17,0.83,"Total",0.17,0.83,"Total",0.17,0.83,"Total",0.17,0.83,"Total",0.17,0.83,"Total",0.17,0.83,"Total",0.17,0.83,"Total",0.17,0.83,"Total",0.17,0.83]
["Net Fixed Assets (average)",null,null,{"$f":"E83","v":0},{"$f":"D20*E19","v":0},{"$f":"D20*F19","v":0},{"$f":"F83","v":0},{"$f":"G20*H19","v":0},{"$f":"G20*I19","v":0},{"$f":"G83","v":0},{"$f":"J20*K19","v":0},{"$f":"J20*L19","v":0},{"$f":"H83","v":0},{"$f":"M20*N19","v":0},{"$f":"M20*O19","v":0},{"$f":"I83","v":0},{"$f":"P20*Q19","v":0},{"$f":"P20*R19","v":0},{"$f":"J83","v":0},{"$f":"S20*T19","v":0},{"$f":"S20*U19","v":0},{"$f":"K83","v":0},{"$f":"V20*W19","v":0},{"$f":"V20*X19","v":0},{"$f":"L83","v":0},{"$f":"Y20*Z19","v":0},{"$f":"Y20*AA19","v":0},{"$f":"M83","v":0},{"$f":"AB20*AC19","v":0},{"$f":"AB20*AD19","v":0},{"$f":"N83","v":0},{"$f":"AE20*AF19","v":0},{"$f":"AE20*AG19","v":0},{"$f":"O83","v":0},{"$f":"AH20*AI19","v":0},{"$f":"AH20*AJ19","v":0}]
["Incremental OM&A (on-going, N/A for Provincial Recovery)",null,null,0,{"$f":"D21*E19","v":0},{"$f":"D21*F19","v":0},0,{"$f":"G21*H19","v":0},{"$f":"G21*I19","v":0},0,{"$f":"J21*K19","v":0},{"$f":"J21*L19","v":0},0,{"$f":"M21*N19","v":0},{"$f":"M21*O19","v":0},0,{"$f":"P21*Q19","v":0},{"$f":"P21*R19","v":0},0,{"$f":"S21*T19","v":0},{"$f":"S21*U19","v":0},0,{"$f":"V21*W19","v":0},{"$f":"V21*X19","v":0},0,{"$f":"Y21*Z19","v":0},{"$f":"Y21*AA19","v":0},0,{"$f":"AB21*AC19","v":0},{"$f":"AB21*AD19","v":0},0,{"$f":"AE21*AF19","v":0},{"$f":"AE21*AG19","v":0},0,{"$f":"AH21*AI19","v":0},{"$f":"AH21*AJ19","v":0}]
["Incremental OM&A (start-up, applicable for Provincial Recovery)",null,null,0,{"$f":"D22*E19","v":0},{"$f":"D22*F19","v":0},0,{"$f":"G22*H19","v":0},{"$f":"G22*I19","v":0},0,{"$f":"J22*K19","v":0},{"$f":"J22*L19","v":0},0,{"$f":"M22*N19","v":0},{"$f":"M22*O19","v":0},0,{"$f":"P22*Q19","v":0},{"$f":"P22*R19","v":0},0,{"$f":"S22*T19","v":0},{"$f":"S22*U19","v":0},0,{"$f":"V22*W19","v":0},{"$f":"V22*X19","v":0},0,{"$f":"Y22*Z19","v":0},{"$f":"Y22*AA19","v":0},0,{"$f":"AB22*AC19","v":0},{"$f":"AB22*AD19","v":0},0,{"$f":"AE22*AF19","v":0},{"$f":"AE22*AG19","v":0},0,{"$f":"AH22*AI19","v":0},{"$f":"AH22*AJ19","v":0}]
["Rebasing Year vs. Test Year",{"$f":"'LDC Info'!E28","v":2014},{"$f":"'LDC Info'!E24","v":2021}]
["Allowance for Working Capital (enter rate)",null,null,null,{"$f":"IF(AND(D$17>=$B$23, D$17<$C$23),(E21+E22)*$B$24,(E21+E22)*$C$24)","v":0},{"$f":"IF(AND(D$17>=$B$23, D$17<$C$23),(F22)*$B$24,(F22)*$C$24)","v":0},null,{"$f":"IF(AND(G$17>=$B$23, G$17<$C$23),(H21+H22)*$B$24,(H21+H22)*$C$24)","v":0},{"$f":"IF(AND(G$17>=$B$23, G$17<$C$23),(I22)*$B$24,(I22)*$C$24)","v":0},null,{"$f":"IF(AND(J$17>=$B$23, J$17<$C$23),(K21+K22)*$B$24,(K21+K22)*$C$24)","v":0},{"$f":"IF(AND(J$17>=$B$23, J$17<$C$23),(L22)*$B$24,(L22)*$C$24)","v":0},null,{"$f":"IF(AND(M$17>=$B$23, M$17<$C$23),(N21+N22)*$B$24,(N21+N22)*$C$24)","v":0},{"$f":"IF(AND(M$17>=$B$23, M$17<$C$23),(O22)*$B$24,(O22)*$C$24)","v":0},null,{"$f":"IF(AND(P$17>=$B$23, P$17<$C$23),(Q21+Q22)*$B$24,(Q21+Q22)*$C$24)","v":0},{"$f":"IF(AND(P$17>=$B$23, P$17<$C$23),(R22)*$B$24,(R22)*$C$24)","v":0},null,{"$f":"IF(AND(S$17>=$B$23, S$17<$C$23),(T21+T22)*$B$24,(T21+T22)*$C$24)","v":0},{"$f":"IF(AND(S$17>=$B$23, S$17<$C$23),(U22)*$B$24,(U22)*$C$24)","v":0},null,{"$f":"IF(AND(V$17>=$B$23, V$17<$C$23),(W21+W22)*$B$24,(W21+W22)*$C$24)","v":0},{"$f":"IF(AND(V$17>=$B$23, V$17<$C$23),(X22)*$B$24,(X22)*$C$24)","v":0},null,{"$f":"IF(AND(Y$17>=$B$23, Y$17<$C$23),(Z21+Z22)*$B$24,(Z21+Z22)*$C$24)","v":0},{"$f":"IF(AND(Y$17>=$B$23, Y$17<$C$23),(AA22)*$B$24,(AA22)*$C$24)","v":0},null,{"$f":"IF(AND(AB$17>=$B$23, AB$17<$C$23),(AC21+AC22)*$B$24,(AC21+AC22)*$C$24)","v":0},{"$f":"IF(AND(AB$17>=$B$23, AB$17<$C$23),(AD22)*$B$24,(AD22)*$C$24)","v":0},null,{"$f":"IF(AND(AE$17>=$B$23, AE$17<$C$23),(AF21+AF22)*$B$24,(AF21+AF22)*$C$24)","v":0},{"$f":"IF(AND(AE$17>=$B$23, AE$17<$C$23),(AG22)*$B$24,(AG22)*$C$24)","v":0},null,{"$f":"IF(AND(AH$17>=$B$23, AH$17<$C$23),(AI21+AI22)*$B$24,(AI21+AI22)*$C$24)","v":0},{"$f":"IF(AND(AH$17>=$B$23, AH$17<$C$23),(AJ22)*$B$24,(AJ22)*$C$24)","v":0}]
["Rate Base",null,null,null,{"$f":"SUM(E20+E24)","v":0},{"$f":"SUM(F20+F24)","v":0},null,{"$f":"SUM(H20+H24)","v":0},{"$f":"SUM(I20+I24)","v":0},null,{"$f":"SUM(K20+K24)","v":0},{"$f":"SUM(L20+L24)","v":0},null,{"$f":"SUM(N20+N24)","v":0},{"$f":"SUM(O20+O24)","v":0},null,{"$f":"SUM(Q20+Q24)","v":0},{"$f":"SUM(R20+R24)","v":0},null,{"$f":"SUM(T20+T24)","v":0},{"$f":"SUM(U20+U24)","v":0},null,{"$f":"SUM(W20+W24)","v":0},{"$f":"SUM(X20+X24)","v":0},null,{"$f":"SUM(Z20+Z24)","v":0},{"$f":"SUM(AA20+AA24)","v":0},null,{"$f":"SUM(AC20+AC24)","v":0},{"$f":"SUM(AD20+AD24)","v":0},null,{"$f":"SUM(AF20+AF24)","v":0},{"$f":"SUM(AG20+AG24)","v":0},null,{"$f":"SUM(AI20+AI24)","v":0},{"$f":"SUM(AJ20+AJ24)","v":0}]
[]
[null,{"$f":"B23","v":2014},{"$f":"C23","v":2021}]
["Deemed ST Debt ",0.04,0.04,null,{"$f":"E25*$B$28","v":0},{"$f":"F25*$B$28","v":0},null,{"$f":"H25*$B$28","v":0},{"$f":"I25*$B$28","v":0},null,{"$f":"K25*$B$28","v":0},{"$f":"L25*$B$28","v":0},null,{"$f":"N25*$B$28","v":0},{"$f":"O25*$B$28","v":0},null,{"$f":"Q25*$B$28","v":0},{"$f":"R25*$B$28","v":0},null,{"$f":"T25*$C$28","v":0},{"$f":"U25*$C$28","v":0},null,{"$f":"W25*$C$28","v":0},{"$f":"X25*$C$28","v":0},null,{"$f":"Z25*$C$28","v":0},{"$f":"AA25*$C$28","v":0},null,{"$f":"AC25*$C$28","v":0},{"$f":"AD25*$C$28","v":0},null,{"$f":"AF25*$C$28","v":0},{"$f":"AG25*$C$28","v":0},null,{"$f":"AI25*$C$28","v":0},{"$f":"AJ25*$C$28","v":0}]
["Deemed LT Debt ",0.56000000000000005,0.56000000000000005,null,{"$f":"E25*$B$29","v":0},{"$f":"F25*$B$29","v":0},null,{"$f":"H25*$B$29","v":0},{"$f":"I25*$B$29","v":0},null,{"$f":"K25*$B$29","v":0},{"$f":"L25*$B$29","v":0},null,{"$f":"N25*$B$29","v":0},{"$f":"O25*$B$29","v":0},null,{"$f":"Q25*$B$29","v":0},{"$f":"R25*$B$29","v":0},null,{"$f":"T25*$C$29","v":0},{"$f":"U25*$C$29","v":0},null,{"$f":"W25*$C$29","v":0},{"$f":"X25*$C$29","v":0},null,{"$f":"Z25*$C$29","v":0},{"$f":"AA25*$C$29","v":0},null,{"$f":"AC25*$C$29","v":0},{"$f":"AD25*$C$29","v":0},null,{"$f":"AF25*$C$29","v":0},{"$f":"AG25*$C$29","v":0},null,{"$f":"AI25*$C$29","v":0},{"$f":"AJ25*$C$29","v":0}]
["Deemed Equity ",0.4,0.4,null,{"$f":"E25*$B$30","v":0},{"$f":"F25*$B$30","v":0},null,{"$f":"H25*$B$30","v":0},{"$f":"I25*$B$30","v":0},null,{"$f":"K25*$B$30","v":0},{"$f":"L25*$B$30","v":0},null,{"$f":"N25*$B$30","v":0},{"$f":"O25*$B$30","v":0},null,{"$f":"Q25*$B$30","v":0},{"$f":"R25*$B$30","v":0},null,{"$f":"T25*$C$30","v":0},{"$f":"U25*$C$30","v":0},null,{"$f":"W25*$C$30","v":0},{"$f":"X25*$C$30","v":0},null,{"$f":"Z25*$C$30","v":0},{"$f":"AA25*$C$30","v":0},null,{"$f":"AC25*$C$30","v":0},{"$f":"AD25*$C$30","v":0},null,{"$f":"AF25*$C$30","v":0},{"$f":"AG25*$C$30","v":0},null,{"$f":"AI25*$C$30","v":0},{"$f":"AJ25*$C$30","v":0}]
[]
["ST Interest (enter rate)",null,null,null,{"$f":"E28*$B32","v":0},0,null,0,0,null,0,0,null,0,0,null,0,0,null,{"$f":"T28*$C32","v":0},0,null,{"$f":"W28*$C32","v":0},0,null,{"$f":"Z28*$C32","v":0},0,null,{"$f":"AC28*$C32","v":0},0,null,{"$f":"AF28*$C32","v":0},0,null,{"$f":"AI28*$C32","v":0},0]
["LT Interest (enter rate)",null,null,null,0,0,null,0,0,null,0,0,null,0,0,null,0,0,null,0,0,null,0,0,null,0,0,null,0,0,null,0,0,null,{"$f":"AI29*$C33","v":0},0]
["Return on Equity (enter rate)",null,null,null,0,0,null,0,0,null,0,0,null,0,0,null,0,0,null,0,0,null,0,0,null,0,0,null,0,0,null,0,0,null,{"$f":"AI30*$C34","v":0},0]
["Cost of Capital Total",null,null,null,{"$f":"SUM(E32:E34)","v":0},{"$f":"SUM(F32:F34)","v":0},null,{"$f":"SUM(H32:H34)","v":0},{"$f":"SUM(I32:I34)","v":0},null,{"$f":"SUM(K32:K34)","v":0},{"$f":"SUM(L32:L34)","v":0},null,{"$f":"SUM(N32:N34)","v":0},{"$f":"SUM(O32:O34)","v":0},null,{"$f":"SUM(Q32:Q34)","v":0},{"$f":"SUM(R32:R34)","v":0},null,{"$f":"SUM(T32:T34)","v":0},{"$f":"SUM(U32:U34)","v":0},null,{"$f":"SUM(W32:W34)","v":0},{"$f":"SUM(X32:X34)","v":0},null,{"$f":"SUM(Z32:Z34)","v":0},{"$f":"SUM(AA32:AA34)","v":0},null,{"$f":"SUM(AC32:AC34)","v":0},{"$f":"SUM(AD32:AD34)","v":0},null,{"$f":"SUM(AF32:AF34)","v":0},{"$f":"SUM(AG32:AG34)","v":0},null,{"$f":"SUM(AI32:AI34)","v":0},{"$f":"SUM(AJ32:AJ34)","v":0}]
[]
["OM&A",null,null,null,{"$f":"E21+E22","v":0},{"$f":"F22","v":0},null,{"$f":"H21+H22","v":0},{"$f":"I22","v":0},null,{"$f":"K21+K22","v":0},{"$f":"L22","v":0},null,{"$f":"N21+N22","v":0},{"$f":"O22","v":0},null,{"$f":"Q21+Q22","v":0},{"$f":"R22","v":0},null,{"$f":"T21+T22","v":0},{"$f":"U22","v":0},null,{"$f":"W21+W22","v":0},{"$f":"X22","v":0},null,{"$f":"Z21+Z22","v":0},{"$f":"AA22","v":0},null,{"$f":"AC21+AC22","v":0},{"$f":"AD22","v":0},null,{"$f":"AF21+AF22","v":0},{"$f":"AG22","v":0},null,{"$f":"AI21+AI22","v":0},{"$f":"AJ22","v":0}]
["Amortization",null,null,{"$f":"+E77+E78","v":0},{"$f":"D38*E$19","v":0},{"$f":"D38*F$19","v":0},{"$f":"+F77+F78","v":0},{"$f":"G38*H$19","v":0},{"$f":"G38*I$19","v":0},{"$f":"+G77+G78","v":0},{"$f":"J38*K$19","v":0},{"$f":"J38*L$19","v":0},{"$f":"+H77+H78","v":0},{"$f":"M38*N$19","v":0},{"$f":"M38*O$19","v":0},{"$f":"+I77+I78","v":0},{"$f":"P38*Q$19","v":0},{"$f":"P38*R$19","v":0},{"$f":"+J77+J78","v":0},{"$f":"S38*T$19","v":0},{"$f":"S38*U$19","v":0},{"$f":"+K77+K78","v":0},{"$f":"V38*W$19","v":0},{"$f":"V38*X$19","v":0},{"$f":"+L77+L78","v":0},{"$f":"Y38*Z$19","v":0},{"$f":"Y38*AA$19","v":0},{"$f":"+M77+M78","v":0},{"$f":"AB38*AC$19","v":0},{"$f":"AB38*AD$19","v":0},{"$f":"+N77+N78","v":0},{"$f":"AE38*AF$19","v":0},{"$f":"AE38*AG$19","v":0},{"$f":"+O77+O78","v":0},{"$f":"AH38*AI$19","v":0},{"$f":"AH38*AJ$19","v":0}]
["Grossed-up PILs",null,null,null,{"$f":"+E66","v":0},{"$f":"+F66","v":0},null,{"$f":"+H66","v":0},{"$f":"+I66","v":0},null,{"$f":"+K66","v":0},{"$f":"+L66","v":0},null,{"$f":"+N66","v":0},{"$f":"+O66","v":0},null,{"$f":"+Q66","v":0},{"$f":"+R66","v":0},null,{"$f":"+T66","v":0},{"$f":"+U66","v":0},null,{"$f":"+W66","v":0},{"$f":"+X66","v":0},null,{"$f":"+Z66","v":0},{"$f":"+AA66","v":0},null,{"$f":"+AC66","v":0},{"$f":"+AD66","v":0},null,{"$f":"+AF66","v":0},{"$f":"+AG66","v":0},null,{"$f":"+AI66","v":0},{"$f":"+AJ66","v":0}]
[]
["Revenue Requirement",null,null,null,{"$f":"SUM(E35:E39)","v":0},{"$f":"SUM(F35:F39)","v":0},null,{"$f":"SUM(H35:H39)","v":0},0,null,{"$f":"SUM(K35:K39)","v":0},0,null,{"$f":"SUM(N35:N39)","v":0},0,null,{"$f":"SUM(Q35:Q39)","v":0},0,null,{"$f":"SUM(T35:T39)","v":0},0,null,{"$f":"SUM(W35:W39)","v":0},0,null,{"$f":"SUM(Z35:Z39)","v":0},0,null,{"$f":"SUM(AC35:AC39)","v":0},0,null,{"$f":"SUM(AF35:AF39)","v":0},0,null,{"$f":"SUM(AI35:AI39)","v":0},0]
[]
[]
["Provincial Rate Protection",null,null,null,null,{"$f":"F41","v":0},null,null,{"$f":"I41","v":0},null,null,{"$f":"L41","v":0},null,null,{"$f":"O41","v":0},null,null,{"$f":"R41","v":0},null,null,{"$f":"U41","v":0},null,null,{"$f":"X41","v":0},null,null,{"$f":"AA41","v":0},null,null,{"$f":"AD41","v":0},null,null,{"$f":"AG41","v":0},null,null,{"$f":"AJ41","v":0}]
[]
["Monthly Amount Paid by IESO",null,null,null,null,{"$f":"F44/12","v":0},null,null,{"$f":"I44/12","v":0},null,null,{"$f":"L44/12","v":0},null,null,{"$f":"O44/12","v":0},null,null,{"$f":"R44/12","v":0},null,null,{"$f":"U44/12","v":0},null,null,{"$f":"X44/12","v":0},null,null,{"$f":"AA44/12","v":0},null,null,{"$f":"AD44/12","v":0},null,null,{"$f":"AG44/12","v":0},null,null,{"$f":"AJ44/12","v":0}]
[]
["Note 1: The distributor should follow the regulatory accounting set out in the Accounting Procedure Handbook Guidance FAQs issued in March 2015. Q10 of the APH FAQs states that: “For approved eligible investments as defined under O.Reg. 330/09 under the OEB Act, a variance account will continue to be used for the purpose of recording variances between the revenue requirement based on actual costs of approved eligible investments and the revenue received from the IESO.” The answer for Q10 provides the accounting guidance for this variance account: “Distributors that have included eligible investments to connect qualifying facilities in their DS plans are to establish the variance Account 1533 Renewable Generation Connection Funding Adder Deferral Account, Sub-account Provincial Rate Protection Payment Variances following OEB approval for investments forecast to enter service beyond the test year for purposes of implementing rate protection pursuant to O.Reg. 330/09. The purpose of this variance account is to track the variance between the distributor’s revenue requirement associated with the portion of the actual capital and/or operating costs that are eligible for rate protection, as incurred by the distributor for eligible renewable enabling and expansion investments, and the rate protection payments collected from the IESO.” The answer further provides the journal entries to record the variances. Distributors should follow the instructions in the answer for recording the journal entries in the variance account 1533."]
[]
["Note 2: For the Test Year, Costs and Revenues of the Direct Benefit are to be included in the test year applicant Rate Base and Revenues."]
[]
["PILs Calculation",null,null,null,null,null,null,null,null,null,null,null,null,null,null,null,null,null,null,"Test Year"]
[null,null,null,null,{"$f":"G17-1","v":2016},null,null,{"$f":"G17","v":2017},null,null,{"$f":"J17","v":2018},null,null,{"$f":"M17","v":2019},null,null,{"$f":"P17","v":2020},null,null,{"$f":"S17","v":2021},null,null,{"$f":"V17","v":2022},null,null,{"$f":"Y17","v":2023},null,null,{"$f":"AB17","v":2024},null,null,{"$f":"AE17","v":2025},null,null,{"$f":"AH17","v":2026}]
["Income Tax",null,null,null,"Direct Benefit","Provincial",null,"Direct Benefit","Provincial",null,"Direct Benefit","Provincial",null,"Direct Benefit","Provincial",null,"Direct Benefit","Provincial",null,"Direct Benefit","Provincial",null,"Direct Benefit","Provincial",null,"Direct Benefit","Provincial",null,"Direct Benefit","Provincial",null,"Direct Benefit","Provincial",null,"Direct Benefit","Provincial"]
[null,null,null,null,null,null,null,null,null,null,null,null,null,null,null,null,null,null,null,null,null,null,null,null,null,null,null,"Total",null,null,"Total",null,null,"Total"]
["Net Income - ROE on Rate Base",null,null,null,{"$f":"E34","v":0},{"$f":"F34","v":0},null,{"$f":"H34","v":0},{"$f":"I34","v":0},null,{"$f":"K34","v":0},{"$f":"L34","v":0},null,{"$f":"N34","v":0},{"$f":"O34","v":0},null,{"$f":"Q34","v":0},{"$f":"R34","v":0},null,{"$f":"T34","v":0},{"$f":"U34","v":0},null,{"$f":"W34","v":0},{"$f":"X34","v":0},null,{"$f":"Z34","v":0},{"$f":"AA34","v":0},null,{"$f":"AC34","v":0},{"$f":"AD34","v":0},null,{"$f":"AF34","v":0},{"$f":"AG34","v":0},null,{"$f":"AI34","v":0},{"$f":"AJ34","v":0}]
["Amortization (6% DB and 94% P)",null,null,null,{"$f":"E38","v":0},{"$f":"F38","v":0},null,{"$f":"H38","v":0},{"$f":"I38","v":0},null,{"$f":"K38","v":0},{"$f":"L38","v":0},null,{"$f":"N38","v":0},{"$f":"O38","v":0},null,{"$f":"Q38","v":0},{"$f":"R38","v":0},null,{"$f":"T38","v":0},{"$f":"U38","v":0},null,{"$f":"W38","v":0},{"$f":"X38","v":0},null,{"$f":"Z38","v":0},{"$f":"AA38","v":0},null,{"$f":"AC38","v":0},{"$f":"AD38","v":0},null,{"$f":"AF38","v":0},{"$f":"AG38","v":0},null,{"$f":"AI38","v":0},{"$f":"AJ38","v":0}]
["CCA (6% DB and 94% P)",null,null,null,{"$f":"-E95*$E$19","v":0},{"$f":"-E95*$F$19","v":0},null,{"$f":"-F95*$E$19","v":0},{"$f":"-F95*$F$19","v":0},null,{"$f":"-G95*$E$19","v":0},{"$f":"-G95*$F$19","v":0},null,{"$f":"-H95*$E$19","v":0},{"$f":"-H95*$F$19","v":0},null,{"$f":"-I95*$E$19","v":0},{"$f":"-I95*$F$19","v":0},null,{"$f":"-J95*$E$19","v":0},{"$f":"-J95*$F$19","v":0},null,{"$f":"-K95*$E$19","v":0},{"$f":"-K95*$F$19","v":0},null,{"$f":"-L95*$E$19","v":0},{"$f":"-L95*$F$19","v":0},null,{"$f":"-M95*$E$19","v":0},{"$f":"-M95*$F$19","v":0},null,{"$f":"-N95*$E$19","v":0},{"$f":"-N95*$F$19","v":0},null,{"$f":"-Q95*$E$19","v":0},{"$f":"-Q95*$F$19","v":0}]
["Taxable income",null,null,null,{"$f":"SUM(E56:E58)","v":0},{"$f":"SUM(F56:F58)","v":0},null,{"$f":"SUM(H56:H58)","v":0},0,null,{"$f":"SUM(K56:K58)","v":0},0,null,{"$f":"SUM(N56:N58)","v":0},0,null,{"$f":"SUM(Q56:Q58)","v":0},0,null,{"$f":"SUM(T56:T58)","v":0},0,null,{"$f":"SUM(W56:W58)","v":0},0,null,{"$f":"SUM(Z56:Z58)","v":0},{"$f":"SUM(AA56:AA58)","v":0},null,{"$f":"SUM(AC56:AC58)","v":0},{"$f":"SUM(AD56:AD58)","v":0},null,{"$f":"SUM(AF56:AF58)","v":0},{"$f":"SUM(AG56:AG58)","v":0},null,{"$f":"SUM(AI56:AI58)","v":0},{"$f":"SUM(AJ56:AJ58)","v":0}]
[null,{"$f":"B27","v":2014},{"$f":"C27","v":2021}]
["Tax Rate  (to be entered)",null,null,null,{"$f":"IF(AND(E$53>=$B$60, E$53<$C$60),$B$61,$C$61)","v":0},{"$f":"IF(AND(E$53>=$B$60, E$53<$C$60),$B$61,$C$61)","v":0},null,{"$f":"IF(AND(H$53>=$B$60, H$53<$C$60),$B$61,$C$61)","v":0},{"$f":"IF(AND(H$53>=$B$60, H$53<$C$60),$B$61,$C$61)","v":0},null,{"$f":"IF(AND(K$53>=$B$60, K$53<$C$60),$B$61,$C$61)","v":0},{"$f":"IF(AND(K$53>=$B$60, K$53<$C$60),$B$61,$C$61)","v":0},null,{"$f":"IF(AND(N$53>=$B$60, N$53<$C$60),$B$61,$C$61)","v":0},{"$f":"IF(AND(N$53>=$B$60, N$53<$C$60),$B$61,$C$61)","v":0},null,{"$f":"IF(AND(Q$53>=$B$60, Q$53<$C$60),$B$61,$C$61)","v":0},{"$f":"IF(AND(Q$53>=$B$60, Q$53<$C$60),$B$61,$C$61)","v":0},null,{"$f":"IF(AND(T$53>=$B$60, T$53<$C$60),$B$61,$C$61)","v":0},{"$f":"IF(AND(T$53>=$B$60, T$53<$C$60),$B$61,$C$61)","v":0},null,{"$f":"IF(AND(W$53>=$B$60, W$53<$C$60),$B$61,$C$61)","v":0},{"$f":"IF(AND(W$53>=$B$60, W$53<$C$60),$B$61,$C$61)","v":0},null,{"$f":"IF(AND(Z$53>=$B$60, Z$53<$C$60),$B$61,$C$61)","v":0},{"$f":"IF(AND(Z$53>=$B$60, Z$53<$C$60),$B$61,$C$61)","v":0},null,{"$f":"IF(AND(AC$53>=$B$60, AC$53<$C$60),$B$61,$C$61)","v":0},{"$f":"IF(AND(AC$53>=$B$60, AC$53<$C$60),$B$61,$C$61)","v":0},null,{"$f":"IF(AND(AF$53>=$B$60, AF$53<$C$60),$B$61,$C$61)","v":0},{"$f":"IF(AND(AF$53>=$B$60, AF$53<$C$60),$B$61,$C$61)","v":0},null,{"$f":"IF(AND(AI$53>=$B$60, AI$53<$C$60),$B$61,$C$61)","v":0},{"$f":"IF(AND(AI$53>=$B$60, AI$53<$C$60),$B$61,$C$61)","v":0}]
[]
["Income Taxes Payable",null,null,null,{"$f":"E59*E61","v":0},{"$f":"F59*F61","v":0},null,{"$f":"H59*H61","v":0},{"$f":"I59*I61","v":0},null,{"$f":"K59*K61","v":0},{"$f":"L59*L61","v":0},null,{"$f":"N59*N61","v":0},{"$f":"O59*O61","v":0},null,{"$f":"Q59*Q61","v":0},{"$f":"R59*R61","v":0},null,{"$f":"T59*T61","v":0},{"$f":"U59*U61","v":0},null,{"$f":"W59*W61","v":0},{"$f":"X59*X61","v":0},null,{"$f":"Z59*Z61","v":0},{"$f":"AA59*AA61","v":0},null,{"$f":"AC59*AC61","v":0},{"$f":"AD59*AD61","v":0},null,{"$f":"AF59*AF61","v":0},{"$f":"AG59*AG61","v":0},null,{"$f":"AI59*AI61","v":0},{"$f":"AJ59*AJ61","v":0}]
["Gross Up"]
["Income Taxes Payable",null,null,null,{"$f":"E63/(1-E61)","v":0},{"$f":"F63/(1-F61)","v":0},null,{"$f":"H63/(1-H61)","v":0},{"$f":"I63/(1-I61)","v":0},null,{"$f":"K63/(1-K61)","v":0},{"$f":"L63/(1-L61)","v":0},null,{"$f":"N63/(1-N61)","v":0},{"$f":"O63/(1-O61)","v":0},null,{"$f":"Q63/(1-Q61)","v":0},{"$f":"R63/(1-R61)","v":0},null,{"$f":"T63/(1-T61)","v":0},{"$f":"U63/(1-U61)","v":0},null,{"$f":"W63/(1-W61)","v":0},{"$f":"X63/(1-X61)","v":0},null,{"$f":"Z63/(1-Z61)","v":0},{"$f":"AA63/(1-AA61)","v":0},null,{"$f":"AC63/(1-AC61)","v":0},{"$f":"AD63/(1-AD61)","v":0},null,{"$f":"AF63/(1-AF61)","v":0},{"$f":"AG63/(1-AG61)","v":0},null,{"$f":"AI63/(1-AI61)","v":0},{"$f":"AJ63/(1-AJ61)","v":0}]
["Grossed Up PILs",null,null,null,{"$f":"+E65","v":0},{"$f":"+F65","v":0},null,{"$f":"+H65","v":0},{"$f":"+I65","v":0},null,{"$f":"+K65","v":0},0,null,{"$f":"+N65","v":0},0,null,{"$f":"+Q65","v":0},0,null,{"$f":"+T65","v":0},0,null,{"$f":"+W65","v":0},0,null,{"$f":"+Z65","v":0},0,null,{"$f":"+AC65","v":0},0,null,{"$f":"+AF65","v":0},0,null,{"$f":"+AI65","v":0},0]
[]
[null,null,null,null,null,null,null,null,null,"Test Year"]
[null,null,null,null,{"$f":"F69-1","v":2016},{"$f":"G69-1","v":2017},{"$f":"H69-1","v":2018},{"$f":"I69-1","v":2019},{"$f":"J69-1","v":2020},{"$f":"'LDC Info'!E24","v":2021},{"$f":"J69+1","v":2022},{"$f":"K69+1","v":2023},{"$f":"L69+1","v":2024},{"$f":"M69+1","v":2025},{"$f":"N69+1","v":2026}]
["Net Fixed Assets"]
["Enter applicable amortization in years:",40]
["Opening Gross Fixed Assets",null,null,null,null,{"$f":"E74","v":0},0,0,0,0,0,0,0,0,0]
["Capital Additions",null,null,null,{"$f":"'App.2-FA Proposed REG Invest.'!C99","v":0},{"$f":"'App.2-FA Proposed REG Invest.'!D99","v":0},{"$f":"'App.2-FA Proposed REG Invest.'!E99","v":0},{"$f":"'App.2-FA Proposed REG Invest.'!F99","v":0},{"$f":"'App.2-FA Proposed REG Invest.'!G99","v":0},{"$f":"'App.2-FA Proposed REG Invest.'!H99","v":0},{"$f":"'App.2-FA Proposed REG Invest.'!I99","v":0},{"$f":"'App.2-FA Proposed REG Invest.'!J99","v":0},{"$f":"'App.2-FA Proposed REG Invest.'!K99","v":0},{"$f":"'App.2-FA Proposed REG Invest.'!L99","v":0},{"$f":"'App.2-FA Proposed REG Invest.'!M99","v":0}]
["Closing Gross Fixed Assets",null,null,null,{"$f":"SUM(E72:E73)","v":0},0,0,0,0,0,0,0,0,0,{"$f":"SUM(O72:O73)","v":0}]
[]
["Opening Accumulated Amortization",null,null,null,0,{"$f":"+E79","v":0},{"$f":"+F79","v":0},0,0,0,0,0,0,0,0]
["Current Year Amortization (before additions)",null,null,null,{"$f":"IF(ISERROR(E72/$B$71), 0, E72/$B$71)","v":0},{"$f":"IF(ISERROR(F72/$B$71), 0, F72/$B$71)","v":0},0,0,0,0,0,0,0,0,{"$f":"IF(ISERROR(O72/$B$71), 0, O72/$B$71)","v":0}]
["Capital Additions Amortization (half year)",null,null,null,{"$f":"E73/$B$71/2","v":0},{"$f":"F73/$B$71/2","v":0},0,0,0,0,0,0,0,0,{"$f":"O73/$B$71/2","v":0}]
["Closing Accumulated Amortization",null,null,null,{"$f":"SUM(E76+E77+E78)","v":0},0,0,0,0,0,0,0,0,0,{"$f":"SUM(O76+O77+O78)","v":0}]
[]
["Opening Net Fixed Assets",null,null,null,{"$f":"E72-E76","v":0},0,0,0,0,0,0,0,0,0,{"$f":"O72-O76","v":0}]
["Closing Net Fixed Assets",null,null,null,{"$f":"E74-E79","v":0},0,0,0,0,0,0,0,0,0,{"$f":"O74-O79","v":0}]
["Average Net Fixed Assets",null,null,null,{"$f":"SUM(E81:E82)/2","v":0},0,0,0,0,0,0,0,0,0,{"$f":"SUM(O81:O82)/2","v":0}]
[]
["UCC for PILs Calculation",null,null,null,null,null,null,null,null,{"$f":"J68","v":"Test Year"}]
[null,null,null,null,{"$f":"E69","v":2016},{"$f":"F69","v":2017},{"$f":"G69","v":2018},2019,2020,2021,2022,2023,2024,2025,{"$f":"O69","v":2026}]
[]
["Opening UCC",null,null,null,{"$f":"E72","v":0},{"$f":"E96","v":0},0,0,0,0,0,0,0,0,0]
["Capital Additions",null,null,null,{"$f":"E73","v":0},0,0,0,0,0,0,0,0,0,{"$f":"O73","v":0}]
["UCC Before Half Year Rule",null,null,null,{"$f":"SUM(E88:E89)","v":0},0,0,0,0,0,0,0,0,0,{"$f":"SUM(O88:O89)","v":0}]
["Capital Additions (half year)",null,null,null,{"$f":"E89/2","v":0},0,0,0,0,0,0,0,0,0,{"$f":"O89/2","v":0}]
["Reduced UCC",null,null,null,{"$f":"E90-E91","v":0},0,0,0,0,0,0,0,0,0,{"$f":"O90-O91","v":0}]
["CCA Rate Class (to be entered)"]
["CCA Rate  (to be entered)"]
["CCA",null,null,null,{"$f":"E92*$B$94","v":0},{"$f":"F92*$B$94","v":0},0,0,0,0,0,0,0,0,{"$f":"O92*$B$94","v":0}]
["Closing UCC",null,null,null,{"$f":"E90-E95","v":0},0,0,0,0,0,0,0,0,0,{"$f":"O90-O95","v":0}]

{"sheet":"App.2-G SQI","index":23,"n_rows":40,"n_cols":16,"rows_kept":40,"cut":false,"hidden":false,"merged":[[21,6,21,9],[14,0,15,0],[14,1,14,5],[14,6,14,10],[0,14,0,15],[1,14,1,15],[2,14,2,15],[3,14,3,15],[4,14,4,15],[28,0,28,3],[6,14,6,15],[14,11,14,15],[20,11,20,14],[21,11,21,14],[19,0,19,15],[8,0,8,15],[9,0,9,15],[10,0,10,15],[12,0,12,15],[20,1,20,4],[20,6,20,9],[23,0,23,10],[24,0,24,10],[26,0,26,10],[21,1,21,4],[34,4,34,5],[35,4,35,5],[36,4,36,5],[28,4,28,5],[29,4,29,5],[30,4,30,5],[31,4,31,5],[37,4,37,5],[38,4,38,5],[39,4,39,5],[29,0,29,3],[30,0,30,3],[31,0,31,3],[32,0,32,3],[33,0,33,3],[34,0,34,3],[35,0,35,3],[36,0,36,3],[37,0,37,3],[38,0,38,3],[39,0,39,3],[32,4,32,5],[33,4,33,5]]}
[null,null,null,null,null,null,null,null,null,null,null,null,"File Number:",null,{"$f":"EBNUMBER","v":0}]
[null,null,null,null,null,null,null,null,null,null,null,null,"Exhibit:"]
[null,null,null,null,null,null,null,null,null,null,null,null,"Tab:"]
[null,null,null,null,null,null,null,null,null,null,null,null,"Schedule:"]
[null,null,null,null,null,null,null,null,null,null,null,null,"Page:"]
[]
[null,null,null,null,null,null,null,null,null,null,null,null,"Date:"]
[]
["Appendix 2-G"]
["Service Reliability and Quality Indicators"]
[]
[]
["Service Reliability"]
[]
["Index","Including outages caused by loss of supply",null,null,null,null,"Excluding outages caused by loss of supply",null,null,null,null,"Excluding Major Event Days"]
[null,{"$f":"TestYear-6","v":2015},{"$f":"TestYear-5","v":2016},{"$f":"TestYear-4","v":2017},{"$f":"TestYear-3","v":2018},{"$f":"TestYear-2","v":2019},{"$f":"B16","v":2015},2016,2017,2018,2019,2015,2016,2017,2018,2019]
["SAIDI "]
["SAIFI"]
[]
["5 Year Historical Average"]
["SAIDI ",null,null,null,null,{"$f":"IF(ISERROR(AVERAGE(B17:F17)), \"\", AVERAGE(B17:F17))","v":""},null,null,null,null,{"$f":"IF(ISERROR(AVERAGE(G17:K17)), \"\", AVERAGE(G17:K17))","v":""},null,null,null,null,{"$f":"IF(ISERROR(AVERAGE(L17:P17)), \"\", AVERAGE(L17:P17))","v":""}]
["SAIFI",null,null,null,null,{"$f":"IF(ISERROR(AVERAGE(B18:F18)), \"\", AVERAGE(B18:F18))","v":""},null,null,null,null,{"$f":"IF(ISERROR(AVERAGE(G18:K18)), \"\", AVERAGE(G18:K18))","v":""},null,null,null,null,{"$f":"IF(ISERROR(AVERAGE(L18:P18)), \"\", AVERAGE(L18:P18))","v":""}]
[]
["SAIDI = System Average Interruption Duration Index"]
["SAIFI = System Average Interruption Frequency Index "]
[]
["Service Quality"]
[]
["Indicator",null,null,null,"OEB Minimum Standard",null,{"$f":"B16","v":2015},{"$f":"C16","v":2016},{"$f":"D16","v":2017},{"$f":"E16","v":2018},{"$f":"F16","v":2019}]
["Low Voltage Connections",null,null,null,0.9]
["High Voltage Connections",null,null,null,0.9]
["Telephone Accessibility",null,null,null,0.65]
["Appointments Met",null,null,null,0.9]
["Written Response to Enquires",null,null,null,0.8]
["Emergency Urban Response",null,null,null,0.8]
["Emergency Rural Response",null,null,null,0.8]
["Telephone Call Abandon Rate",null,null,null,0.1]
["Appointment Scheduling",null,null,null,0.9]
["Rescheduling a Missed Appointment",null,null,null,1]
["Reconnection Performance Standard",null,null,null,0.85]

{"sheet":"App.2-H_Other_Oper_Rev","index":24,"n_rows":567,"n_cols":14,"rows_kept":567,"cut":false,"hidden":false,"merged":[[8,0,8,11],[9,0,9,11],[51,0,51,11],[52,0,52,1],[91,1,91,11],[76,0,76,1],[69,0,70,11],[75,0,75,1],[82,0,82,1],[77,0,77,1],[78,0,78,1],[79,0,79,1],[81,0,81,1],[87,1,87,11],[55,0,55,1],[56,0,56,1],[62,0,62,11],[53,0,53,1],[54,0,54,1],[61,0,61,11],[60,0,60,11],[59,0,59,11],[58,0,58,11],[88,2,88,9],[112,0,112,1],[113,0,113,1],[114,0,114,1],[115,0,115,1],[116,0,116,1],[66,0,66,11],[103,0,103,1],[95,0,95,1],[96,0,96,1],[97,0,97,1],[100,0,100,1],[101,0,101,1],[102,0,102,1],[98,0,98,1],[99,0,99,1],[104,0,104,1],[109,0,109,1],[110,0,110,1],[111,0,111,1],[80,0,80,1],[92,0,92,2],[106,0,106,2],[132,0,132,1],[137,0,137,1],[138,0,138,1],[139,0,139,1],[140,0,140,1],[117,0,117,1],[118,0,118,1],[124,0,124,1],[130,0,130,1],[131,0,131,1],[128,0,128,1],[129,0,129,1],[125,0,125,1],[126,0,126,1],[127,0,127,1],[123,0,123,1],[120,0,120,2],[134,0,134,2],[146,0,146,1],[151,0,151,1],[152,0,152,1],[153,0,153,1],[154,0,154,1],[141,0,141,1],[142,0,142,1],[143,0,143,1],[144,0,144,1],[145,0,145,1],[148,0,148,2],[160,0,160,1],[165,0,165,1],[166,0,166,1],[167,0,167,1],[168,0,168,1],[155,0,155,1],[156,0,156,1],[157,0,157,1],[158,0,158,1],[159,0,159,1],[162,0,162,2],[174,0,174,1],[179,0,179,1],[180,0,180,1],[181,0,181,1],[182,0,182,1],[169,0,169,1],[170,0,170,1],[171,0,171,1],[172,0,172,1],[173,0,173,1],[176,0,176,2],[188,0,188,1],[193,0,193,1],[194,0,194,1],[195,0,195,1],[196,0,196,1],[183,0,183,1],[184,0,184,1],[185,0,185,1],[186,0,186,1],[187,0,187,1],[190,0,190,2],[202,0,202,1],[207,0,207,1],[208,0,208,1],[209,0,209,1],[210,0,210,1],[197,0,197,1],[198,0,198,1],[199,0,199,1],[200,0,200,1],[201,0,201,1],[204,0,204,2],[216,0,216,1],[221,0,221,1],[222,0,222,1],[223,0,223,1],[224,0,224,1],[211,0,211,1],[212,0,212,1],[213,0,213,1],[214,0,214,1],[215,0,215,1],[218,0,218,2],[230,0,230,1],[235,0,235,1],[236,0,236,1],[237,0,237,1],[238,0,238,1],[225,0,225,1],[226,0,226,1],[227,0,227,1],[228,0,228,1],[229,0,229,1],[232,0,232,2],[244,0,244,1],[249,0,249,1],[250,0,250,1],[251,0,251,1],[252,0,252,1],[239,0,239,1],[240,0,240,1],[241,0,241,1],[242,0,242,1],[243,0,243,1],[246,0,246,2],[258,0,258,1],[263,0,263,1],[264,0,264,1],[265,0,265,1],[266,0,266,1],[253,0,253,1],[254,0,254,1],[255,0,255,1],[256,0,256,1],[257,0,257,1],[260,0,260,2],[272,0,272,1],[277,0,277,1],[278,0,278,1],[279,0,279,1],[280,0,280,1],[267,0,267,1],[268,0,268,1],[269,0,269,1],[270,0,270,1],[271,0,271,1],[274,0,274,2],[286,0,286,1],[291,0,291,1],[292,0,292,1],[293,0,293,1],[294,0,294,1],[281,0,281,1],[282,0,282,1],[283,0,283,1],[284,0,284,1],[285,0,285,1],[288,0,288,2],[300,0,300,1],[305,0,305,1],[306,0,306,1],[307,0,307,1],[308,0,308,1],[295,0,295,1],[296,0,296,1],[297,0,297,1],[298,0,298,1],[299,0,299,1],[302,0,302,2],[314,0,314,1],[319,0,319,1],[320,0,320,1],[321,0,321,1],[322,0,322,1],[309,0,309,1],[310,0,310,1],[311,0,311,1],[312,0,312,1],[313,0,313,1],[316,0,316,2],[328,0,328,1],[333,0,333,1],[334,0,334,1],[335,0,335,1],[336,0,336,1],[323,0,323,1],[324,0,324,1],[325,0,325,1],[326,0,326,1],[327,0,327,1],[330,0,330,2],[342,0,342,1],[347,0,347,1],[348,0,348,1],[349,0,349,1],[350,0,350,1],[337,0,337,1],[338,0,338,1],[339,0,339,1],[340,0,340,1],[341,0,341,1],[344,0,344,2],[356,0,356,1],[361,0,361,1],[362,0,362,1],[363,0,363,1],[364,0,364,1],[351,0,351,1],[352,0,352,1],[353,0,353,1],[354,0,354,1],[355,0,355,1],[358,0,358,2],[370,0,370,1],[375,0,375,1],[376,0,376,1],[377,0,377,1],[378,0,378,1],[365,0,365,1],[366,0,366,1],[367,0,367,1],[368,0,368,1],[369,0,369,1],[372,0,372,2],[384,0,384,1],[389,0,389,1],[390,0,390,1],[391,0,391,1],[392,0,392,1],[379,0,379,1],[380,0,380,1],[381,0,381,1],[382,0,382,1],[383,0,383,1],[386,0,386,2],[398,0,398,1],[403,0,403,1],[404,0,404,1],[405,0,405,1],[406,0,406,1],[393,0,393,1],[394,0,394,1],[395,0,395,1],[396,0,396,1],[397,0,397,1],[400,0,400,2],[412,0,412,1],[417,0,417,1],[418,0,418,1],[419,0,419,1],[420,0,420,1],[407,0,407,1],[408,0,408,1],[409,0,409,1],[410,0,410,1],[411,0,411,1],[414,0,414,2],[426,0,426,1],[431,0,431,1],[432,0,432,1],[433,0,433,1],[434,0,434,1],[421,0,421,1],[422,0,422,1],[423,0,423,1],[424,0,424,1],[425,0,425,1],[428,0,428,2],[440,0,440,1],[445,0,445,1],[446,0,446,1],[447,0,447,1],[448,0,448,1],[435,0,435,1],[436,0,436,1],[437,0,437,1],[438,0,438,1],[439,0,439,1],[442,0,442,2],[454,0,454,1],[459,0,459,1],[460,0,460,1],[461,0,461,1],[462,0,462,1],[449,0,449,1],[450,0,450,1],[451,0,451,1],[452,0,452,1],[453,0,453,1],[456,0,456,2],[468,0,468,1],[473,0,473,1],[474,0,474,1],[475,0,475,1],[476,0,476,1],[463,0,463,1],[464,0,464,1],[465,0,465,1],[466,0,466,1],[467,0,467,1],[470,0,470,2],[482,0,482,1],[487,0,487,1],[488,0,488,1],[489,0,489,1],[490,0,490,1],[477,0,477,1],[478,0,478,1],[479,0,479,1],[480,0,480,1],[481,0,481,1],[484,0,484,2],[496,0,496,1],[501,0,501,1],[502,0,502,1],[503,0,503,1],[504,0,504,1],[491,0,491,1],[492,0,492,1],[493,0,493,1],[494,0,494,1],[495,0,495,1],[498,0,498,2],[510,0,510,1],[515,0,515,1],[516,0,516,1],[517,0,517,1],[518,0,518,1],[505,0,505,1],[506,0,506,1],[507,0,507,1],[508,0,508,1],[509,0,509,1],[512,0,512,2],[535,0,535,1],[536,0,536,1],[537,0,537,1],[524,0,524,1],[529,0,529,1],[530,0,530,1],[531,0,531,1],[532,0,532,1],[519,0,519,1],[520,0,520,1],[521,0,521,1],[522,0,522,1],[523,0,523,1],[526,0,526,2],[533,0,533,1],[534,0,534,1],[566,0,566,1],[561,0,561,1],[562,0,562,1],[563,0,563,1],[564,0,564,1],[565,0,565,1],[552,0,552,1],[557,0,557,1],[558,0,558,1],[559,0,559,1],[560,0,560,1],[554,0,554,2],[547,0,547,1],[548,0,548,1],[549,0,549,1],[550,0,550,1],[551,0,551,1],[538,0,538,1],[543,0,543,1],[544,0,544,1],[545,0,545,1],[546,0,546,1],[540,0,540,2]]}
[null,null,null,null,null,null,null,null,null,null,"File Number:",{"$f":"EBNUMBER","v":0}]
[null,null,null,null,null,null,null,null,null,null,"Exhibit:"]
[null,null,null,null,null,null,null,null,null,null,"Tab:"]
["TO BE UPDATED AT THE DRAFT RATE ORDER STAGE",null,null,null,null,null,null,null,null,null,"Schedule:"]
[null,null,null,null,null,null,null,null,null,null,"Page:"]
[]
[null,null,null,null,null,null,null,null,null,null,"Date:"]
[]
["Appendix 2-H"]
["Other Operating Revenue"]
[]
["USoA #","USoA Description",{"$f":"D13 - 1 &\" Actual\"&CHAR(178)","v":"2012 Actual²"},"2013 Actual²","2014 Actual²","2015 Actual²",{"$f":"H13 - 1 &\" Actual\"&CHAR(178)","v":"2016 Actual²"},{"$f":"I13 - 1 &\" Actual\"&CHAR(178)","v":"2017 Actual²"},{"$f":"I13 & \" Actual\" & CHAR(178)","v":"2018 Actual²"},{"$f":"J13& \" Actual\"","v":"2019 Actual"},"Bridge Year","Test Year",null,"CGAAP"]
[null,null,{"$f":"D13-1","v":2012},{"$f":"E13-1","v":2013},{"$f":"F13-1","v":2014},{"$f":"G13-1","v":2015},{"$f":"H13-1","v":2016},{"$f":"I13-1","v":2017},{"$f":"J13-1","v":2018},2019,{"$f":"BridgeYear","v":2020},{"$f":"TestYear","v":2021},null,"Enter Transition Year"]
[null,"Reporting Basis",null,null,null,null,null,null,null,null,null,null,null,"CGAAP"]
[4235,"Specific Service Charges"]
[4225,"Late Payment Charges"]
[4082,"Retail Services Revenues"]
["etc."]
[]
[]
[]
[]
[]
[]
[]
[]
[]
[]
[]
[]
[]
[]
[]
[]
[]
[]
[]
[]
[]
[]
[]
[]
[]
[]
[]
[]
[]
[]
[]
[]
[]
[]
["Specific Service Charges",null,{"$f":"C15","v":0},0,0,0,0,0,0,0,0,0,null,{"$f":"N15","v":0}]
["Late Payment Charges",null,{"$f":"C16","v":0},0,0,0,0,0,0,0,0,0,null,{"$f":"N16","v":0}]
["Other Operating Revenues"]
["Other Income or Deductions"]
["Total",null,{"$f":"SUM(C53:C56)","v":0},{"$f":"SUM(D53:D56)","v":0},{"$f":"SUM(E53:E56)","v":0},{"$f":"SUM(F53:F56)","v":0},{"$f":"SUM(G53:G56)","v":0},0,0,0,0,0,null,{"$f":"SUM(N53:N56)","v":0}]
[]
["Description                          Account(s)"]
["Specific Service Charges:       4235"]
["Late Payment Charges:          4225"]
["Other Distribution Revenues:   4082, 4084, 4090, 4205, 4210, 4215, 4220, 4230, 4240, 4245"]
["Other Income and Expenses:  4305, 4310, 4315, 4320, 4325, 4330, 4335, 4340, 4345, 4350, 4355, 4357, 4360, 4362, 4365, 4370, 4375, 4380, 4385, 4390, 4395, 4398, 4405, 4410, 4415, 4420"]
[]
[]
["Note: Add all applicable accounts listed above to the table and include all relevant information."]
[]
["Account Breakdown Details"]
[]
["For each \"Other Operating Revenue\" and \"Other Income or Deductions\" Account, a detailed breakdown of the account components is required.  See the example below for Account 4405, Interest and Dividend Income.  Tables for the detailed breakdowns will be generated after cell B89 is filled in."]
[]
[]
["Example: Account 4405 - Interest and Dividend Income"]
[null,null,{"$f":"C12","v":"2012 Actual²"},"2013 Actual²","2014 Actual²","2015 Actual²","2016 Actual²","2017 Actual²","2018 Actual²","2019 Actual","Bridge Year","Test Year",null,{"$f":"N12","v":"CGAAP"}]
[null,null,{"$f":"C13","v":2012},2013,2014,2015,2016,2017,2018,{"$f":"J13","v":2019},{"$f":"K13","v":2020},{"$f":"L13","v":2021},null,{"$f":"N13","v":"Enter Transition Year"}]
["Reporting Basis",null,{"$f":"IF(C14=0, \"\", C14)","v":""},"","","","","","","","","",null,{"$f":"IF(N14=0, \"\", N14)","v":"CGAAP"}]
["Short-term Investment Interest"]
["Bank Deposit Interest"]
["Miscellaneous Interest Revenue"]
["etc.1"]
[]
[]
["Total",null,{"$f":"SUM(C77:C82)","v":0},0,0,0,0,0,0,0,0,0,null,{"$f":"SUM(N77:N82)","v":0}]
[]
[]
["Notes:"]
[1,"List and specify any other interest revenue."]
[2,"For applicants rebasing under IFRS for the first time, in the transition year (2014) to IFRS, the applicant is to present information in both MIFRS and CGAAP. In column N, present CGAAP transition year information."]
[null,null,"Enter the number of \"Other Operating Revenue\" and \"Other Income or Deductions\" Accounts that require a detailed breakdown of the account components."]
[]
[]
[]
[]
[null,null,{"$f":"C$12","v":"2012 Actual²"},"2013 Actual²","2014 Actual²","2015 Actual²","2016 Actual²","2017 Actual²","2018 Actual²","2019 Actual","Bridge Year","Test Year",null,{"$f":"N$12","v":"CGAAP"}]
[null,null,{"$f":"C$13","v":2012},2013,2014,2015,2016,2017,2018,2019,2020,2021,null,{"$f":"N$13","v":"Enter Transition Year"}]
["Reporting Basis",null,{"$f":"IF(C34=0, \"\", C34)","v":""},"","","","","","","","","",null,{"$f":"IF(N$14=0, \"\", N$14)","v":"CGAAP"}]
[]
[]
[]
[]
[]
[]
[]
[]
["Total",null,{"$f":"SUM(C97:C104)","v":0},0,0,0,0,0,0,0,0,0,null,{"$f":"SUM(N97:N104)","v":0}]
[]
[]
[null,null,{"$f":"C$12","v":"2012 Actual²"},"2013 Actual²","2014 Actual²","2015 Actual²","2016 Actual²","2017 Actual²","2018 Actual²","2019 Actual","Bridge Year","Test Year",null,{"$f":"N$12","v":"CGAAP"}]
[null,null,{"$f":"C$13","v":2012},2013,2014,2015,2016,2017,2018,2019,2020,2021,null,{"$f":"N$13","v":"Enter Transition Year"}]
["Reporting Basis",null,{"$f":"IF(C48=0, \"\", C48)","v":""},"","","","","","","","","",null,{"$f":"IF(N$14=0, \"\", N$14)","v":"CGAAP"}]
[]
[]
[]
[]
[]
[]
[]
[]
["Total",null,{"$f":"SUM(C111:C118)","v":0},{"$f":"SUM(D111:D118)","v":0},{"$f":"SUM(E111:E118)","v":0},{"$f":"SUM(F111:F118)","v":0},{"$f":"SUM(G111:G118)","v":0},{"$f":"SUM(H111:H118)","v":0},{"$f":"SUM(I111:I118)","v":0},{"$f":"SUM(J111:J118)","v":0},{"$f":"SUM(K111:K118)","v":0},{"$f":"SUM(L111:L118)","v":0},null,{"$f":"SUM(N111:N118)","v":0}]
[]
[]
[null,null,{"$f":"C$12","v":"2012 Actual²"},"2013 Actual²","2014 Actual²","2015 Actual²","2016 Actual²","2017 Actual²","2018 Actual²","2019 Actual","Bridge Year","Test Year",null,{"$f":"N$12","v":"CGAAP"}]
[null,null,{"$f":"C$13","v":2012},2013,2014,2015,2016,2017,2018,2019,2020,2021,null,{"$f":"N$13","v":"Enter Transition Year"}]
["Reporting Basis",null,{"$f":"IF(C62=0, \"\", C62)","v":""},"","","","","","","","","",null,{"$f":"IF(N$14=0, \"\", N$14)","v":"CGAAP"}]
[]
[]
[]
[]
[]
[]
[]
[]
["Total",null,{"$f":"SUM(C125:C132)","v":0},{"$f":"SUM(D125:D132)","v":0},{"$f":"SUM(E125:E132)","v":0},{"$f":"SUM(F125:F132)","v":0},{"$f":"SUM(G125:G132)","v":0},{"$f":"SUM(H125:H132)","v":0},{"$f":"SUM(I125:I132)","v":0},{"$f":"SUM(J125:J132)","v":0},{"$f":"SUM(K125:K132)","v":0},{"$f":"SUM(L125:L132)","v":0},null,{"$f":"SUM(N125:N132)","v":0}]
[]
[]
[null,null,{"$f":"C$12","v":"2012 Actual²"},"2013 Actual²","2014 Actual²","2015 Actual²","2016 Actual²","2017 Actual²","2018 Actual²","2019 Actual","Bridge Year","Test Year",null,{"$f":"N$12","v":"CGAAP"}]
[null,null,{"$f":"C$13","v":2012},2013,2014,2015,2016,2017,2018,2019,2020,2021,null,{"$f":"N$13","v":"Enter Transition Year"}]
["Reporting Basis",null,{"$f":"IF(C76=0, \"\", C76)","v":""},"","","","","","","","","",null,{"$f":"IF(N$14=0, \"\", N$14)","v":"CGAAP"}]
[]
[]
[]
[]
[]
[]
[]
[]
["Total",null,{"$f":"SUM(C139:C146)","v":0},{"$f":"SUM(D139:D146)","v":0},{"$f":"SUM(E139:E146)","v":0},{"$f":"SUM(F139:F146)","v":0},{"$f":"SUM(G139:G146)","v":0},{"$f":"SUM(H139:H146)","v":0},{"$f":"SUM(I139:I146)","v":0},{"$f":"SUM(J139:J146)","v":0},{"$f":"SUM(K139:K146)","v":0},{"$f":"SUM(L139:L146)","v":0},null,{"$f":"SUM(N139:N146)","v":0}]
[]
[]
[null,null,{"$f":"C$12","v":"2012 Actual²"},"2013 Actual²","2014 Actual²","2015 Actual²","2016 Actual²","2017 Actual²","2018 Actual²","2019 Actual","Bridge Year","Test Year",null,{"$f":"N$12","v":"CGAAP"}]
[null,null,{"$f":"C$13","v":2012},2013,2014,2015,2016,2017,2018,2019,2020,2021,null,{"$f":"N$13","v":"Enter Transition Year"}]
["Reporting Basis",null,{"$f":"IF(C90=0, \"\", C90)","v":""},"","","","","","","","","",null,{"$f":"IF(N$14=0, \"\", N$14)","v":"CGAAP"}]
[]
[]
[]
[]
[]
[]
[]
[]
["Total",null,{"$f":"SUM(C153:C160)","v":0},{"$f":"SUM(D153:D160)","v":0},{"$f":"SUM(E153:E160)","v":0},{"$f":"SUM(F153:F160)","v":0},{"$f":"SUM(G153:G160)","v":0},{"$f":"SUM(H153:H160)","v":0},{"$f":"SUM(I153:I160)","v":0},{"$f":"SUM(J153:J160)","v":0},{"$f":"SUM(K153:K160)","v":0},{"$f":"SUM(L153:L160)","v":0},null,{"$f":"SUM(N153:N160)","v":0}]
[]
[]
[null,null,{"$f":"C$12","v":"2012 Actual²"},"2013 Actual²","2014 Actual²","2015 Actual²","2016 Actual²","2017 Actual²","2018 Actual²","2019 Actual","Bridge Year","Test Year",null,{"$f":"N$12","v":"CGAAP"}]
[null,null,{"$f":"C$13","v":2012},2013,2014,2015,2016,2017,2018,2019,2020,2021,null,{"$f":"N$13","v":"Enter Transition Year"}]
["Reporting Basis",null,{"$f":"IF(C104=0, \"\", C104)","v":""},"","","","","","","","","",null,{"$f":"IF(N$14=0, \"\", N$14)","v":"CGAAP"}]
[]
[]
[]
[]
[]
[]
[]
[]
["Total",null,{"$f":"SUM(C167:C174)","v":0},{"$f":"SUM(D167:D174)","v":0},{"$f":"SUM(E167:E174)","v":0},{"$f":"SUM(F167:F174)","v":0},{"$f":"SUM(G167:G174)","v":0},{"$f":"SUM(H167:H174)","v":0},{"$f":"SUM(I167:I174)","v":0},{"$f":"SUM(J167:J174)","v":0},{"$f":"SUM(K167:K174)","v":0},{"$f":"SUM(L167:L174)","v":0},null,{"$f":"SUM(N167:N174)","v":0}]
[]
[]
[null,null,{"$f":"C$12","v":"2012 Actual²"},"2013 Actual²","2014 Actual²","2015 Actual²","2016 Actual²","2017 Actual²","2018 Actual²","2019 Actual","Bridge Year","Test Year",null,{"$f":"N$12","v":"CGAAP"}]
[null,null,{"$f":"C$13","v":2012},2013,2014,2015,2016,2017,2018,2019,2020,2021,null,{"$f":"N$13","v":"Enter Transition Year"}]
["Reporting Basis",null,{"$f":"IF(C118=0, \"\", C118)","v":""},"","","","","","","","","",null,{"$f":"IF(N$14=0, \"\", N$14)","v":"CGAAP"}]
[]
[]
[]
[]
[]
[]
[]
[]
["Total",null,{"$f":"SUM(C181:C188)","v":0},{"$f":"SUM(D181:D188)","v":0},{"$f":"SUM(E181:E188)","v":0},{"$f":"SUM(F181:F188)","v":0},{"$f":"SUM(G181:G188)","v":0},{"$f":"SUM(H181:H188)","v":0},{"$f":"SUM(I181:I188)","v":0},{"$f":"SUM(J181:J188)","v":0},{"$f":"SUM(K181:K188)","v":0},{"$f":"SUM(L181:L188)","v":0},null,{"$f":"SUM(N181:N188)","v":0}]
[]
[]
[null,null,{"$f":"C$12","v":"2012 Actual²"},"2013 Actual²","2014 Actual²","2015 Actual²","2016 Actual²","2017 Actual²","2018 Actual²","2019 Actual","Bridge Year","Test Year",null,{"$f":"N$12","v":"CGAAP"}]
[null,null,{"$f":"C$13","v":2012},2013,2014,2015,2016,2017,2018,2019,2020,2021,null,{"$f":"N$13","v":"Enter Transition Year"}]
["Reporting Basis",null,{"$f":"IF(C132=0, \"\", C132)","v":""},"","","","","","","","","",null,{"$f":"IF(N$14=0, \"\", N$14)","v":"CGAAP"}]
[]
[]
[]
[]
[]
[]
[]
[]
["Total",null,{"$f":"SUM(C195:C202)","v":0},{"$f":"SUM(D195:D202)","v":0},{"$f":"SUM(E195:E202)","v":0},{"$f":"SUM(F195:F202)","v":0},{"$f":"SUM(G195:G202)","v":0},{"$f":"SUM(H195:H202)","v":0},{"$f":"SUM(I195:I202)","v":0},{"$f":"SUM(J195:J202)","v":0},{"$f":"SUM(K195:K202)","v":0},{"$f":"SUM(L195:L202)","v":0},null,{"$f":"SUM(N195:N202)","v":0}]
[]
[]
[null,null,{"$f":"C$12","v":"2012 Actual²"},"2013 Actual²","2014 Actual²","2015 Actual²","2016 Actual²","2017 Actual²","2018 Actual²","2019 Actual","Bridge Year","Test Year",null,{"$f":"N$12","v":"CGAAP"}]
[null,null,{"$f":"C$13","v":2012},2013,2014,2015,2016,2017,2018,2019,2020,2021,null,{"$f":"N$13","v":"Enter Transition Year"}]
["Reporting Basis",null,{"$f":"IF(C146=0, \"\", C146)","v":""},"","","","","","","","","",null,{"$f":"IF(N$14=0, \"\", N$14)","v":"CGAAP"}]
[]
[]
[]
[]
[]
[]
[]
[]
["Total",null,{"$f":"SUM(C209:C216)","v":0},{"$f":"SUM(D209:D216)","v":0},{"$f":"SUM(E209:E216)","v":0},{"$f":"SUM(F209:F216)","v":0},{"$f":"SUM(G209:G216)","v":0},{"$f":"SUM(H209:H216)","v":0},{"$f":"SUM(I209:I216)","v":0},{"$f":"SUM(J209:J216)","v":0},{"$f":"SUM(K209:K216)","v":0},{"$f":"SUM(L209:L216)","v":0},null,{"$f":"SUM(N209:N216)","v":0}]
[]
[]
[null,null,{"$f":"C$12","v":"2012 Actual²"},"2013 Actual²","2014 Actual²","2015 Actual²","2016 Actual²","2017 Actual²","2018 Actual²","2019 Actual","Bridge Year","Test Year",null,{"$f":"N$12","v":"CGAAP"}]
[null,null,{"$f":"C$13","v":2012},2013,2014,2015,2016,2017,2018,2019,2020,2021,null,{"$f":"N$13","v":"Enter Transition Year"}]
["Reporting Basis",null,{"$f":"IF(C160=0, \"\", C160)","v":""},"","","","","","","","","",null,{"$f":"IF(N$14=0, \"\", N$14)","v":"CGAAP"}]
[]
[]
[]
[]
[]
[]
[]
[]
["Total",null,{"$f":"SUM(C223:C230)","v":0},{"$f":"SUM(D223:D230)","v":0},{"$f":"SUM(E223:E230)","v":0},{"$f":"SUM(F223:F230)","v":0},{"$f":"SUM(G223:G230)","v":0},{"$f":"SUM(H223:H230)","v":0},{"$f":"SUM(I223:I230)","v":0},{"$f":"SUM(J223:J230)","v":0},{"$f":"SUM(K223:K230)","v":0},{"$f":"SUM(L223:L230)","v":0},null,{"$f":"SUM(N223:N230)","v":0}]
[]
[]
[null,null,{"$f":"C$12","v":"2012 Actual²"},"2013 Actual²","2014 Actual²","2015 Actual²","2016 Actual²","2017 Actual²","2018 Actual²","2019 Actual","Bridge Year","Test Year",null,{"$f":"N$12","v":"CGAAP"}]
[null,null,{"$f":"C$13","v":2012},2013,2014,2015,2016,2017,2018,2019,2020,2021,null,{"$f":"N$13","v":"Enter Transition Year"}]
["Reporting Basis",null,{"$f":"IF(C174=0, \"\", C174)","v":""},"","","","","","","","","",null,{"$f":"IF(N$14=0, \"\", N$14)","v":"CGAAP"}]
[]
[]
[]
[]
[]
[]
[]
[]
["Total",null,{"$f":"SUM(C237:C244)","v":0},{"$f":"SUM(D237:D244)","v":0},{"$f":"SUM(E237:E244)","v":0},{"$f":"SUM(F237:F244)","v":0},{"$f":"SUM(G237:G244)","v":0},{"$f":"SUM(H237:H244)","v":0},{"$f":"SUM(I237:I244)","v":0},{"$f":"SUM(J237:J244)","v":0},{"$f":"SUM(K237:K244)","v":0},{"$f":"SUM(L237:L244)","v":0},null,{"$f":"SUM(N237:N244)","v":0}]
[]
[]
[null,null,{"$f":"C$12","v":"2012 Actual²"},"2013 Actual²","2014 Actual²","2015 Actual²","2016 Actual²","2017 Actual²","2018 Actual²","2019 Actual","Bridge Year","Test Year",null,{"$f":"N$12","v":"CGAAP"}]
[null,null,{"$f":"C$13","v":2012},2013,2014,2015,2016,2017,2018,2019,2020,2021,null,{"$f":"N$13","v":"Enter Transition Year"}]
["Reporting Basis",null,{"$f":"IF(C188=0, \"\", C188)","v":""},"","","","","","","","","",null,{"$f":"IF(N$14=0, \"\", N$14)","v":"CGAAP"}]
[]
[]
[]
[]
[]
[]
[]
[]
["Total",null,{"$f":"SUM(C251:C258)","v":0},{"$f":"SUM(D251:D258)","v":0},{"$f":"SUM(E251:E258)","v":0},{"$f":"SUM(F251:F258)","v":0},{"$f":"SUM(G251:G258)","v":0},{"$f":"SUM(H251:H258)","v":0},{"$f":"SUM(I251:I258)","v":0},{"$f":"SUM(J251:J258)","v":0},{"$f":"SUM(K251:K258)","v":0},{"$f":"SUM(L251:L258)","v":0},null,{"$f":"SUM(N251:N258)","v":0}]
[]
[]
[null,null,{"$f":"C$12","v":"2012 Actual²"},"2013 Actual²","2014 Actual²","2015 Actual²","2016 Actual²","2017 Actual²","2018 Actual²","2019 Actual","Bridge Year","Test Year",null,{"$f":"N$12","v":"CGAAP"}]
[null,null,{"$f":"C$13","v":2012},2013,2014,2015,2016,2017,2018,2019,2020,2021,null,{"$f":"N$13","v":"Enter Transition Year"}]
["Reporting Basis",null,{"$f":"IF(C202=0, \"\", C202)","v":""},"","","","","","","","","",null,{"$f":"IF(N$14=0, \"\", N$14)","v":"CGAAP"}]
[]
[]
[]
[]
[]
[]
[]
[]
["Total",null,{"$f":"SUM(C265:C272)","v":0},{"$f":"SUM(D265:D272)","v":0},{"$f":"SUM(E265:E272)","v":0},{"$f":"SUM(F265:F272)","v":0},{"$f":"SUM(G265:G272)","v":0},{"$f":"SUM(H265:H272)","v":0},{"$f":"SUM(I265:I272)","v":0},{"$f":"SUM(J265:J272)","v":0},{"$f":"SUM(K265:K272)","v":0},{"$f":"SUM(L265:L272)","v":0},null,{"$f":"SUM(N265:N272)","v":0}]
[]
[]
[null,null,{"$f":"C$12","v":"2012 Actual²"},"2013 Actual²","2014 Actual²","2015 Actual²","2016 Actual²","2017 Actual²","2018 Actual²","2019 Actual","Bridge Year","Test Year",null,{"$f":"N$12","v":"CGAAP"}]
[null,null,{"$f":"C$13","v":2012},2013,2014,2015,2016,2017,2018,2019,2020,2021,null,{"$f":"N$13","v":"Enter Transition Year"}]
["Reporting Basis",null,{"$f":"IF(C216=0, \"\", C216)","v":""},"","","","","","","","","",null,{"$f":"IF(N$14=0, \"\", N$14)","v":"CGAAP"}]
[]
[]
[]
[]
[]
[]
[]
[]
["Total",null,{"$f":"SUM(C279:C286)","v":0},{"$f":"SUM(D279:D286)","v":0},{"$f":"SUM(E279:E286)","v":0},{"$f":"SUM(F279:F286)","v":0},{"$f":"SUM(G279:G286)","v":0},{"$f":"SUM(H279:H286)","v":0},{"$f":"SUM(I279:I286)","v":0},{"$f":"SUM(J279:J286)","v":0},{"$f":"SUM(K279:K286)","v":0},{"$f":"SUM(L279:L286)","v":0},null,{"$f":"SUM(N279:N286)","v":0}]
[]
[]
[null,null,{"$f":"C$12","v":"2012 Actual²"},"2013 Actual²","2014 Actual²","2015 Actual²","2016 Actual²","2017 Actual²","2018 Actual²","2019 Actual","Bridge Year","Test Year",null,{"$f":"N$12","v":"CGAAP"}]
[null,null,{"$f":"C$13","v":2012},2013,2014,2015,2016,2017,2018,2019,2020,2021,null,{"$f":"N$13","v":"Enter Transition Year"}]
["Reporting Basis",null,{"$f":"IF(C230=0, \"\", C230)","v":""},"","","","","","","","","",null,{"$f":"IF(N$14=0, \"\", N$14)","v":"CGAAP"}]
[]
[]
[]
[]
[]
[]
[]
[]
["Total",null,{"$f":"SUM(C293:C300)","v":0},{"$f":"SUM(D293:D300)","v":0},{"$f":"SUM(E293:E300)","v":0},{"$f":"SUM(F293:F300)","v":0},{"$f":"SUM(G293:G300)","v":0},{"$f":"SUM(H293:H300)","v":0},{"$f":"SUM(I293:I300)","v":0},{"$f":"SUM(J293:J300)","v":0},{"$f":"SUM(K293:K300)","v":0},{"$f":"SUM(L293:L300)","v":0},null,{"$f":"SUM(N293:N300)","v":0}]
[]
[]
[null,null,{"$f":"C$12","v":"2012 Actual²"},"2013 Actual²","2014 Actual²","2015 Actual²","2016 Actual²","2017 Actual²","2018 Actual²","2019 Actual","Bridge Year","Test Year",null,{"$f":"N$12","v":"CGAAP"}]
[null,null,{"$f":"C$13","v":2012},2013,2014,2015,2016,2017,2018,2019,2020,2021,null,{"$f":"N$13","v":"Enter Transition Year"}]
["Reporting Basis",null,{"$f":"IF(C244=0, \"\", C244)","v":""},"","","","","","","","","",null,{"$f":"IF(N$14=0, \"\", N$14)","v":"CGAAP"}]
[]
[]
[]
[]
[]
[]
[]
[]
["Total",null,{"$f":"SUM(C307:C314)","v":0},{"$f":"SUM(D307:D314)","v":0},{"$f":"SUM(E307:E314)","v":0},{"$f":"SUM(F307:F314)","v":0},{"$f":"SUM(G307:G314)","v":0},{"$f":"SUM(H307:H314)","v":0},{"$f":"SUM(I307:I314)","v":0},{"$f":"SUM(J307:J314)","v":0},{"$f":"SUM(K307:K314)","v":0},{"$f":"SUM(L307:L314)","v":0},null,{"$f":"SUM(N307:N314)","v":0}]
[]
[]
[null,null,{"$f":"C$12","v":"2012 Actual²"},"2013 Actual²","2014 Actual²","2015 Actual²","2016 Actual²","2017 Actual²","2018 Actual²","2019 Actual","Bridge Year","Test Year",null,{"$f":"N$12","v":"CGAAP"}]
[null,null,{"$f":"C$13","v":2012},2013,2014,2015,2016,2017,2018,2019,2020,2021,null,{"$f":"N$13","v":"Enter Transition Year"}]
["Reporting Basis",null,{"$f":"IF(C258=0, \"\", C258)","v":""},"","","","","","","","","",null,{"$f":"IF(N$14=0, \"\", N$14)","v":"CGAAP"}]
[]
[]
[]
[]
[]
[]
[]
[]
["Total",null,{"$f":"SUM(C321:C328)","v":0},{"$f":"SUM(D321:D328)","v":0},{"$f":"SUM(E321:E328)","v":0},{"$f":"SUM(F321:F328)","v":0},{"$f":"SUM(G321:G328)","v":0},{"$f":"SUM(H321:H328)","v":0},{"$f":"SUM(I321:I328)","v":0},{"$f":"SUM(J321:J328)","v":0},{"$f":"SUM(K321:K328)","v":0},{"$f":"SUM(L321:L328)","v":0},null,{"$f":"SUM(N321:N328)","v":0}]
[]
[]
[null,null,{"$f":"C$12","v":"2012 Actual²"},"2013 Actual²","2014 Actual²","2015 Actual²","2016 Actual²","2017 Actual²","2018 Actual²","2019 Actual","Bridge Year","Test Year",null,{"$f":"N$12","v":"CGAAP"}]
[null,null,{"$f":"C$13","v":2012},2013,2014,2015,2016,2017,2018,2019,2020,2021,null,{"$f":"N$13","v":"Enter Transition Year"}]
["Reporting Basis",null,{"$f":"IF(C272=0, \"\", C272)","v":""},"","","","","","","","","",null,{"$f":"IF(N$14=0, \"\", N$14)","v":"CGAAP"}]
[]
[]
[]
[]
[]
[]
[]
[]
["Total",null,{"$f":"SUM(C335:C342)","v":0},{"$f":"SUM(D335:D342)","v":0},{"$f":"SUM(E335:E342)","v":0},{"$f":"SUM(F335:F342)","v":0},{"$f":"SUM(G335:G342)","v":0},{"$f":"SUM(H335:H342)","v":0},{"$f":"SUM(I335:I342)","v":0},{"$f":"SUM(J335:J342)","v":0},{"$f":"SUM(K335:K342)","v":0},{"$f":"SUM(L335:L342)","v":0},null,{"$f":"SUM(N335:N342)","v":0}]
[]
[]
[null,null,{"$f":"C$12","v":"2012 Actual²"},"2013 Actual²","2014 Actual²","2015 Actual²","2016 Actual²","2017 Actual²","2018 Actual²","2019 Actual","Bridge Year","Test Year",null,{"$f":"N$12","v":"CGAAP"}]
[null,null,{"$f":"C$13","v":2012},2013,2014,2015,2016,2017,2018,2019,2020,2021,null,{"$f":"N$13","v":"Enter Transition Year"}]
["Reporting Basis",null,{"$f":"IF(C286=0, \"\", C286)","v":""},"","","","","","","","","",null,{"$f":"IF(N$14=0, \"\", N$14)","v":"CGAAP"}]
[]
[]
[]
[]
[]
[]
[]
[]
["Total",null,{"$f":"SUM(C349:C356)","v":0},{"$f":"SUM(D349:D356)","v":0},{"$f":"SUM(E349:E356)","v":0},{"$f":"SUM(F349:F356)","v":0},{"$f":"SUM(G349:G356)","v":0},{"$f":"SUM(H349:H356)","v":0},{"$f":"SUM(I349:I356)","v":0},{"$f":"SUM(J349:J356)","v":0},{"$f":"SUM(K349:K356)","v":0},{"$f":"SUM(L349:L356)","v":0},null,{"$f":"SUM(N349:N356)","v":0}]
[]
[]
[null,null,{"$f":"C$12","v":"2012 Actual²"},"2013 Actual²","2014 Actual²","2015 Actual²","2016 Actual²","2017 Actual²","2018 Actual²","2019 Actual","Bridge Year","Test Year",null,{"$f":"N$12","v":"CGAAP"}]
[null,null,{"$f":"C$13","v":2012},2013,2014,2015,2016,2017,2018,2019,2020,2021,null,{"$f":"N$13","v":"Enter Transition Year"}]
["Reporting Basis",null,{"$f":"IF(C300=0, \"\", C300)","v":""},"","","","","","","","","",null,{"$f":"IF(N$14=0, \"\", N$14)","v":"CGAAP"}]
[]
[]
[]
[]
[]
[]
[]
[]
["Total",null,{"$f":"SUM(C363:C370)","v":0},{"$f":"SUM(D363:D370)","v":0},{"$f":"SUM(E363:E370)","v":0},{"$f":"SUM(F363:F370)","v":0},{"$f":"SUM(G363:G370)","v":0},{"$f":"SUM(H363:H370)","v":0},{"$f":"SUM(I363:I370)","v":0},{"$f":"SUM(J363:J370)","v":0},{"$f":"SUM(K363:K370)","v":0},{"$f":"SUM(L363:L370)","v":0},null,{"$f":"SUM(N363:N370)","v":0}]
[]
[]
[null,null,{"$f":"C$12","v":"2012 Actual²"},"2013 Actual²","2014 Actual²","2015 Actual²","2016 Actual²","2017 Actual²","2018 Actual²","2019 Actual","Bridge Year","Test Year",null,{"$f":"N$12","v":"CGAAP"}]
[null,null,{"$f":"C$13","v":2012},2013,2014,2015,2016,2017,2018,2019,2020,2021,null,{"$f":"N$13","v":"Enter Transition Year"}]
["Reporting Basis",null,{"$f":"IF(C314=0, \"\", C314)","v":""},"","","","","","","","","",null,{"$f":"IF(N$14=0, \"\", N$14)","v":"CGAAP"}]
[]
[]
[]
[]
[]
[]
[]
[]
["Total",null,{"$f":"SUM(C377:C384)","v":0},{"$f":"SUM(D377:D384)","v":0},{"$f":"SUM(E377:E384)","v":0},{"$f":"SUM(F377:F384)","v":0},{"$f":"SUM(G377:G384)","v":0},{"$f":"SUM(H377:H384)","v":0},{"$f":"SUM(I377:I384)","v":0},{"$f":"SUM(J377:J384)","v":0},{"$f":"SUM(K377:K384)","v":0},{"$f":"SUM(L377:L384)","v":0},null,{"$f":"SUM(N377:N384)","v":0}]
[]
[]
[null,null,{"$f":"C$12","v":"2012 Actual²"},"2013 Actual²","2014 Actual²","2015 Actual²","2016 Actual²","2017 Actual²","2018 Actual²","2019 Actual","Bridge Year","Test Year",null,{"$f":"N$12","v":"CGAAP"}]
[null,null,{"$f":"C$13","v":2012},2013,2014,2015,2016,2017,2018,2019,2020,2021,null,{"$f":"N$13","v":"Enter Transition Year"}]
["Reporting Basis",null,{"$f":"IF(C328=0, \"\", C328)","v":""},"","","","","","","","","",null,{"$f":"IF(N$14=0, \"\", N$14)","v":"CGAAP"}]
[]
[]
[]
[]
[]
[]
[]
[]
["Total",null,{"$f":"SUM(C391:C398)","v":0},{"$f":"SUM(D391:D398)","v":0},{"$f":"SUM(E391:E398)","v":0},{"$f":"SUM(F391:F398)","v":0},{"$f":"SUM(G391:G398)","v":0},{"$f":"SUM(H391:H398)","v":0},{"$f":"SUM(I391:I398)","v":0},{"$f":"SUM(J391:J398)","v":0},{"$f":"SUM(K391:K398)","v":0},{"$f":"SUM(L391:L398)","v":0},null,{"$f":"SUM(N391:N398)","v":0}]
[]
[]
[null,null,{"$f":"C$12","v":"2012 Actual²"},"2013 Actual²","2014 Actual²","2015 Actual²","2016 Actual²","2017 Actual²","2018 Actual²","2019 Actual","Bridge Year","Test Year",null,{"$f":"N$12","v":"CGAAP"}]
[null,null,{"$f":"C$13","v":2012},2013,2014,2015,2016,2017,2018,2019,2020,2021,null,{"$f":"N$13","v":"Enter Transition Year"}]
["Reporting Basis",null,{"$f":"IF(C342=0, \"\", C342)","v":""},"","","","","","","","","",null,{"$f":"IF(N$14=0, \"\", N$14)","v":"CGAAP"}]
[]
[]
[]
[]
[]
[]
[]
[]
["Total",null,{"$f":"SUM(C405:C412)","v":0},{"$f":"SUM(D405:D412)","v":0},{"$f":"SUM(E405:E412)","v":0},{"$f":"SUM(F405:F412)","v":0},{"$f":"SUM(G405:G412)","v":0},{"$f":"SUM(H405:H412)","v":0},{"$f":"SUM(I405:I412)","v":0},{"$f":"SUM(J405:J412)","v":0},{"$f":"SUM(K405:K412)","v":0},{"$f":"SUM(L405:L412)","v":0},null,{"$f":"SUM(N405:N412)","v":0}]
[]
[]
[null,null,{"$f":"C$12","v":"2012 Actual²"},"2013 Actual²","2014 Actual²","2015 Actual²","2016 Actual²","2017 Actual²","2018 Actual²","2019 Actual","Bridge Year","Test Year",null,{"$f":"N$12","v":"CGAAP"}]
[null,null,{"$f":"C$13","v":2012},2013,2014,2015,2016,2017,2018,2019,2020,2021,null,{"$f":"N$13","v":"Enter Transition Year"}]
["Reporting Basis",null,{"$f":"IF(C356=0, \"\", C356)","v":""},"","","","","","","","","",null,{"$f":"IF(N$14=0, \"\", N$14)","v":"CGAAP"}]
[]
[]
[]
[]
[]
[]
[]
[]
["Total",null,{"$f":"SUM(C419:C426)","v":0},{"$f":"SUM(D419:D426)","v":0},{"$f":"SUM(E419:E426)","v":0},{"$f":"SUM(F419:F426)","v":0},{"$f":"SUM(G419:G426)","v":0},{"$f":"SUM(H419:H426)","v":0},{"$f":"SUM(I419:I426)","v":0},{"$f":"SUM(J419:J426)","v":0},{"$f":"SUM(K419:K426)","v":0},{"$f":"SUM(L419:L426)","v":0},null,{"$f":"SUM(N419:N426)","v":0}]
[]
[]
[null,null,{"$f":"C$12","v":"2012 Actual²"},"2013 Actual²","2014 Actual²","2015 Actual²","2016 Actual²","2017 Actual²","2018 Actual²","2019 Actual","Bridge Year","Test Year",null,{"$f":"N$12","v":"CGAAP"}]
[null,null,{"$f":"C$13","v":2012},2013,2014,2015,2016,2017,2018,2019,2020,2021,null,{"$f":"N$13","v":"Enter Transition Year"}]
["Reporting Basis",null,{"$f":"IF(C370=0, \"\", C370)","v":""},"","","","","","","","","",null,{"$f":"IF(N$14=0, \"\", N$14)","v":"CGAAP"}]
[]
[]
[]
[]
[]
[]
[]
[]
["Total",null,{"$f":"SUM(C433:C440)","v":0},{"$f":"SUM(D433:D440)","v":0},{"$f":"SUM(E433:E440)","v":0},{"$f":"SUM(F433:F440)","v":0},{"$f":"SUM(G433:G440)","v":0},{"$f":"SUM(H433:H440)","v":0},{"$f":"SUM(I433:I440)","v":0},{"$f":"SUM(J433:J440)","v":0},{"$f":"SUM(K433:K440)","v":0},{"$f":"SUM(L433:L440)","v":0},null,{"$f":"SUM(N433:N440)","v":0}]
[]
[]
[null,null,{"$f":"C$12","v":"2012 Actual²"},"2013 Actual²","2014 Actual²","2015 Actual²","2016 Actual²","2017 Actual²","2018 Actual²","2019 Actual","Bridge Year","Test Year",null,{"$f":"N$12","v":"CGAAP"}]
[null,null,{"$f":"C$13","v":2012},2013,2014,2015,2016,2017,2018,2019,2020,2021,null,{"$f":"N$13","v":"Enter Transition Year"}]
["Reporting Basis",null,{"$f":"IF(C384=0, \"\", C384)","v":""},"","","","","","","","","",null,{"$f":"IF(N$14=0, \"\", N$14)","v":"CGAAP"}]
[]
[]
[]
[]
[]
[]
[]
[]
["Total",null,{"$f":"SUM(C447:C454)","v":0},{"$f":"SUM(D447:D454)","v":0},{"$f":"SUM(E447:E454)","v":0},{"$f":"SUM(F447:F454)","v":0},{"$f":"SUM(G447:G454)","v":0},{"$f":"SUM(H447:H454)","v":0},{"$f":"SUM(I447:I454)","v":0},{"$f":"SUM(J447:J454)","v":0},{"$f":"SUM(K447:K454)","v":0},{"$f":"SUM(L447:L454)","v":0},null,{"$f":"SUM(N447:N454)","v":0}]
[]
[]
[null,null,{"$f":"C$12","v":"2012 Actual²"},"2013 Actual²","2014 Actual²","2015 Actual²","2016 Actual²","2017 Actual²","2018 Actual²","2019 Actual","Bridge Year","Test Year",null,{"$f":"N$12","v":"CGAAP"}]
[null,null,{"$f":"C$13","v":2012},2013,2014,2015,2016,2017,2018,2019,2020,2021,null,{"$f":"N$13","v":"Enter Transition Year"}]
["Reporting Basis",null,{"$f":"IF(C398=0, \"\", C398)","v":""},"","","","","","","","","",null,{"$f":"IF(N$14=0, \"\", N$14)","v":"CGAAP"}]
[]
[]
[]
[]
[]
[]
[]
[]
["Total",null,{"$f":"SUM(C461:C468)","v":0},{"$f":"SUM(D461:D468)","v":0},{"$f":"SUM(E461:E468)","v":0},{"$f":"SUM(F461:F468)","v":0},{"$f":"SUM(G461:G468)","v":0},{"$f":"SUM(H461:H468)","v":0},{"$f":"SUM(I461:I468)","v":0},{"$f":"SUM(J461:J468)","v":0},{"$f":"SUM(K461:K468)","v":0},{"$f":"SUM(L461:L468)","v":0},null,{"$f":"SUM(N461:N468)","v":0}]
[]
[]
[null,null,{"$f":"C$12","v":"2012 Actual²"},"2013 Actual²","2014 Actual²","2015 Actual²","2016 Actual²","2017 Actual²","2018 Actual²","2019 Actual","Bridge Year","Test Year",null,{"$f":"N$12","v":"CGAAP"}]
[null,null,{"$f":"C$13","v":2012},2013,2014,2015,2016,2017,2018,2019,2020,2021,null,{"$f":"N$13","v":"Enter Transition Year"}]
["Reporting Basis",null,{"$f":"IF(C412=0, \"\", C412)","v":""},"","","","","","","","","",null,{"$f":"IF(N$14=0, \"\", N$14)","v":"CGAAP"}]
[]
[]
[]
[]
[]
[]
[]
[]
["Total",null,{"$f":"SUM(C475:C482)","v":0},{"$f":"SUM(D475:D482)","v":0},{"$f":"SUM(E475:E482)","v":0},{"$f":"SUM(F475:F482)","v":0},{"$f":"SUM(G475:G482)","v":0},{"$f":"SUM(H475:H482)","v":0},{"$f":"SUM(I475:I482)","v":0},{"$f":"SUM(J475:J482)","v":0},{"$f":"SUM(K475:K482)","v":0},{"$f":"SUM(L475:L482)","v":0},null,{"$f":"SUM(N475:N482)","v":0}]
[]
[]
[null,null,{"$f":"C$12","v":"2012 Actual²"},"2013 Actual²","2014 Actual²","2015 Actual²","2016 Actual²","2017 Actual²","2018 Actual²","2019 Actual","Bridge Year","Test Year",null,{"$f":"N$12","v":"CGAAP"}]
[null,null,{"$f":"C$13","v":2012},2013,2014,2015,2016,2017,2018,2019,2020,2021,null,{"$f":"N$13","v":"Enter Transition Year"}]
["Reporting Basis",null,{"$f":"IF(C426=0, \"\", C426)","v":""},"","","","","","","","","",null,{"$f":"IF(N$14=0, \"\", N$14)","v":"CGAAP"}]
[]
[]
[]
[]
[]
[]
[]
[]
["Total",null,{"$f":"SUM(C489:C496)","v":0},{"$f":"SUM(D489:D496)","v":0},{"$f":"SUM(E489:E496)","v":0},{"$f":"SUM(F489:F496)","v":0},{"$f":"SUM(G489:G496)","v":0},{"$f":"SUM(H489:H496)","v":0},{"$f":"SUM(I489:I496)","v":0},{"$f":"SUM(J489:J496)","v":0},{"$f":"SUM(K489:K496)","v":0},{"$f":"SUM(L489:L496)","v":0},null,{"$f":"SUM(N489:N496)","v":0}]
[]
[]
[null,null,{"$f":"C$12","v":"2012 Actual²"},"2013 Actual²","2014 Actual²","2015 Actual²","2016 Actual²","2017 Actual²","2018 Actual²","2019 Actual","Bridge Year","Test Year",null,{"$f":"N$12","v":"CGAAP"}]
[null,null,{"$f":"C$13","v":2012},2013,2014,2015,2016,2017,2018,2019,2020,2021,null,{"$f":"N$13","v":"Enter Transition Year"}]
["Reporting Basis",null,{"$f":"IF(C440=0, \"\", C440)","v":""},"","","","","","","","","",null,{"$f":"IF(N$14=0, \"\", N$14)","v":"CGAAP"}]
[]
[]
[]
[]
[]
[]
[]
[]
["Total",null,{"$f":"SUM(C503:C510)","v":0},{"$f":"SUM(D503:D510)","v":0},{"$f":"SUM(E503:E510)","v":0},{"$f":"SUM(F503:F510)","v":0},{"$f":"SUM(G503:G510)","v":0},{"$f":"SUM(H503:H510)","v":0},{"$f":"SUM(I503:I510)","v":0},{"$f":"SUM(J503:J510)","v":0},{"$f":"SUM(K503:K510)","v":0},{"$f":"SUM(L503:L510)","v":0},null,{"$f":"SUM(N503:N510)","v":0}]
[]
[]
[null,null,{"$f":"C$12","v":"2012 Actual²"},"2013 Actual²","2014 Actual²","2015 Actual²","2016 Actual²","2017 Actual²","2018 Actual²","2019 Actual","Bridge Year","Test Year",null,{"$f":"N$12","v":"CGAAP"}]
[null,null,{"$f":"C$13","v":2012},2013,2014,2015,2016,2017,2018,2019,2020,2021,null,{"$f":"N$13","v":"Enter Transition Year"}]
["Reporting Basis",null,{"$f":"IF(C454=0, \"\", C454)","v":""},"","","","","","","","","",null,{"$f":"IF(N$14=0, \"\", N$14)","v":"CGAAP"}]
[]
[]
[]
[]
[]
[]
[]
[]
["Total",null,{"$f":"SUM(C517:C524)","v":0},{"$f":"SUM(D517:D524)","v":0},{"$f":"SUM(E517:E524)","v":0},{"$f":"SUM(F517:F524)","v":0},{"$f":"SUM(G517:G524)","v":0},{"$f":"SUM(H517:H524)","v":0},{"$f":"SUM(I517:I524)","v":0},{"$f":"SUM(J517:J524)","v":0},{"$f":"SUM(K517:K524)","v":0},{"$f":"SUM(L517:L524)","v":0},null,{"$f":"SUM(N517:N524)","v":0}]
[]
[]
[null,null,{"$f":"C$12","v":"2012 Actual²"},"2013 Actual²","2014 Actual²","2015 Actual²","2016 Actual²","2017 Actual²","2018 Actual²","2019 Actual","Bridge Year","Test Year",null,{"$f":"N$12","v":"CGAAP"}]
[null,null,{"$f":"C$13","v":2012},2013,2014,2015,2016,2017,2018,2019,2020,2021,null,{"$f":"N$13","v":"Enter Transition Year"}]
["Reporting Basis",null,{"$f":"IF(C468=0, \"\", C468)","v":""},"","","","","","","","","",null,{"$f":"IF(N$14=0, \"\", N$14)","v":"CGAAP"}]
[]
[]
[]
[]
[]
[]
[]
[]
["Total",null,{"$f":"SUM(C531:C538)","v":0},{"$f":"SUM(D531:D538)","v":0},{"$f":"SUM(E531:E538)","v":0},{"$f":"SUM(F531:F538)","v":0},{"$f":"SUM(G531:G538)","v":0},{"$f":"SUM(H531:H538)","v":0},{"$f":"SUM(I531:I538)","v":0},{"$f":"SUM(J531:J538)","v":0},{"$f":"SUM(K531:K538)","v":0},{"$f":"SUM(L531:L538)","v":0},null,{"$f":"SUM(N531:N538)","v":0}]
[]
[]
[null,null,{"$f":"C$12","v":"2012 Actual²"},"2013 Actual²","2014 Actual²","2015 Actual²","2016 Actual²","2017 Actual²","2018 Actual²","2019 Actual","Bridge Year","Test Year",null,{"$f":"N$12","v":"CGAAP"}]
[null,null,{"$f":"C$13","v":2012},2013,2014,2015,2016,2017,2018,2019,2020,2021,null,{"$f":"N$13","v":"Enter Transition Year"}]
["Reporting Basis",null,{"$f":"IF(C482=0, \"\", C482)","v":""},"","","","","","","","","",null,{"$f":"IF(N$14=0, \"\", N$14)","v":"CGAAP"}]
[]
[]
[]
[]
[]
[]
[]
[]
["Total",null,{"$f":"SUM(C545:C552)","v":0},{"$f":"SUM(D545:D552)","v":0},{"$f":"SUM(E545:E552)","v":0},{"$f":"SUM(F545:F552)","v":0},{"$f":"SUM(G545:G552)","v":0},{"$f":"SUM(H545:H552)","v":0},{"$f":"SUM(I545:I552)","v":0},{"$f":"SUM(J545:J552)","v":0},{"$f":"SUM(K545:K552)","v":0},{"$f":"SUM(L545:L552)","v":0},null,{"$f":"SUM(N545:N552)","v":0}]
[]
[]
[null,null,{"$f":"C$12","v":"2012 Actual²"},"2013 Actual²","2014 Actual²","2015 Actual²","2016 Actual²","2017 Actual²","2018 Actual²","2019 Actual","Bridge Year","Test Year",null,{"$f":"N$12","v":"CGAAP"}]
[null,null,{"$f":"C$13","v":2012},2013,2014,2015,2016,2017,2018,2019,2020,2021,null,{"$f":"N$13","v":"Enter Transition Year"}]
["Reporting Basis",null,{"$f":"IF(C496=0, \"\", C496)","v":""},"","","","","","","","","",null,{"$f":"IF(N$14=0, \"\", N$14)","v":"CGAAP"}]
[]
[]
[]
[]
[]
[]
[]
[]
["Total",null,{"$f":"SUM(C559:C566)","v":0},{"$f":"SUM(D559:D566)","v":0},{"$f":"SUM(E559:E566)","v":0},{"$f":"SUM(F559:F566)","v":0},{"$f":"SUM(G559:G566)","v":0},{"$f":"SUM(H559:H566)","v":0},{"$f":"SUM(I559:I566)","v":0},{"$f":"SUM(J559:J566)","v":0},{"$f":"SUM(K559:K566)","v":0},{"$f":"SUM(L559:L566)","v":0},null,{"$f":"SUM(N559:N566)","v":0}]

{"sheet":"Hidden_Other Revenue","index":25,"n_rows":41,"n_cols":8,"rows_kept":41,"cut":false,"hidden":true,"merged":[]}
["Utility Name","EB Number","Test Year","Bridge Year","Last Rebasing Year","Heading ","Year","Amount "]
[{"$f":"'LDC Info'!$E$14","v":0},{"$f":"EBNUMBER","v":0},{"$f":"TestYear","v":2021},{"$f":"BridgeYear","v":2020},{"$f":"RebaseYear","v":2014},"Specific Service Charges",{"$f":"'App.2-H_Other_Oper_Rev'!C13","v":2012},{"$f":"'App.2-H_Other_Oper_Rev'!C53","v":0}]
[{"$f":"'LDC Info'!$E$14","v":0},0,2021,2020,2014,"Late Payment Charges",{"$f":"'App.2-H_Other_Oper_Rev'!C13","v":2012},{"$f":"'App.2-H_Other_Oper_Rev'!C54","v":0}]
[{"$f":"'LDC Info'!$E$14","v":0},0,2021,2020,2014,"Other Operating Revenues",{"$f":"'App.2-H_Other_Oper_Rev'!C13","v":2012},{"$f":"'App.2-H_Other_Oper_Rev'!C55","v":0}]
[{"$f":"'LDC Info'!$E$14","v":0},0,2021,2020,2014,"Other Income or Deductions",{"$f":"'App.2-H_Other_Oper_Rev'!C13","v":2012},{"$f":"'App.2-H_Other_Oper_Rev'!C56","v":0}]
[{"$f":"'LDC Info'!$E$14","v":0},0,2021,2020,2014,"Specific Service Charges",{"$f":"'App.2-H_Other_Oper_Rev'!D13","v":2013},{"$f":"'App.2-H_Other_Oper_Rev'!D53","v":0}]
[{"$f":"'LDC Info'!$E$14","v":0},0,2021,2020,2014,"Late Payment Charges",{"$f":"'App.2-H_Other_Oper_Rev'!D13","v":2013},{"$f":"'App.2-H_Other_Oper_Rev'!D54","v":0}]
[{"$f":"'LDC Info'!$E$14","v":0},0,2021,2020,2014,"Other Operating Revenues",{"$f":"'App.2-H_Other_Oper_Rev'!D13","v":2013},{"$f":"'App.2-H_Other_Oper_Rev'!D55","v":0}]
[{"$f":"'LDC Info'!$E$14","v":0},0,2021,2020,2014,"Other Income or Deductions",{"$f":"'App.2-H_Other_Oper_Rev'!D13","v":2013},{"$f":"'App.2-H_Other_Oper_Rev'!D56","v":0}]
[{"$f":"'LDC Info'!$E$14","v":0},0,2021,2020,2014,"Specific Service Charges",{"$f":"'App.2-H_Other_Oper_Rev'!E13","v":2014},{"$f":"'App.2-H_Other_Oper_Rev'!E53","v":0}]
[{"$f":"'LDC Info'!$E$14","v":0},0,2021,2020,2014,"Late Payment Charges",{"$f":"'App.2-H_Other_Oper_Rev'!E13","v":2014},{"$f":"'App.2-H_Other_Oper_Rev'!E54","v":0}]
[{"$f":"'LDC Info'!$E$14","v":0},0,2021,2020,2014,"Other Operating Revenues",{"$f":"'App.2-H_Other_Oper_Rev'!E13","v":2014},{"$f":"'App.2-H_Other_Oper_Rev'!E55","v":0}]
[{"$f":"'LDC Info'!$E$14","v":0},0,2021,2020,2014,"Other Income or Deductions",{"$f":"'App.2-H_Other_Oper_Rev'!E13","v":2014},{"$f":"'App.2-H_Other_Oper_Rev'!E56","v":0}]
[{"$f":"'LDC Info'!$E$14","v":0},0,2021,2020,2014,"Specific Service Charges",{"$f":"'App.2-H_Other_Oper_Rev'!F13","v":2015},{"$f":"'App.2-H_Other_Oper_Rev'!F53","v":0}]
[{"$f":"'LDC Info'!$E$14","v":0},0,2021,2020,2014,"Late Payment Charges",{"$f":"'App.2-H_Other_Oper_Rev'!F13","v":2015},{"$f":"'App.2-H_Other_Oper_Rev'!F54","v":0}]
[{"$f":"'LDC Info'!$E$14","v":0},0,2021,2020,2014,"Other Operating Revenues",{"$f":"'App.2-H_Other_Oper_Rev'!F13","v":2015},{"$f":"'App.2-H_Other_Oper_Rev'!F55","v":0}]
[{"$f":"'LDC Info'!$E$14","v":0},0,2021,2020,2014,"Other Income or Deductions",{"$f":"'App.2-H_Other_Oper_Rev'!F13","v":2015},{"$f":"'App.2-H_Other_Oper_Rev'!F56","v":0}]
[{"$f":"'LDC Info'!$E$14","v":0},0,2021,2020,2014,"Specific Service Charges",{"$f":"'App.2-H_Other_Oper_Rev'!G13","v":2016},{"$f":"'App.2-H_Other_Oper_Rev'!G53","v":0}]
[{"$f":"'LDC Info'!$E$14","v":0},0,2021,2020,2014,"Late Payment Charges",{"$f":"'App.2-H_Other_Oper_Rev'!G13","v":2016},{"$f":"'App.2-H_Other_Oper_Rev'!G54","v":0}]
[{"$f":"'LDC Info'!$E$14","v":0},0,2021,2020,2014,"Other Operating Revenues",{"$f":"'App.2-H_Other_Oper_Rev'!G13","v":2016},{"$f":"'App.2-H_Other_Oper_Rev'!G55","v":0}]
[{"$f":"'LDC Info'!$E$14","v":0},0,2021,2020,2014,"Other Income or Deductions",{"$f":"'App.2-H_Other_Oper_Rev'!G13","v":2016},{"$f":"'App.2-H_Other_Oper_Rev'!G56","v":0}]
[{"$f":"'LDC Info'!$E$14","v":0},0,2021,2020,2014,"Specific Service Charges",{"$f":"'App.2-H_Other_Oper_Rev'!H13","v":2017},{"$f":"'App.2-H_Other_Oper_Rev'!H53","v":0}]
[{"$f":"'LDC Info'!$E$14","v":0},0,2021,2020,2014,"Late Payment Charges",{"$f":"'App.2-H_Other_Oper_Rev'!H13","v":2017},{"$f":"'App.2-H_Other_Oper_Rev'!H54","v":0}]
[{"$f":"'LDC Info'!$E$14","v":0},0,2021,2020,2014,"Other Operating Revenues",{"$f":"'App.2-H_Other_Oper_Rev'!H13","v":2017},{"$f":"'App.2-H_Other_Oper_Rev'!H55","v":0}]
[{"$f":"'LDC Info'!$E$14","v":0},0,2021,2020,2014,"Other Income or Deductions",{"$f":"'App.2-H_Other_Oper_Rev'!H13","v":2017},{"$f":"'App.2-H_Other_Oper_Rev'!H56","v":0}]
[{"$f":"'LDC Info'!$E$14","v":0},0,2021,2020,2014,"Specific Service Charges",{"$f":"'App.2-H_Other_Oper_Rev'!I13","v":2018},{"$f":"'App.2-H_Other_Oper_Rev'!I53","v":0}]
[{"$f":"'LDC Info'!$E$14","v":0},0,2021,2020,2014,"Late Payment Charges",{"$f":"'App.2-H_Other_Oper_Rev'!I13","v":2018},{"$f":"'App.2-H_Other_Oper_Rev'!I54","v":0}]
[{"$f":"'LDC Info'!$E$14","v":0},0,2021,2020,2014,"Other Operating Revenues",{"$f":"'App.2-H_Other_Oper_Rev'!I13","v":2018},{"$f":"'App.2-H_Other_Oper_Rev'!I55","v":0}]
[{"$f":"'LDC Info'!$E$14","v":0},0,2021,2020,2014,"Other Income or Deductions",{"$f":"'App.2-H_Other_Oper_Rev'!I13","v":2018},{"$f":"'App.2-H_Other_Oper_Rev'!I56","v":0}]
[{"$f":"'LDC Info'!$E$14","v":0},0,2021,2020,2014,"Specific Service Charges",{"$f":"'App.2-H_Other_Oper_Rev'!J13","v":2019},{"$f":"'App.2-H_Other_Oper_Rev'!J53","v":0}]
[{"$f":"'LDC Info'!$E$14","v":0},0,2021,2020,2014,"Late Payment Charges",{"$f":"'App.2-H_Other_Oper_Rev'!J13","v":2019},{"$f":"'App.2-H_Other_Oper_Rev'!J54","v":0}]
[{"$f":"'LDC Info'!$E$14","v":0},0,2021,2020,2014,"Other Operating Revenues",{"$f":"'App.2-H_Other_Oper_Rev'!J13","v":2019},{"$f":"'App.2-H_Other_Oper_Rev'!J55","v":0}]
[{"$f":"'LDC Info'!$E$14","v":0},0,2021,2020,2014,"Other Income or Deductions",{"$f":"'App.2-H_Other_Oper_Rev'!J13","v":2019},{"$f":"'App.2-H_Other_Oper_Rev'!J56","v":0}]
[{"$f":"'LDC Info'!$E$14","v":0},0,2021,2020,2014,"Specific Service Charges",{"$f":"'App.2-H_Other_Oper_Rev'!K13","v":2020},{"$f":"'App.2-H_Other_Oper_Rev'!K53","v":0}]
[{"$f":"'LDC Info'!$E$14","v":0},0,2021,2020,2014,"Late Payment Charges",{"$f":"'App.2-H_Other_Oper_Rev'!K13","v":2020},{"$f":"'App.2-H_Other_Oper_Rev'!K54","v":0}]
[{"$f":"'LDC Info'!$E$14","v":0},0,2021,2020,2014,"Other Operating Revenues",{"$f":"'App.2-H_Other_Oper_Rev'!K13","v":2020},{"$f":"'App.2-H_Other_Oper_Rev'!K55","v":0}]
[{"$f":"'LDC Info'!$E$14","v":0},0,2021,2020,2014,"Other Income or Deductions",{"$f":"'App.2-H_Other_Oper_Rev'!K13","v":2020},{"$f":"'App.2-H_Other_Oper_Rev'!K56","v":0}]
[{"$f":"'LDC Info'!$E$14","v":0},0,2021,2020,2014,"Specific Service Charges",{"$f":"'App.2-H_Other_Oper_Rev'!L13","v":2021},{"$f":"'App.2-H_Other_Oper_Rev'!L53","v":0}]
[{"$f":"'LDC Info'!$E$14","v":0},0,2021,2020,2014,"Late Payment Charges",{"$f":"'App.2-H_Other_Oper_Rev'!L13","v":2021},{"$f":"'App.2-H_Other_Oper_Rev'!L54","v":0}]
[{"$f":"'LDC Info'!$E$14","v":0},0,2021,2020,2014,"Other Operating Revenues",{"$f":"'App.2-H_Other_Oper_Rev'!L13","v":2021},{"$f":"'App.2-H_Other_Oper_Rev'!L55","v":0}]
[{"$f":"'LDC Info'!$E$14","v":0},0,2021,2020,2014,"Other Income or Deductions",{"$f":"'App.2-H_Other_Oper_Rev'!L13","v":2021},{"$f":"'App.2-H_Other_Oper_Rev'!L56","v":0}]

{"sheet":"App_2-I LF_CDM","index":26,"n_rows":106,"n_cols":15,"rows_kept":106,"cut":false,"hidden":false,"merged":[[20,0,20,8],[28,0,28,8],[92,0,92,8],[69,0,69,8],[82,0,82,8],[84,0,84,8],[86,0,86,8],[88,0,88,8],[90,0,90,8],[39,0,39,8],[44,0,44,8],[46,0,46,8],[74,0,74,5],[37,6,38,8],[40,0,40,8],[41,0,41,8],[17,0,17,8],[18,0,18,8],[8,0,8,8],[9,0,9,8],[11,0,11,8],[13,0,13,8],[15,0,15,8],[42,0,42,8],[48,0,48,8],[80,0,80,8],[105,0,105,8],[50,0,50,5],[52,0,52,4],[55,0,55,1],[66,0,66,1],[71,0,72,8]]}
[null,null,null,null,null,null,"File Number:",null,{"$f":"EBNUMBER","v":0}]
[null,null,null,null,null,null,"Exhibit:"]
[null,null,null,null,null,null,"Tab:"]
[null,null,null,null,null,null,"Schedule:"]
[null,null,null,null,null,null,"Page:"]
[]
[null,null,null,null,null,null,"Date:"]
[]
["Appendix 2-I"]
["Load Forecast CDM Adjustment Work Form"]
[]
["Appendix 2-I was initially developed to help determine what would be the amount of CDM savings needed in each year to cumulatively achieve the four year 2011-2014 CDM target.  This determined the amount of kWh (and with translation, kW of demand) savings that were converted into dollar balances for the LRAMVA, and also to determine the related adjustment to the load forecast to account for OPA-reported savings.  Beginning in the 2015 year, it was adjusted because the persistence of 2011-2014 CDM programs will be an adjustment to the load forecast in addition to the estimated savings for the first year (2015) for the new 2015-2020 CDM plan. This appendix has been updated for 2021 rate applications to acknowledge that in accordance with the Minister of Energy's March 20, 2019 Directive to the IESO, the Conservation First Framework (CFF) is no longer in effect. As distributors are no longer working towards the former 2015-2020 CDM targets, for 2019 and 2020 CDM activity, distributors may propose a CDM manual adjustment to the load forecast. If a distributor elects to propose a CDM manual adjustment to the load forecast, only CDM projects that are subject to a contractual agreement entered into between the distributor and a customer by April 30, 2019 under a former CFF program should be included in the proposed CDM manual adjustment to the load forecast. Distributors should provide relevant documentation to support the manual adjustments for 2019 and 2020 CDM projects, including the corresponding CFF program, project timelines and projected savings. "]
[]
["2019-2020 CDM Activities (and beyond, if applicable)"]
[]
["For the first year of the new 2015-2020 CDM plan, for simplicity, it was assumed that each year's program will achieve an equal amount of new CDM savings. This resulted in each year's program being about 1/6 (or 16.67%) of the cumulative 2015-2020 CDM target for kWh savings.\n\nFor 2021 rate applications, distributors should ensure that the sum of the results for the 2015 to 2019 program years is consistent with the results provided by the IESO. For the 2020 and 2021 program year (as applicable), distributors that elect to propose a CDM manual adjustment, should only include the projected CDM savings from projects that are subject to contractual agreements between the distributor and customer made on or before April 30, 2019 under the former CFF. "]
[]
["Former CFF 6 Year (2015-2020) kWh Target*"]
[99039999.400000006]
[null,2015,2016,2017,2018,2019,2020,"2021**","Total"]
["%"]
["2015 CDM Programs",null,null,null,null,null,{"$f":"G30/G37","v":0.16590509489298588},null,{"$f":"I30/I37","v":0.15142991976709361}]
["2016 CDM Programs",null,null,null,null,null,{"$f":"G31/G37","v":0.22488645377362049},null,{"$f":"I31/I37","v":0.20077283637443058}]
["2017 CDM Programs",null,null,null,null,null,{"$f":"G32/$I$37","v":0.30411780945788369},null,{"$f":"I32/I37","v":0.30407863336717789}]
["2018 CDM Programs",null,null,null,null,null,{"$f":"G33/$I$37","v":0.12904532075809408},null,{"$f":"I33/I37","v":0.12904532075809408}]
["2019 CDM Programs",null,null,null,null,null,{"$f":"G34/$I$37","v":8.4417705655207231E-2},null,{"$f":"I34/I37","v":8.399510790742655E-2}]
["2020 CDM Programs",null,null,null,null,null,{"$f":"G35/$I$37","v":2.6484631309380238E-2},null,{"$f":"I35/I37","v":2.6352208152833338E-2}]
["Total in Year",{"$f":"SUM(B22:B27)","v":0},{"$f":"SUM(C22:C27)","v":0},{"$f":"SUM(D22:D27)","v":0},{"$f":"SUM(E22:E25)","v":0},{"$f":"SUM(F22:F26)","v":0},{"$f":"SUM(G22:G27)","v":0.93485701584717162},null,{"$f":"SUM(I22:I27)","v":0.89567402632705606}]
["kWh"]
[{"$f":"A22","v":"2015 CDM Programs"},14805774.656790458,14757073.577201972,14837426.983201444,14857909.389200913,14843590.795200381,14674239.201199852,14997619.162875,{"$f":"H30","v":14997619.162875}]
["2016 CDM Programs",null,19559158.760066066,19558981.513347246,19891471.266628426,19891294.019909605,19891116.773190781,19884541.594059903,19884541.594059903,null,null,2011,2012,2013,2014]
["2017 CDM Programs",null,null,34134385.599078558,30128301.621465076,30124064.643851597,30119827.666238118,30115947.666238118,30115947.666238118,null,"2011 CDM Programs",{"$f":"50%","v":0.5},1,1,1]
["2018 CDM Programs",null,null,null,13243854.699142803,13012251.594798628,12780648.490454445,12780648.490454445,12780648.490454445,null,"2012 CDM Programs",null,0.5,1,1]
["2019 CDM Programs",null,null,null,null,8709155.7126516998,8360729.5174411014,8318875.4367544614,8318875.4367544614,null,"2013 CDM Programs",null,null,0.5,1]
[{"$f":"A27","v":"2020 CDM Programs"},null,null,null,null,null,2623037.8689902402,2609922.6796452892,2609922.6796452892]
["2021 CDM Programs (if applicable)***",null,null,null,null,null,null,null,0,null,"2014 CDM Programs",null,null,null,0.5]
["Total in Year",{"$f":"SUM(B30:B36)","v":14805774.656790458},{"$f":"SUM(C30:C36)","v":34316232.33726804},{"$f":"SUM(D30:D36)","v":68530794.095627248},{"$f":"SUM(E30:E33)","v":78121536.976437211},{"$f":"SUM(F30:F34)","v":86580356.766411901},{"$f":"SUM(G30:G36)","v":88449599.517514557},{"$f":"SUM(H30:H36)","v":88707555.030027226},{"$f":"A19","v":99039999.400000006}]
[null,null,null,null,null,null,{"$f":"IF(G37-I37<>0,\"Inputs do no match 2015-20 CDM target\",\"\")","v":"Inputs do no match 2015-20 CDM target"}]
[]
["*This total will not equal the distributor's former CFF CDM target. Rather, for 2019 and 2020, if the distributor elects to propose a CDM manual adjustment, it should only include the projected savings from projects that are subject to contractual agreements made between the LDC and a customer on or before April 30, 2019 under the former CFF."]
["** If a distributor wishes to include projected savings that persist from former Conservation First programs into the 2021 test year, you may do so.  Please provide relevant supporting documentation to show the savings persistence into 2021.  "]
["*** If a distributor expects impacts from any CFF-related projects not deployed by April 2019, but for which a distributor is contractually obligated to complete (or for other programs delivered by the distributor after April 2019), a distributor may include these amounts as part of a CDM manual adjustment to the 2021 load forecast, but must ensure that sufficient supporting evidence is provided in support of all estimated CDM savings."]
["Note: The default formulae in the above table assume that the 2015-2020 kWh CDM target is achieved through persistence of CDM savings to the end of 2020. Distributors should rely on the Participant and Cost monthly reports provided by the IESO for 2018 and 2019 CDM savings."]
[]
["Determination of 2021 Load Forecast Adjustment"]
[]
["The OEB determined that the \"net\" number should be used in its Decision and Order with respect to Centre Wellington Hydro Ltd.'s 2013 Cost of Service rates (EB-2012-0113).  This approach has also been used in Settlement Agreements accepted by the OEB in other 2013 and 2014 applications.  The distributor should select whether the adjustment is done on a \"net\" or \"gross\" basis, but must support a proposal for the adjustment being done on a \"gross\" basis.  Sheet 2-I defaults to the adjustment being done on a \"net\" basis consistent with OEB policy and practice."]
[]
["From each of the 2006-2010 CDM Final Report,  and the 2011 to 2017 CDM Final Reports, issued by the OPA/IESO for the distributor, the distributor should input the \"gross\" and \"net\" results of the cumulative CDM savings for 2019 into cells C57 to C66 and D57 to D66.  The model will calculate the cumulative savings for all programs from 2006 to 2019 and determine the \"net\" to \"gross\" factor \"g\"."]
[]
["Net-to-Gross Conversion"]
[]
["Is CDM adjustment being done on a \"net\" or \"gross\" basis?",null,null,null,null,"net"]
[]
[null,null,"\"Gross\"","\"Net\"","Difference","\"Net-to-Gross\" Conversion Factor"]
["Persistence of Historical CDM programs",null,"kWh","kWh","kWh","('g')"]
["2006-2010 CDM programs",null,null,null,{"$f":"C57-D57","v":0}]
["2011 CDM program",null,null,null,0]
["2012 CDM program",null,null,null,0]
["2013 CDM program",null,null,null,0]
["2014 CDM program",null,null,null,0]
["2015 CDM program",null,null,null,0]
["2016 CDM program",null,null,null,{"$f":"C63-D63","v":0}]
["2017 CDM program",null,null,null,0]
["2018 CDM program*",null,null,null,{"$f":"C65-D65","v":0}]
["2019 CDM program (if applicable)*",null,null,null,{"$f":"C66-D66","v":0}]
["2006 to 2019 OPA CDM programs:  Persistence to 2021.",null,{"$f":"SUM(C57:C66)","v":0},{"$f":"SUM(D57:D66)","v":0},{"$f":"C67-D67","v":0},{"$f":"IF(D67=0,0,IF(F53=\"net\",0,E67/D67))","v":0}]
["*CDM programs distributors should rely on the results made available by the IESO in the Participant and Cost monthly reports"]
[]
["The default values below represent the factor used for how each year's CDM program is factored into the manual CDM adjustment.  Distributors can choose alternative weights of \"0\", \"0.5\" or \"1\" from the drop-down menu for each cell, but must support its alternatives."]
[]
["These factors do not mean that CDM programs are excluded, but the assumption that impacts of previous year CDM programs are already implicitly reflected in the actual data for historical years that are used to derive the load forecast prior to any manual CDM adjustment for the 2021 test year."]
[]
[]
["Weight Factor for Inclusion in CDM Adjustment to 2021 Load Forecast"]
[null,2015,2016,2017,"2018*","2019**","2020**","2021***"]
["Weight Factor for each year's CDM program impact on 2021 load forecast",0,0,0,0,0.5,1,0.5,"Distributor can select \"0\", \"0.5\", or \"1\" from drop-down list"]
["Default Value selection rationale.  ","Full year impact of 2015 CDM is assumed to be reflected in the base forecast, as the full year persistence of 2015 CDM programs is in the 2018 historical actual data. No further impact is necessary for the manual adjustment to the load forecast.","Full year impact of 2016 CDM is assumed to be reflected in the base forecast, as the full year persistence of 2016 CDM programs is in the 2018 historical actual data. No further impact is necessary for the manual adjustment to the load forecast.","Full year impact of 2017 CDM is assumed to be reflected in the base forecast, as the full year persistence of 2017 CDM programs is in the 2018 historical actual data. No further impact is necessary for the manual adjustment to the load forecast.","Default is 0. Full year impact of 2018 CDM is assumed to be reflected in the base forecast. ","Default is 0. Full year impact of 2019 CDM is assumed to be reflected in the base forecast. Adjust based on distributor's circumstance","Default is 0.5. Adjust based on distributor's circumstance","Default is 1.  Adjust based on distributor's circumstance"]
["* For 2018 CDM programs distributors should rely on the results made available by the IESO in the Participant and Cost monthly reports"]
["** For 2019 and 2020 CDM program activity, the distributor should include only those projected CDM savings from projects that it has contractual obligations with a customer under the former CFF. "]
["*** This may include the persistence of any remaining CDM projects that the distributor is contractually obligated to complete under the former CFF, as applicable. If this includes CDM activity that is beyond the CFF framework or other programs, please file project-level supporting documentation in accordance with section 2.3.1.3 of Chapter 2 Filing Requirements to support the breakdown of your proposal."]
[]
["2021 LRAMVA and 2021 CDM adjustment to Load Forecast"]
[]
["One manual adjustment for CDM impacts to the 2021 load forecast is made.  There is a different but related threshold amount that is used for the 2021 LRAMVA amount for Account 1568."]
[]
["The amount used for the CDM threshold and the LRAMVA is the kWh that will be used to determine the base amount for the LRAMVA balance for 2021. This allows for a comparison between projected CDM savings and actual CDM savings."]
[]
["If used to determine the manual CDM adjustment for the system purchased kWh, the proposed loss factor should correspond with the proposed total loss factor calculated in Appendix 2-R ."]
[]
["The Manual Adjustment for the 2021 Load Forecast is the amount manually subtracted from the system-wide load forecast (either based on a purchased or billed basis) derived from the base forecast from historical data. If the distributor has developed their load forecast on a system purchased basis, then the manual adjustment should be on a system purchased basis, including the adjustment for losses.  If the load forecast has been developed on a billed basis, either on a system basis or on a class-specific basis, the manual adjustment should be on a billed basis, excluding losses."]
[]
["The distributor should determine the allocation of the savings to all customer classes in a reasonable manner (e.g. taking into account what programs and what IESO-measured impacts were directed at specific customer classes), for both the LRAMVA and for the load forecast adjustment."]
[]
[null,2015,2016,2017,2018,2019,2020,2021,"Total for 2021"]
[]
["Amount used for CDM threshold for LRAMVA (2021)",{"$f":"H30","v":14997619.162875},{"$f":"H31","v":19884541.594059903},{"$f":"H32","v":30115947.666238118},{"$f":"H33","v":12780648.490454445},{"$f":"H34","v":8318875.4367544614},{"$f":"H35","v":2609922.6796452892},{"$f":"H36","v":0},{"$f":"SUM(B97:H97)","v":88707555.030027226}]
[]
["Manual Adjustment for 2021 Load Forecast (billed basis)",null,null,null,null,{"$f":"F97*(1+F67)*F77","v":4159437.7183772307},{"$f":"G97*(1+F67)*G77","v":2609922.6796452892},{"$f":"H97*(1+F67)*H77","v":0},{"$f":"SUM(F99:H99)","v":6769360.3980225194}]
["Manual Adjustment for 2021 LDC-only CDM programs (billed basis)"]
["Total Manual Forecast to Load Forecast",null,null,null,null,{"$f":"F99","v":4159437.7183772307},{"$f":"G99","v":2609922.6796452892},{"$f":"H99+H100","v":0},{"$f":"SUM(F101:H101)","v":6769360.3980225194}]
[]
["Proposed Loss Factor (TLF)",null," Format: X.XX%"]
["Manual Adjustment for 2021 Load Forecast (system purchased basis)",{"$f":"B101*(1+$B103)","v":0},0,0,0,4159437.7183772307,2609922.6796452892,0,{"$f":"SUM(B104:H104)","v":6769360.3980225194}]
[]
["Manual adjustment uses \"gross\" versus \"net\" (i.e. numbers multiplied by (1 + g).  The Weight factor is also used to calculate the impact of each year's program on the CDM adjustment to the 2021 load forecast."]

{"sheet":"lists","index":27,"n_rows":50,"n_cols":1,"rows_kept":50,"cut":false,"hidden":true,"merged":[]}
["COMPETITIVE SECTOR MULTI-UNIT RESIDENTIAL SERVICE CLASSIFICATION"]
["DISTRIBUTED GENERATION [DGEN] SERVICE CLASSIFICATION"]
["DISTRIBUTED GENERATION SERVICE CLASSIFICATION"]
["EMBEDDED DISTRIBUTOR SERVICE CLASSIFICATION"]
["EMBEDDED DISTRIBUTOR SERVICE CLASSIFICATION FOR HYDRO ONE NETWORKS INC."]
["ENERGY FROM WASTE SERVICE CLASSIFICATION"]
["GENERAL SERVICE 1,000 KW AND GREATER SERVICE CLASSIFICATION"]
["GENERAL SERVICE 1,000 KW OR GREATER SERVICE CLASSIFICATION"]
["GENERAL SERVICE 1,000 TO 4,999 KW (CO-GENERATION) SERVICE CLASSIFICATION"]
["GENERAL SERVICE 1,000 TO 4,999 KW SERVICE CLASSIFICATION"]
["GENERAL SERVICE 1,500 TO 4,999 KW SERVICE CLASSIFICATION"]
["GENERAL SERVICE 3,000 TO 4,999 KW - INTERMEDIATE USE SERVICE CLASSIFICATION"]
["GENERAL SERVICE 3,000 TO 4,999 KW SERVICE CLASSIFICATION"]
["GENERAL SERVICE 50 TO 1,499 KW SERVICE CLASSIFICATION"]
["GENERAL SERVICE 50 TO 2,999 KW SERVICE CLASSIFICATION"]
["GENERAL SERVICE 50 to 4,999 kW SERVICE CLASSIFICATION"]
["GENERAL SERVICE 50 TO 499 KW SERVICE CLASSIFICATION"]
["GENERAL SERVICE 50 TO 699 KW SERVICE CLASSIFICATION"]
["GENERAL SERVICE 50 TO 999 KW SERVICE CLASSIFICATION"]
["GENERAL SERVICE 500 TO 1,499 KW SERVICE CLASSIFICATION"]
["GENERAL SERVICE 500 TO 4,999 KW SERVICE CLASSIFICATION"]
["GENERAL SERVICE 700 TO 4,999 KW SERVICE CLASSIFICATION"]
["GENERAL SERVICE DEMAND BILLED SERVICE CLASSIFICATION"]
["GENERAL SERVICE ENERGY BILLED SERVICE CLASSIFICATION"]
["GENERAL SERVICE EQUAL TO OR GREATER THAN 1,500 KW SERVICE CLASSIFICATION"]
["GENERAL SERVICE GREATER THAN 1,000 KW SERVICE CLASSIFICATION"]
["GENERAL SERVICE LESS THAN 50 KW SERVICE CLASSIFICATION"]
["HCI, RESOP, OTHER ENERGY RESOURCE SERVICE CLASSIFICATION"]
["INTERMEDIATE USER SERVICE CLASSIFICATION"]
["LARGE USE - 3TS SERVICE CLASSIFICATION"]
["LARGE USE - FORD ANNEX SERVICE CLASSIFICATION"]
["LARGE USE - REGULAR SERVICE CLASSIFICATION"]
["LARGE USE SERVICE CLASSIFICATION"]
["LARGE USE WITH DEDICATED ASSETS SERVICE CLASSIFICATION"]
["ONTARIO ELECTRICITY SUPPORT PROGRAM RECIPIENTS"]
["R1  RESIDENTIAL SERVICE CLASSIFICATION"]
["R2  RESIDENTIAL SERVICE CLASSIFICATION"]
["RESIDENTIAL R1 SERVICE CLASSIFICATION"]
["RESIDENTIAL R2 SERVICE CLASSIFICATION"]
["RESIDENTIAL SERVICE CLASSIFICATION"]
["SEASONAL CUSTOMERS SERVICE CLASSIFICATION"]
["SEASONAL RESIDENTIAL SERVICE CLASSIFICATION"]
["SEASONAL SERVICE CLASSIFICATION"]
["SENTINEL LIGHTING SERVICE CLASSIFICATION"]
["STANDBY POWER SERVICE CLASSIFICATION "]
["SUB TRANSMISSION SERVICE CLASSIFICATION"]
["UNMETERED SCATTERED LOAD SERVICE CLASSIFICATION"]
["UR RESIDENTIAL SERVICE CLASSIFICATION"]
["URBAN GENERAL SERVICE DEMAND BILLED SERVICE CLASSIFICATION"]
["URBAN GENERAL SERVICE ENERGY BILLED SERVICE CLASSIFICATION"]

{"sheet":"App.2-IA_Load_Forecast_Instrct","index":28,"n_rows":45,"n_cols":18,"rows_kept":45,"cut":false,"hidden":false,"merged":[[24,1,24,17],[26,1,26,17],[43,2,43,17],[44,2,44,17],[28,8,28,10],[28,12,28,14],[29,13,29,14],[29,9,29,10],[41,2,41,17],[42,2,42,17],[28,16,28,17],[9,1,9,17],[8,1,8,17],[18,1,18,17],[20,1,20,17],[22,1,22,17]]}
[null,null,null,null,null,null,null,null,null,null,null,null,null,null,null,null,"File Number:",{"$f":"EBNUMBER","v":0}]
[null,null,null,null,null,null,null,null,null,null,null,null,null,null,null,null,"Exhibit:"]
[null,null,null,null,null,null,null,null,null,null,null,null,null,null,null,null,"Tab:"]
[null,null,null,null,null,null,null,null,null,null,null,null,null,null,null,null,"Schedule:"]
[null,null,null,null,null,null,null,null,null,null,null,null,null,null,null,null,"Page:"]
[]
[null,null,null,null,null,null,null,null,null,null,null,null,null,null,null,null,"Date:"]
[]
[null,"Appendix 2-IA"]
[null,"Instructions on Customer, Connections, Load Forecast and Revenues Data and Analysis"]
[]
[null,"This sheet requires no inputs, but serves as a summary of the hiostorical and forecasted data to be provided with respect to:"]
[]
[null,"1)","Customers and connections"]
[null,"2)","Consumption (kWh)"]
[null,"3)","Demand (kW or kCA) for applicable demand-billed customer classes"]
[null,"4)","Revenues"]
[]
[null,"The spreadsheet summarizes the data provided and the analyses (variance or year-over-year) that are required. Data are required to be provided on a customer class level. Consumption (kWh) must also be provided on a total distribution system level."]
[]
[null,"Appendix 2-IB (formerly 2-IA) is the appendix spreadsheet that the distributor populates, and the spreadsheet is laid out for inputting the necessary data. The spreadsheet also calculates necessary statistics such as average consumption per customer/connection per year, and variances and % annual changes, as necessary."]
[]
[null,"The distributor is required to provide suitable documentation in Exhibit 3 of its Application, in accordance with section 2.3.2 of Chaoter 2 of the Filing Requirements. This would include explanations for material variations or of trends in the data."]
[]
[null,"The distributor is also required to input its test year customer/connection and load forecast in Sheet 10 - Load Forecast of the Revenue Requirement Work Form. This sheet should also be updated to reflect changes in the load forecast made through the stages of processing of the rates application."]
[]
[null,"The applicant must demonstrate the historical accuracy of its load forecast approach for at least the past 5 years. Such analysis will cover both customer/connections and consumption (kWh) and demand (kW or kVA) by providing the following, as shown in the following table:"]
[]
[null,null,null,"Calendar Year",null,"Customers / Connections",null,null,"Consumption (kWh) (3)",null,null,null,"Demand (kW or kVA)",null,null,null,"Revenues"]
[null,null,null,{"$f":"\"(for \"&TestYear&\" Cost of Service)\"","v":"(for 2021 Cost of Service)"},null,null,null,null,"Weather-actual","Weather-normalized",null,null,"Weather-actual","Weather-normalized",null,null,"Weather-actual","Weather-normalized"]
[null,null,"Historical",{"$f":"D32-1","v":2015},null,"Actual",null,null,"Actual","Actual (1)",null,null,"Actual","Actual (1)",null,null,"Actual"]
[null,null,"Historical",2016,null,"Actual",null,null,"Actual","Actual (1)",null,null,"Actual","Actual (1)",null,null,"Actual"]
[null,null,"Historical",2017,null,"Actual","OEB-approved (2)",null,"Actual","Actual (1)","OEB-approved (2)",null,"Actual","Actual (1)","OEB-approved (2)",null,"Actual"]
[null,null,"Historical",2018,null,"Actual",null,null,"Actual","Actual (1)",null,null,"Actual","Actual (1)",null,null,"Actual"]
[null,null,"Historical",2019,null,"Actual",null,null,"Actual","Actual (1)",null,null,"Actual","Actual (1)",null,null,"Actual"]
[null,null,"Bridge Year (Forecast)",2020,null,"Forecast",null,null,null,"Forecast",null,null,null,"Forecast",null,null,null,"Forecast"]
[null,null,"Test Year (Forecast)",{"$f":"TestYear","v":2021},null,"Forecast",null,null,null,"Forecast",null,null,null,"Forecast",null,null,null,"Forecast"]
[]
[]
[null,"Notes:"]
[]
[null,"(1)","“Weather-normalized actuals” are estimated by replacing the actual weather-related values (typically Heating Degree Days (HDD) and Cooling Degree Days (CDD)) by the “typical” or “weather-normalized” values. These “weather-normalized HDD and CDD values would be the same as used to estimate the Bridge Year and Test Year forecasts."]
[null,"(2)",{"$f":"\"For \"&TestYear&\" Cost of Service rebasers, the typical situation is that \"& TestYear - 4 & \" would have been the most recent cost of service rebasing application. If the most recent rebasing application was for a rate year other than \"& TestYear - 4& \", that year should be used.\"&\" An applicant must provide historical information back to the greater of: a) at least five (5) historical actual years; or b) to its last cost of service application.\"","v":"For 2021 Cost of Service rebasers, the typical situation is that 2017 would have been the most recent cost of service rebasing application. If the most recent rebasing application was for a rate year other than 2017, that year should be used. An applicant must provide historical information back to the greater of: a) at least five (5) historical actual years; or b) to its last cost of service application."}]
[null,"(3)","Consumption must be provided on a total distribution system basis as well as at a customer class level."]
[null,"(4)","Revenues exclude commodity charges."]

{"sheet":"App.2-IB_Load_Forecast_Analysis","index":29,"n_rows":531,"n_cols":21,"rows_kept":531,"cut":false,"hidden":false,"merged":[[248,3,248,8],[295,3,295,8],[342,3,342,8],[389,3,389,8],[461,5,461,8],[461,10,461,14],[461,16,461,20],[415,5,415,7],[425,11,425,12],[425,17,425,18],[438,5,438,8],[438,10,438,14],[438,16,438,20],[436,3,436,8],[439,5,439,7],[449,11,449,12],[449,17,449,18],[392,5,392,7],[402,11,402,12],[402,17,402,18],[414,5,414,8],[414,10,414,14],[414,16,414,20],[368,5,368,7],[378,11,378,12],[378,17,378,18],[391,5,391,8],[391,10,391,14],[391,16,391,20],[345,5,345,7],[355,11,355,12],[355,17,355,18],[367,5,367,8],[367,10,367,14],[367,16,367,20],[321,5,321,7],[331,11,331,12],[331,17,331,18],[344,5,344,8],[344,10,344,14],[344,16,344,20],[298,5,298,7],[308,11,308,12],[308,17,308,18],[320,5,320,8],[320,10,320,14],[320,16,320,20],[274,5,274,7],[284,11,284,12],[284,17,284,18],[297,5,297,8],[297,10,297,14],[297,16,297,20],[261,11,261,12],[261,17,261,18],[273,5,273,8],[273,10,273,14],[273,16,273,20],[250,5,250,8],[250,10,250,14],[250,16,250,20],[251,5,251,7],[73,17,73,18],[85,16,85,20],[96,17,96,18],[24,1,24,21],[8,1,8,21],[9,1,9,21],[18,1,18,21],[20,1,20,21],[22,1,22,21],[26,1,26,21],[62,10,62,14],[62,16,62,20],[36,10,36,14],[37,5,37,7],[28,1,28,21],[203,16,203,20],[201,3,201,8],[143,11,143,12],[143,17,143,18],[133,5,133,7],[47,11,47,12],[109,5,109,8],[109,10,109,14],[120,11,120,12],[120,17,120,18],[132,5,132,8],[132,10,132,14],[132,16,132,20],[60,3,60,8],[107,3,107,8],[63,5,63,7],[62,5,62,8],[109,16,109,20],[110,5,110,7],[73,11,73,12],[85,10,85,14],[96,11,96,12],[85,5,85,8],[86,5,86,7],[154,3,154,8],[156,5,156,8],[156,10,156,14],[156,16,156,20],[157,5,157,7],[167,11,167,12],[167,17,167,18],[227,5,227,7],[237,11,237,12],[237,17,237,18],[204,5,204,7],[214,11,214,12],[214,17,214,18],[226,5,226,8],[226,10,226,14],[226,16,226,20],[179,5,179,8],[179,10,179,14],[179,16,179,20],[180,5,180,7],[190,11,190,12],[190,17,190,18],[203,5,203,8],[203,10,203,14],[508,5,508,8],[508,10,508,14],[508,16,508,20],[509,5,509,7],[519,11,519,12],[519,17,519,18],[462,5,462,7],[472,11,472,12],[472,17,472,18],[483,3,483,8],[485,5,485,8],[485,10,485,14],[485,16,485,20],[486,5,486,7],[496,11,496,12],[496,17,496,18]]}
[null,null,null,null,null,null,null,null,null,null,null,null,null,null,null,null,null,null,null,"File Number:",{"$f":"EBNUMBER","v":0}]
[null,null,null,null,null,null,null,null,null,null,null,null,null,null,null,null,null,null,null,"Exhibit:"]
[null,null,null,null,null,null,null,null,null,null,null,null,null,null,null,null,null,null,null,"Tab:"]
[null,null,null,null,null,null,null,null,null,null,null,null,null,null,null,null,null,null,null,"Schedule:"]
[null,null,null,null,null,null,null,null,null,null,null,null,null,null,null,null,null,null,null,"Page:"]
[]
[null,null,null,null,null,null,null,null,null,null,null,null,null,null,null,null,null,null,null,"Date:"]
[]
[null,"Appendix 2-IB"]
[null,"Customer, Connections, Load Forecast and Revenues Data and Analysis"]
[]
[null,"This sheet requires no inputs, but serves as a summary of the hiostorical and forecasted data to be provided with respect to:"]
[]
[null,"1)","Customers and connections"]
[null,"2)","Consumption (kWh)"]
[null,"3)","Demand (kW or kCA) for applicable demand-billed customer classes"]
[null,"4)","Revenues"]
[]
[null,"The spreadsheet summarizes the data provided and the analyses (variance or year-over-year) that are required. Data are required to be provided on a customer class level. Consumption (kWh) must also be provided on a total distribution system level."]
[]
[null,"Appendix 2-IB (formerly 2-IA) is the appendix spreadsheet that the distributor populates, and the spreadsheet is laid out for inputting the necessary data. The spreadsheet also calculates necessary statistics such as average consumption per customer/connection per year, and variances and % annual changes, as necessary."]
[]
[null,"The distributor is required to provide suitable documentation in Exhibit 3 of its Application, in accordance with section 2.3.2 of Chaoter 2 of the Filing Requirements. This would include explanations for material variations or of trends in the data."]
[]
[null,"The distributor is also required to input its test year customer/connection and load forecast in Sheet 10 - Load Forecast of the Revenue Requirement Work Form. This sheet should also be updated to reflect changes in the load forecast made through the stages of processing of the rates application."]
[]
[null,"The applicant must demonstrate the historical accuracy of its load forecast approach for at least the past 5 years. Such analysis will cover both customer/connections and consumption (kWh) and demand (kW or kVA) by providing the following, as shown in the following table:"]
[]
[null,"This sheet is to be filled in accordance with the instructions documented in section 2.3.2 of Chapter 2 of the Filing Requirements for Distribution Rate Applications, in terms of one set of tables per customer class."]
[]
[null,"Color coding for Cells:",null,null,null,"Data input",null,null,null,null,"Drop-down List"]
[]
[null,null,null,null,null,"No data entry required",null,null,null,null,"Blank or calculated value"]
[]
[null,"Distribution System (Total)"]
[]
[null,null,null,"Calendar Year",null,null,null,null,null,null,"Consumption (kWh) (3)"]
[null,null,null,{"$f":"CONCATENATE(\"(for \",TestYear,\" Cost of Service\")","v":"(for 2021 Cost of Service"},null,null,null,null,null,null,null,"Actual (Weather actual)","Weather-normalized",null,"Weather-normalized"]
[null,null,"Historical",{"$f":"D40-1","v":2014},null,null,null,null,null,null,"Actual",1617185814,1638065149.7867732,{"$f":"IF(D39=RebaseYear,\"OEB-approved\",\"\")","v":"OEB-approved"}]
[null,null,"Historical",2015,null,null,null,null,null,null,"Actual",1621254425,1632093256.8330889,""]
[null,null,"Historical",{"$f":"D42-1","v":2016},null,null,null,null,null,null,"Actual",1648846758,1624103777.7860548,{"$f":"IF(D41=RebaseYear,\"OEB-approved\",\"\")","v":""}]
[null,null,"Historical",2017,null,null,null,null,null,null,"Actual",1566913372,1580274717.871139,""]
[null,null,"Historical",2018,null,null,null,null,null,null,"Actual",1598388710,1550538911.8481767,""]
[null,null,"Historical",2019,null,null,null,null,null,null,"Actual",1533883834,1552408492.6755638,""]
[null,null,"Bridge Year",2020,null,null,null,null,null,null,"Forecast",null,1452412078.1368964,""]
[null,null,"Test Year",{"$f":"TestYear","v":2021},null,null,null,null,null,null,"Forecast",null,1527539491.7958136,""]
[null,null,null,null,null,null,null,null,null,null,null,null,null,null,{"$f":"SUM(O39:O45)","v":0}]
[null,null,"Variance Analysis",null,null,null,null,null,null,null,"Year","Year-over-year",null,null,"Versus OEB-approved"]
[null,null,null,{"$f":"D39","v":2014},null,null,null,null,null,null,{"$f":"D49","v":2014}]
[null,null,null,2015,null,null,null,null,null,null,{"$f":"D50","v":2015},{"$f":"IF(L39=0,\"\",L40/L39-1)","v":2.515858700204987E-3},-3.6456992900811835E-3]
[null,null,null,2016,null,null,null,null,null,null,{"$f":"D51","v":2016},1.7019125792054446E-2,-4.8952343952065602E-3]
[null,null,null,2017,null,null,null,null,null,null,{"$f":"D52","v":2017},-4.9691328561899062E-2,-2.6986612871908178E-2]
[null,null,null,2018,null,null,null,null,null,null,2018,2.0087478071506348E-2,-1.8816858668106007E-2]
[null,null,null,2019,null,null,null,null,null,null,2019,-4.0356188451806552E-2,1.2057619535381647E-3]
[null,null,null,2020,null,null,null,null,null,null,2020,{"$f":"IF(K45=\"Forecast\",\"\",IF(L44=0,\"\",L45/L44-1))","v":""},{"$f":"IF(M44=0,\"\",M45/M44-1)","v":-6.4413725517775577E-2}]
[null,null,null,2021,null,null,null,null,null,null,2021,{"$f":"IF(K46=\"Forecast\",\"\",IF(L45=0,\"\",L46/L45-1))","v":""},{"$f":"IF(M45=0,\"\",M46/M45-1)","v":5.1725963168309574E-2},null,{"$f":"IF(O47=0,\"\",M46/O47-1)","v":""}]
[null,null,null,"Geometric Mean",null,null,null,null,null,null,"Geometric Mean",{"$f":"IF(L39=0,\"\",(L44/L39)^(1/($D44-$D39-1))-1)","v":-1.3134113338437281E-2},{"$f":"IF(M39=0,\"\",(M46/M39)^(1/($D46-$D39-1))-1)","v":-1.1575399045956392E-2},null,{"$f":"IF(O47=0,\"\",(M46/O47)^(1/(TestYear-RebaseYear-1))-1)","v":""}]
[]
[null,"Customer Class Analysis (one for each Customer Class, excluding MicroFIT and Standby)"]
[]
[null,1,"Customer Class:","Residential",null,null,null,null,null,null,"Is the customer class billed on consumption (kWh) or demand (kW or kVA)?",null,null,null,null,null,"kWh"]
[]
[null,null,null,"Calendar Year",null,"Customers",null,null,null,null,"Consumption (kWh) (3)",null,null,null,null,null,{"$f":"CONCATENATE(\"Consumption (kWh) per \",LEFT(F63,LEN(F63)-1))","v":"Consumption (kWh) per Customer"}]
[null,null,null,{"$f":"CONCATENATE(\"(for \",TestYear,\" Cost of Service\")","v":"(for 2021 Cost of Service"},null,null,null,null,null,null,null,"Actual (Weather actual)","Weather-normalized",null,"Weather-normalized",null,null,{"$f":"L64","v":"Actual (Weather actual)"},{"$f":"M64","v":"Weather-normalized"},null,{"$f":"O64","v":"Weather-normalized"}]
[null,null,"Historical",{"$f":"D66-1","v":2014},null,{"$f":"$K$42","v":"Actual"},59824.416666666664,{"$f":"IF(D65=RebaseYear,\"OEB-approved\",\"\")","v":"OEB-approved"},null,null,{"$f":"F65","v":"Actual"},530303117,544629927.51738429,{"$f":"H65","v":"OEB-approved"},null,null,{"$f":"K65","v":"Actual"},{"$f":"IF(G65=0,\"\",L65/G65)","v":8864.325747708921},{"$f":"IF(G65=0,\"\",M65/G65)","v":9103.8067375063019},{"$f":"N65","v":"OEB-approved"},{"$f":"IF(T65=\"\",\"\",IF(I65=0,\"\",O65/I65))","v":""}]
[null,null,"Historical",2015,null,{"$f":"$K$43","v":"Actual"},60123.25,"",null,null,"Actual",530999846,536484747.92066938,"",null,null,"Actual",8831.8553305085807,8923.0829657523409,"",""]
[null,null,"Historical",2016,null,{"$f":"$K$41","v":"Actual"},60318.833333333336,{"$f":"IF(D67=RebaseYear,\"OEB-approved\",\"\")","v":""},null,null,{"$f":"F67","v":"Actual"},545123880,529766663.29605126,{"$f":"H67","v":""},null,null,{"$f":"K67","v":"Actual"},{"$f":"IF(G67=0,\"\",L67/G67)","v":9037.3743966091297},{"$f":"IF(G67=0,\"\",M67/G67)","v":8782.773704664678},{"$f":"N67","v":""},{"$f":"IF(T67=\"\",\"\",IF(I67=0,\"\",O67/I67))","v":""}]
[null,null,"Historical",2017,null,{"$f":"$K$42","v":"Actual"},60502,"",null,null,"Actual",501428451,515589624.78623956,{"$f":"H68","v":""},null,null,"Actual",8287.7995934018709,8521.860844042174,{"$f":"N68","v":""},{"$f":"IF(T68=\"\",\"\",IF(I68=0,\"\",O68/I68))","v":""}]
[null,null,"Historical",2018,null,{"$f":"$K$43","v":"Actual"},60920.083333333336,"",null,null,"Actual",536801589,510984906.0321942,"",null,null,"Actual",8811.5701691150007,8387.7906606966371,"",""]
[null,null,"Historical",2019,null,{"$f":"$K$44","v":"Actual"},61427.666666666664,"",null,null,"Actual",512580883,520074033.57396138,"",null,null,"Actual",8344.4628587552852,8466.4461763802647,"",""]
[null,null,"Bridge Year",{"$f":"D72-1","v":2020},null,{"$f":"$K$45","v":"Forecast"},61651.285485351538,"",null,null,"Forecast",null,546039497.45714056,"",null,null,"Forecast",0,8856.9036826795855,"",""]
[null,null,"Test Year",{"$f":"TestYear","v":2021},null,{"$f":"$K$46","v":"Forecast"},62055.717918135437,"",null,null,"Forecast",null,524243173.46697503,"",null,null,"Forecast",0,8447.9430913773685,"",""]
[null,null,null,null,null,null,null,null,{"$f":"SUM(I65:I71)","v":0},null,null,null,null,null,{"$f":"SUM(O65:O71)","v":0},null,null,null,null,null,{"$f":"SUM(U65:U71)","v":0}]
[null,null,"Variance Analysis","Year",null,null,"Year-over-year",null,"Test Year Versus OEB-approved",null,"Year","Year-over-year",null,null,{"$f":"I74","v":"Test Year Versus OEB-approved"},null,"Year","Year-over-year",null,null,{"$f":"O74","v":"Test Year Versus OEB-approved"}]
[null,null,null,{"$f":"D65","v":2014},null,null,null,null,null,null,{"$f":"D75","v":2014},null,null,null,null,null,{"$f":"K75","v":2014}]
[null,null,null,{"$f":"D66","v":2015},null,null,{"$f":"IF(G65=0,\"\",G66/G65-1)","v":4.9951733754194372E-3},null,null,null,{"$f":"D76","v":2015},{"$f":"IF(L65=0,\"\",L66/L65-1)","v":1.3138316137786266E-3},-1.4955438886444461E-2,null,null,null,{"$f":"K76","v":2015},{"$f":"IF(R65=\"\",\"\",IF(R65=0,\"\",R66/R65-1))","v":-3.6630442206766478E-3},-1.9851450823248129E-2]
[null,null,null,2016,null,null,3.2530399360204409E-3,null,null,null,2016,{"$f":"IF(L66=0,\"\",L67/L66-1)","v":2.6598941800823006E-2},-1.2522414944052707E-2,null,null,null,2016,{"$f":"IF(R66=\"\",\"\",IF(R66=0,\"\",R67/R66-1))","v":2.3270202965237408E-2},-1.5724303094141745E-2]
[null,null,null,2017,null,null,3.0366414027680477E-3,null,null,null,2017,{"$f":"IF(L67=0,\"\",L68/L67-1)","v":-8.0156879203310605E-2},-2.6760910967115858E-2,null,null,null,2017,{"$f":"IF(R67=\"\",\"\",IF(R67=0,\"\",R68/R67-1))","v":-8.2941656537821817E-2},-2.970734182572965E-2]
[null,null,null,2018,null,null,6.9102398818772226E-3,null,null,null,2018,{"$f":"IF(L68=0,\"\",L69/L68-1)","v":7.0544736600915314E-2},-8.9309763670175624E-3,null,null,null,2018,{"$f":"IF(R68=\"\",\"\",IF(R68=0,\"\",R69/R68-1))","v":6.3197784865613338E-2},-1.5732500893776979E-2]
[null,null,null,{"$f":"D70","v":2019},null,null,{"$f":"IF(G69=0,\"\",G70/G69-1)","v":8.3319540217305921E-3},null,null,null,{"$f":"D80","v":2019},{"$f":"IF(L69=0,\"\",L70/L69-1)","v":-4.5120406675994373E-2},{"$f":"IF(M69=0,\"\",M70/M69-1)","v":1.7787467759751152E-2},null,null,null,{"$f":"K80","v":2019},{"$f":"IF(R69=\"\",\"\",IF(R69=0,\"\",R70/R69-1))","v":-5.3010678164596592E-2},{"$f":"IF(S69=\"\",\"\",IF(S69=0,\"\",S70/S69-1))","v":9.3773818238205298E-3}]
[null,null,null,{"$f":"D71","v":2020},null,null,{"$f":"IF(G70=0,\"\",G71/G70-1)","v":3.640359968388962E-3},null,null,null,2020,{"$f":"IF(K71=\"Forecast\",\"\",IF(L70=0,\"\",L71/L70-1))","v":""},{"$f":"IF(M70=0,\"\",M71/M70-1)","v":4.99264762455911E-2},null,null,null,2020,{"$f":"IF(Q71=\"Forecast\",\"\",IF(R70=0,\"\",R71/R70-1))","v":""},{"$f":"IF(S70=\"\",\"\",IF(S70=0,\"\",S71/S70-1))","v":4.6118229321367554E-2}]
[null,null,null,{"$f":"D72","v":2021},null,null,{"$f":"IF(G71=0,\"\",G72/G71-1)","v":6.5599999999998992E-3},null,{"$f":"IF(I73=0,\"\",G72/I73-1)","v":""},null,2021,{"$f":"IF(K72=\"Forecast\",\"\",IF(L71=0,\"\",L72/L71-1))","v":""},{"$f":"IF(M71=0,\"\",M72/M71-1)","v":-3.9917119716923688E-2},null,{"$f":"IF(O73=0,\"\",M72/O73-1)","v":""},null,2021,{"$f":"IF(Q72=\"Forecast\",\"\",IF(R71=0,\"\",R72/R71-1))","v":""},{"$f":"IF(S71=\"\",\"\",IF(S71=0,\"\",S72/S71-1))","v":-4.6174216854358852E-2},null,{"$f":"IF(U73=0,\"\",S72/U73-1)","v":""}]
[null,null,null,"Geometric Mean",null,null,{"$f":"IF(G65=0,\"\",(G72/G65)^(1/($D72-$D65-1))-1)","v":6.121791120455633E-3},null,{"$f":"IF(I73=0,\"\",(G72/I73)^(1/(TestYear-RebaseYear-1))-1)","v":""},null,"Geometric Mean",{"$f":"IF(L65=0,\"\",(L70/L65)^(1/($D70-$D65-1))-1)","v":-8.4615585007878913E-3},{"$f":"IF(M65=0,\"\",(M72/M65)^(1/($D72-$D65-1))-1)","v":-6.3383082671096824E-3},null,{"$f":"IF(O73=0,\"\",(M72/O73)^(1/(TestYear-RebaseYear-1))-1)","v":""},null,"Geometric Mean",{"$f":"IF(R65=\"\",\"\",IF(R65=0,\"\",(R70/R65)^(1/($D70-$D65-1))-1))","v":-1.4995601817188842E-2},{"$f":"IF(S65=\"\",\"\",IF(S65=0,\"\",(S72/S65)^(1/($D72-$D65-1))-1))","v":-1.2384285379297033E-2},null,{"$f":"IF(U73=0,\"\",(S72/U73)^(1/(TestYear-RebaseYear-1))-1)","v":""}]
[]
[]
[null,null,null,"Calendar Year",null,"Revenues",null,null,null,null,{"$f":"IF(ISBLANK(Q61),\"\",CONCATENATE(\"Demand (\",Q61,\")\"))","v":"Demand (kWh)"},null,null,null,null,null,{"$f":"CONCATENATE(\"Demand (\",Q61,\") per \",LEFT(F63,LEN(F63)-1))","v":"Demand (kWh) per Customer"}]
[null,null,null,{"$f":"CONCATENATE(\"(for \",TestYear,\" Cost of Service\")","v":"(for 2021 Cost of Service"},null,null,null,null,null,null,null,"Actual (Weather actual)","Weather-normalized",null,{"$f":"M87","v":"Weather-normalized"},null,null,{"$f":"L87","v":"Actual (Weather actual)"},{"$f":"M87","v":"Weather-normalized"},null,{"$f":"O87","v":"Weather-normalized"}]
[null,null,"Historical",{"$f":"D89-1","v":2014},null,{"$f":"F65","v":"Actual"},17877959.650000002,{"$f":"IF(D88=RebaseYear,\"OEB-approved\",\"\")","v":"OEB-approved"},null,null,{"$f":"K65","v":"Actual"},null,null,{"$f":"N65","v":"OEB-approved"},null,null,{"$f":"K88","v":"Actual"},{"$f":"IF(G88=0,\"\",L88/G88)","v":0},{"$f":"IF(G88=0,\"\",M88/G88)","v":0},{"$f":"N88","v":"OEB-approved"},{"$f":"IF(T88=\"\",\"\",IF(I88=0,\"\",O88/I88))","v":""}]
[null,null,"Historical",2015,null,"Actual",17515273.34,{"$f":"IF(D89=RebaseYear,\"OEB-approved\",\"\")","v":""}]
[null,null,"Historical",2016,null,"Actual",18131911.800000001,{"$f":"IF(D90=RebaseYear,\"OEB-approved\",\"\")","v":""},null,null,{"$f":"K67","v":"Actual"},null,null,{"$f":"N67","v":""},null,null,{"$f":"K90","v":"Actual"},{"$f":"IF(G90=0,\"\",L90/G90)","v":0},{"$f":"IF(G90=0,\"\",M90/G90)","v":0},{"$f":"N90","v":""},{"$f":"IF(T90=\"\",\"\",IF(I90=0,\"\",O90/I90))","v":""}]
[null,null,"Historical",2017,null,"Actual",18327347.720000003,"",null,null,"Actual",null,null,"",null,null,"Actual",0,0,"",""]
[null,null,"Historical",2018,null,"Actual",18848915.939999998,"",null,null,"Actual",null,null,"",null,null,"Actual",0,0,"",""]
[null,null,"Historical",2019,null,"Actual",19082513.980000008,"",null,null,"Actual",null,null,"",null,null,"Actual",0,0,"",""]
[null,null,"Bridge Year (Forecast)",2020,null,"Forecast",19612506.938600034,"",null,null,"Forecast",null,null,"",null,null,"Forecast",0,0,"",""]
[null,null,"Test Year (Forecast)",{"$f":"TestYear","v":2021},null,"Forecast",21906924.789715387,"",null,null,"Forecast",null,null,"",null,null,"Forecast",0,0,"",""]
[null,null,null,null,null,null,null,null,{"$f":"SUM(I88:I94)","v":0},null,null,null,null,null,{"$f":"SUM(O88:O94)","v":0},null,null,null,null,null,{"$f":"SUM(U88:U94)","v":0}]
[null,null,"Variance Analysis","Year",null,null,"Year-over-year",null,{"$f":"I74","v":"Test Year Versus OEB-approved"},null,"Year","Year-over-year",null,null,{"$f":"I97","v":"Test Year Versus OEB-approved"},null,"Year","Year-over-year",null,null,{"$f":"O97","v":"Test Year Versus OEB-approved"}]
[null,null,null,{"$f":"D88","v":2014},null,null,null,null,null,null,{"$f":"D98","v":2014},null,null,null,null,null,{"$f":"K98","v":2014}]
[null,null,null,2015,null,null,{"$f":"IF(G88=0,\"\",G89/G88-1)","v":-2.0286784236030142E-2}]
[null,null,null,2016,null,null,3.5205757171472118E-2,null,null,null,{"$f":"D100","v":2016},{"$f":"IF(L88=0,\"\",L90/L88-1)","v":""},{"$f":"IF(M88=0,\"\",M90/M88-1)","v":""},null,null,null,{"$f":"K100","v":2016},{"$f":"IF(R88=\"\",\"\",IF(R88=0,\"\",R90/R88-1))","v":""},{"$f":"IF(S88=\"\",\"\",IF(S88=0,\"\",S90/S88-1))","v":""}]
[null,null,null,2017,null,null,1.0778561144335619E-2,null,null,null,2017,{"$f":"IF(L90=0,\"\",L91/L90-1)","v":""},"",null,null,null,2017,{"$f":"IF(R90=\"\",\"\",IF(R90=0,\"\",R91/R90-1))","v":""},""]
[null,null,null,2018,null,null,2.8458466984332187E-2,null,null,null,2018,"","",null,null,null,2018,"",""]
[null,null,null,2019,null,null,1.2393181695095956E-2,null,null,null,2019,"","",null,null,null,2019,"",""]
[null,null,null,2020,null,null,2.7773749263618974E-2,null,null,null,2020,{"$f":"IF(K94=\"Forecast\",\"\",IF(L93=0,\"\",L94/L93-1))","v":""},{"$f":"IF(M93=0,\"\",M94/M93-1)","v":""},null,null,null,2020,{"$f":"IF(Q94=\"Forecast\",\"\",IF(R93=0,\"\",R94/R93-1))","v":""},{"$f":"IF(S93=\"\",\"\",IF(S93=0,\"\",S94/S93-1))","v":""}]
[null,null,null,2021,null,null,0.11698748448112117,null,{"$f":"IF(I96=0,\"\",G95/I96-1)","v":""},null,2021,{"$f":"IF(K95=\"Forecast\",\"\",IF(L94=0,\"\",L95/L94-1))","v":""},{"$f":"IF(M94=0,\"\",M95/M94-1)","v":""},null,{"$f":"IF(O96=0,\"\",M95/O96-1)","v":""},null,2021,{"$f":"IF(Q95=\"Forecast\",\"\",IF(R94=0,\"\",R95/R94-1))","v":""},{"$f":"IF(S94=\"\",\"\",IF(S94=0,\"\",S95/S94-1))","v":""},null,{"$f":"IF(U96=0,\"\",S95/U96-1)","v":""}]
[null,null,null,"Geometric Mean",null,null,{"$f":"IF(G88=0,\"\",(G95/G88)^(1/($D95-$D88-1))-1)","v":3.4452556911898524E-2},null,{"$f":"IF(I96=0,\"\",(G95/I96)^(1/(TestYear-RebaseYear-1))-1)","v":""},null,"Geometric Mean",{"$f":"IF(L88=0,\"\",(L93/L88)^(1/($D93-$D88-1))-1)","v":""},{"$f":"IF(M88=0,\"\",(M95/M88)^(1/($D95-$D88-1))-1)","v":""},null,{"$f":"IF(O96=0,\"\",(M95/O96)^(1/(TestYear-RebaseYear-1))-1)","v":""},null,"Geometric Mean",{"$f":"IF(R88=\"\",\"\",IF(R88=0,\"\",(R93/R88)^(1/($D93-$D88-1))-1))","v":""},{"$f":"IF(S88=\"\",\"\",IF(S88=0,\"\",(S95/S88)^(1/($D95-$D88-1))-1))","v":""},null,{"$f":"IF(U96=0,\"\",(S95/U96)^(1/(TestYear-RebaseYear-1))-1)","v":""}]
[]
[null,2,"Customer Class:","GS < 50 kW",null,null,null,null,null,null,"Is the customer class billed on consumption (kWh) or demand (kW or kVA)?",null,null,null,null,null,"kWh"]
[]
[null,null,null,"Calendar Year",null,"Customers",null,null,null,null,"Consumption (kWh) (3)",null,null,null,null,null,{"$f":"CONCATENATE(\"Consumption (kWh) per \",LEFT(F110,LEN(F110)-1))","v":"Consumption (kWh) per Customer"}]
[null,null,null,{"$f":"CONCATENATE(\"(for \",TestYear,\" Cost of Service\")","v":"(for 2021 Cost of Service"},null,null,null,null,null,null,null,"Actual (Weather actual)","Weather-normalized",null,"Weather-normalized",null,null,{"$f":"L111","v":"Actual (Weather actual)"},{"$f":"M111","v":"Weather-normalized"},null,{"$f":"O111","v":"Weather-normalized"}]
[null,null,"Historical",{"$f":"D113-1","v":2014},null,{"$f":"$K$41","v":"Actual"},5198.458333333333,{"$f":"IF(D112=RebaseYear,\"OEB-approved\",\"\")","v":"OEB-approved"},null,null,{"$f":"F112","v":"Actual"},172644356,173351270.69665211,{"$f":"H112","v":"OEB-approved"},null,null,{"$f":"K112","v":"Actual"},{"$f":"IF(G112=0,\"\",L112/G112)","v":33210.683808500922},{"$f":"IF(G112=0,\"\",M112/G112)","v":33346.669258671653},{"$f":"N112","v":"OEB-approved"},{"$f":"IF(T112=\"\",\"\",IF(I112=0,\"\",O112/I112))","v":""}]
[null,null,"Historical",2015,null,{"$f":"$K$42","v":"Actual"},5238.5,"",null,null,"Actual",170245509,171832583.61030331,{"$f":"H113","v":""},null,null,"Actual",32498.904075594157,32801.867635831499,{"$f":"N113","v":""},{"$f":"IF(T113=\"\",\"\",IF(I113=0,\"\",O113/I113))","v":""}]
[null,null,"Historical",2016,null,{"$f":"$K$41","v":"Actual"},5272.833333333333,{"$f":"IF(D114=RebaseYear,\"OEB-approved\",\"\")","v":""},null,null,{"$f":"F114","v":"Actual"},169905557,169607123.82166469,{"$f":"H114","v":""},null,null,{"$f":"K114","v":"Actual"},{"$f":"IF(G114=0,\"\",L114/G114)","v":32222.819546733259},{"$f":"IF(G114=0,\"\",M114/G114)","v":32166.221289312773},{"$f":"N114","v":""},{"$f":"IF(T114=\"\",\"\",IF(I114=0,\"\",O114/I114))","v":""}]
[null,null,"Historical",2017,null,{"$f":"$K$42","v":"Actual"},5341.666666666667,"",null,null,"Actual",166894185,169390968.17060709,{"$f":"H115","v":""},null,null,"Actual",31243.841185647423,31711.25769184532,{"$f":"N115","v":""},{"$f":"IF(T115=\"\",\"\",IF(I115=0,\"\",O115/I115))","v":""}]
[null,null,"Historical",2018,null,{"$f":"$K$43","v":"Actual"},5427.75,"",null,null,"Actual",174257110,169541626.93608317,"",null,null,"Actual",32104.851918382388,31236.078842261188,"",""]
[null,null,"Historical",2019,null,{"$f":"$K$44","v":"Actual"},5489.5,"",null,null,"Actual",170703484,170772378.24538329,"",null,null,"Actual",31096.362874578743,31108.913060457835,"",""]
[null,null,"Bridge Year",{"$f":"D119-1","v":2020},null,{"$f":"$K$45","v":"Forecast"},5505.5601358758804,"",null,null,"Forecast",null,152883777.49309301,"",null,null,"Forecast",0,27768.977855106237,"",""]
[null,null,"Test Year",{"$f":"TestYear","v":2021},null,{"$f":"$K$46","v":"Forecast"},5564.469629329752,"",null,null,"Forecast",null,169189510.10236472,"",null,null,"Forecast",0,30405.325461852477,"",""]
[null,null,null,null,null,null,null,null,{"$f":"SUM(I112:I118)","v":0},null,null,null,null,null,{"$f":"SUM(O112:O118)","v":0},null,null,null,null,null,{"$f":"SUM(U112:U118)","v":0}]
[null,null,"Variance Analysis","Year",null,null,"Year-over-year",null,"Test Year Versus OEB-approved",null,"Year","Year-over-year",null,null,{"$f":"I121","v":"Test Year Versus OEB-approved"},null,"Year","Year-over-year",null,null,{"$f":"O121","v":"Test Year Versus OEB-approved"}]
[null,null,null,{"$f":"D112","v":2014},null,null,null,null,null,null,{"$f":"D122","v":2014},null,null,null,null,null,{"$f":"K122","v":2014}]
[null,null,null,2015,null,null,{"$f":"IF(G112=0,\"\",G113/G112-1)","v":7.702604137444613E-3},null,null,null,{"$f":"D123","v":2015},{"$f":"IF(L112=0,\"\",L113/L112-1)","v":-1.3894731664439663E-2},-8.7607496630720538E-3,null,null,null,{"$f":"K123","v":2015},{"$f":"IF(R112=\"\",\"\",IF(R112=0,\"\",R113/R112-1))","v":-2.1432251651637868E-2},-1.6337512409833277E-2]
[null,null,null,2016,null,null,6.5540390060767617E-3,null,null,null,2016,{"$f":"IF(L113=0,\"\",L114/L113-1)","v":-1.9968338783021844E-3},-1.2951325888724941E-2,null,null,null,2016,{"$f":"IF(R113=\"\",\"\",IF(R113=0,\"\",R114/R113-1))","v":-8.4951950446916502E-3},-1.9378358378117744E-2]
[null,null,null,2017,null,null,1.3054335113948934E-2,null,null,null,{"$f":"D125","v":2017},{"$f":"IF(L114=0,\"\",L115/L114-1)","v":-1.7723799345774172E-2},-1.2744491280028969E-3,null,null,null,{"$f":"K125","v":2017},{"$f":"IF(R114=\"\",\"\",IF(R114=0,\"\",R115/R114-1))","v":-3.0381523865905313E-2},-1.4144141874029015E-2]
[null,null,null,2018,null,null,1.6115444617784691E-2,null,null,null,2018,{"$f":"IF(L115=0,\"\",L116/L115-1)","v":4.411732499847143E-2},8.894143950126665E-4,null,null,null,2018,{"$f":"IF(R115=\"\",\"\",IF(R115=0,\"\",R116/R115-1))","v":2.7557774590484474E-2},-1.4984547576185392E-2]
[null,null,null,2019,null,null,1.1376721477591945E-2,null,null,null,2019,{"$f":"IF(L116=0,\"\",L117/L116-1)","v":-2.0393004337097009E-2},7.259286887485894E-3,null,null,null,2019,{"$f":"IF(R116=\"\",\"\",IF(R116=0,\"\",R117/R116-1))","v":-3.1412356187390245E-2},-4.0711186076052286E-3]
[null,null,null,2020,null,null,2.9256099600838414E-3,null,null,null,2020,{"$f":"IF(K118=\"Forecast\",\"\",IF(L117=0,\"\",L118/L117-1))","v":""},{"$f":"IF(M117=0,\"\",M118/M117-1)","v":-0.10475113678270676},null,null,null,2020,{"$f":"IF(Q118=\"Forecast\",\"\",IF(R117=0,\"\",R118/R117-1))","v":""},{"$f":"IF(S117=\"\",\"\",IF(S117=0,\"\",S118/S117-1))","v":-0.10736264551772301}]
[null,null,null,2021,null,null,1.0699999999999932E-2,null,{"$f":"IF(I120=0,\"\",G119/I120-1)","v":""},null,2021,{"$f":"IF(K119=\"Forecast\",\"\",IF(L118=0,\"\",L119/L118-1))","v":""},{"$f":"IF(M118=0,\"\",M119/M118-1)","v":0.10665443303824929},null,{"$f":"IF(O120=0,\"\",M119/O120-1)","v":""},null,2021,{"$f":"IF(Q119=\"Forecast\",\"\",IF(R118=0,\"\",R119/R118-1))","v":""},{"$f":"IF(S118=\"\",\"\",IF(S118=0,\"\",S119/S118-1))","v":9.4938590123923472E-2},null,{"$f":"IF(U120=0,\"\",S119/U120-1)","v":""}]
[null,null,null,"Geometric Mean",null,null,{"$f":"IF(G112=0,\"\",(G119/G112)^(1/($D119-$D112-1))-1)","v":1.1404468750875862E-2},null,{"$f":"IF(I120=0,\"\",(G119/I120)^(1/(TestYear-RebaseYear-1))-1)","v":""},null,"Geometric Mean",{"$f":"IF(L112=0,\"\",(L117/L112)^(1/($D117-$D112-1))-1)","v":-2.8224327310339969E-3},{"$f":"IF(M112=0,\"\",(M119/M112)^(1/($D119-$D112-1))-1)","v":-4.0419017909183452E-3},null,{"$f":"IF(O120=0,\"\",(M119/O120)^(1/(TestYear-RebaseYear-1))-1)","v":""},null,"Geometric Mean",{"$f":"IF(R112=\"\",\"\",IF(R112=0,\"\",(R117/R112)^(1/($D117-$D112-1))-1))","v":-1.6310706726078483E-2},{"$f":"IF(S112=\"\",\"\",IF(S112=0,\"\",(S119/S112)^(1/($D119-$D112-1))-1))","v":-1.5272199222998384E-2},null,{"$f":"IF(U120=0,\"\",(S119/U120)^(1/(TestYear-RebaseYear-1))-1)","v":""}]
[]
[]
[null,null,null,"Calendar Year",null,"Revenues",null,null,null,null,{"$f":"IF(ISBLANK(Q108),\"\",CONCATENATE(\"Demand (\",Q108,\")\"))","v":"Demand (kWh)"},null,null,null,null,null,{"$f":"CONCATENATE(\"Demand (\",Q108,\") per \",LEFT(F110,LEN(F110)-1))","v":"Demand (kWh) per Customer"}]
[null,null,null,{"$f":"CONCATENATE(\"(for \",TestYear,\" Cost of Service\")","v":"(for 2021 Cost of Service"},null,null,null,null,null,null,null,"Actual (Weather actual)","Weather-normalized",null,{"$f":"M134","v":"Weather-normalized"},null,null,{"$f":"L134","v":"Actual (Weather actual)"},{"$f":"M134","v":"Weather-normalized"},null,{"$f":"O134","v":"Weather-normalized"}]
[null,null,"Historical",{"$f":"D136-1","v":2014},null,{"$f":"F112","v":"Actual"},4007275.4999999995,{"$f":"IF(D135=RebaseYear,\"OEB-approved\",\"\")","v":"OEB-approved"},null,null,{"$f":"K112","v":"Actual"},null,null,{"$f":"N112","v":"OEB-approved"},null,null,{"$f":"K135","v":"Actual"},{"$f":"IF(G135=0,\"\",L135/G135)","v":0},{"$f":"IF(G135=0,\"\",M135/G135)","v":0},{"$f":"N135","v":"OEB-approved"},{"$f":"IF(T135=\"\",\"\",IF(I135=0,\"\",O135/I135))","v":""}]
[null,null,"Historical",2015,null,"Actual",3881113.6400000006,""]
[null,null,"Historical",2016,null,"Actual",3989017.1100000003,{"$f":"IF(D137=RebaseYear,\"OEB-approved\",\"\")","v":""},null,null,{"$f":"K114","v":"Actual"},null,null,{"$f":"N114","v":""},null,null,{"$f":"K137","v":"Actual"},{"$f":"IF(G137=0,\"\",L137/G137)","v":0},{"$f":"IF(G137=0,\"\",M137/G137)","v":0},{"$f":"N137","v":""},{"$f":"IF(T137=\"\",\"\",IF(I137=0,\"\",O137/I137))","v":""}]
[null,null,"Historical",2017,null,"Actual",4062265.27,"",null,null,"Actual",null,null,"",null,null,"Actual",0,0,"",""]
[null,null,"Historical",2018,null,"Actual",4267284.95,"",null,null,"Actual",null,null,"",null,null,"Actual",0,0,"",""]
[null,null,"Historical",2019,null,"Actual",4277731.29,"",null,null,"Actual",null,null,"",null,null,"Actual",0,0,"",""]
[null,null,"Bridge Year (Forecast)",2020,null,"Forecast",4004580.2609714647,"",null,null,"Forecast",null,null,"",null,null,"Forecast",0,0,"",""]
[null,null,"Test Year (Forecast)",{"$f":"TestYear","v":2021},null,"Forecast",4719064.0724956151,"",null,null,"Forecast",null,null,"",null,null,"Forecast",0,0,"",""]
[null,null,null,null,null,null,null,null,{"$f":"SUM(I135:I141)","v":0},null,null,null,null,null,{"$f":"SUM(O135:O141)","v":0},null,null,null,null,null,{"$f":"SUM(U135:U141)","v":0}]
[null,null,"Variance Analysis","Year",null,null,"Year-over-year",null,{"$f":"I121","v":"Test Year Versus OEB-approved"},null,"Year","Year-over-year",null,null,{"$f":"I144","v":"Test Year Versus OEB-approved"},null,"Year","Year-over-year",null,null,{"$f":"O144","v":"Test Year Versus OEB-approved"}]
[null,null,null,{"$f":"D135","v":2014},null,null,null,null,null,null,{"$f":"D145","v":2014},null,null,null,null,null,{"$f":"K145","v":2014}]
[null,null,null,2015,null,null,{"$f":"IF(G135=0,\"\",G136/G135-1)","v":-3.1483200992794003E-2}]
[null,null,null,2016,null,null,2.7802192877815379E-2,null,null,null,{"$f":"D147","v":2016},{"$f":"IF(L135=0,\"\",L137/L135-1)","v":""},"",null,null,null,{"$f":"K147","v":2016},{"$f":"IF(R135=\"\",\"\",IF(R135=0,\"\",R137/R135-1))","v":""},{"$f":"IF(S135=\"\",\"\",IF(S135=0,\"\",S137/S135-1))","v":""}]
[null,null,null,2017,null,null,1.8362458214675303E-2,null,null,null,2017,{"$f":"IF(L137=0,\"\",L138/L137-1)","v":""},"",null,null,null,2017,{"$f":"IF(R137=\"\",\"\",IF(R137=0,\"\",R138/R137-1))","v":""},""]
[null,null,null,2018,null,null,5.0469298869790569E-2,null,null,null,2018,{"$f":"IF(L138=0,\"\",L139/L138-1)","v":""},"",null,null,null,2018,{"$f":"IF(R138=\"\",\"\",IF(R138=0,\"\",R139/R138-1))","v":""},""]
[null,null,null,2019,null,null,2.4480061965395095E-3,null,null,null,2019,{"$f":"IF(L139=0,\"\",L140/L139-1)","v":""},"",null,null,null,2019,{"$f":"IF(R139=\"\",\"\",IF(R139=0,\"\",R140/R139-1))","v":""},""]
[null,null,null,2020,null,null,-6.3854181226174034E-2,null,null,null,2020,{"$f":"IF(K141=\"Forecast\",\"\",IF(L140=0,\"\",L141/L140-1))","v":""},{"$f":"IF(M140=0,\"\",M141/M140-1)","v":""},null,null,null,2020,{"$f":"IF(Q141=\"Forecast\",\"\",IF(R140=0,\"\",R141/R140-1))","v":""},{"$f":"IF(S140=\"\",\"\",IF(S140=0,\"\",S141/S140-1))","v":""}]
[null,null,null,2021,null,null,0.17841665417159724,null,{"$f":"IF(I143=0,\"\",G142/I143-1)","v":""},null,2021,{"$f":"IF(K142=\"Forecast\",\"\",IF(L141=0,\"\",L142/L141-1))","v":""},{"$f":"IF(M141=0,\"\",M142/M141-1)","v":""},null,{"$f":"IF(O143=0,\"\",M142/O143-1)","v":""},null,2021,{"$f":"IF(Q142=\"Forecast\",\"\",IF(R141=0,\"\",R142/R141-1))","v":""},{"$f":"IF(S141=\"\",\"\",IF(S141=0,\"\",S142/S141-1))","v":""},null,{"$f":"IF(U143=0,\"\",S142/U143-1)","v":""}]
[null,null,null,"Geometric Mean",null,null,{"$f":"IF(G135=0,\"\",(G142/G135)^(1/($D142-$D135-1))-1)","v":2.7624489493010884E-2},null,{"$f":"IF(I143=0,\"\",(G142/I143)^(1/(TestYear-RebaseYear-1))-1)","v":""},null,"Geometric Mean",{"$f":"IF(L135=0,\"\",(L140/L135)^(1/($D140-$D135-1))-1)","v":""},{"$f":"IF(M135=0,\"\",(M142/M135)^(1/($D142-$D135-1))-1)","v":""},null,{"$f":"IF(O143=0,\"\",(M142/O143)^(1/(TestYear-RebaseYear-1))-1)","v":""},null,"Geometric Mean",{"$f":"IF(R135=\"\",\"\",IF(R135=0,\"\",(R140/R135)^(1/($D140-$D135-1))-1))","v":""},{"$f":"IF(S135=\"\",\"\",IF(S135=0,\"\",(S142/S135)^(1/($D142-$D135-1))-1))","v":""},null,{"$f":"IF(U143=0,\"\",(S142/U143)^(1/(TestYear-RebaseYear-1))-1)","v":""}]
[]
[null,3,"Customer Class:","GS > 50 kW (kW)",null,null,null,null,null,null,"Is the customer class billed on consumption (kWh) or demand (kW or kVA)?",null,null,null,null,null,"kW"]
[]
[null,null,null,"Calendar Year",null,"Customers",null,null,null,null,"Demand (kW) (3)",null,null,null,null,null,{"$f":"CONCATENATE(\"Demand (kW) per \",LEFT(F157,LEN(F157)-1))","v":"Demand (kW) per Customer"}]
[null,null,null,{"$f":"CONCATENATE(\"(for \",TestYear,\" Cost of Service\")","v":"(for 2021 Cost of Service"},null,null,null,null,null,null,null,"Actual (Weather actual)","Weather-normalized",null,"Weather-normalized",null,null,{"$f":"L158","v":"Actual (Weather actual)"},{"$f":"M158","v":"Weather-normalized"},null,{"$f":"O158","v":"Weather-normalized"}]
[null,null,"Historical",{"$f":"D160-1","v":2014},null,{"$f":"$K$42","v":"Actual"},1021.2083333333334,{"$f":"IF(D159=RebaseYear,\"OEB-approved\",\"\")","v":"OEB-approved"},null,null,{"$f":"F159","v":"Actual"},2373361,2387586.7328445385,{"$f":"H159","v":"OEB-approved"},null,null,{"$f":"K159","v":"Actual"},{"$f":"IF(G159=0,\"\",L159/G159)","v":2324.0713207393201},{"$f":"IF(G159=0,\"\",M159/G159)","v":2338.0016152543526},{"$f":"N159","v":"OEB-approved"},{"$f":"IF(T159=\"\",\"\",IF(I159=0,\"\",O159/I159))","v":""}]
[null,null,"Historical",2015,null,{"$f":"$K$43","v":"Actual"},1027.6666666666667,"",null,null,"Actual",2374100,2393115.1186592639,"",null,null,"Actual",2310.1848848524164,2328.6880817313627,"",""]
[null,null,"Historical",2016,null,{"$f":"$K$41","v":"Actual"},1034.1666666666667,{"$f":"IF(D161=RebaseYear,\"OEB-approved\",\"\")","v":""},null,null,{"$f":"F161","v":"Actual"},2410544,2413739.366866699,{"$f":"H161","v":""},null,null,{"$f":"K161","v":"Actual"},{"$f":"IF(G161=0,\"\",L161/G161)","v":2330.9047542304593},{"$f":"IF(G161=0,\"\",M161/G161)","v":2333.9945529734396},{"$f":"N161","v":""},{"$f":"IF(T161=\"\",\"\",IF(I161=0,\"\",O161/I161))","v":""}]
[null,null,"Historical",2017,null,{"$f":"$K$42","v":"Actual"},1003.6666666666666,"",null,null,"Actual",2363980,2349801.5441115806,{"$f":"H162","v":""},null,null,"Actual",2355.3437396213885,2341.217081479489,{"$f":"N162","v":""},{"$f":"IF(T162=\"\",\"\",IF(I162=0,\"\",O162/I162))","v":""}]
[null,null,"Historical",2018,null,{"$f":"$K$43","v":"Actual"},985.83333333333337,"",null,null,"Actual",2353522,2312209.6669635535,"",null,null,"Actual",2387.3426880811494,2345.4366866916857,"",""]
[null,null,"Historical",2019,null,{"$f":"$K$44","v":"Actual"},984.83333333333337,"",null,null,"Actual",2275484,2309173.3698624452,"",null,null,"Actual",2310.5269927229647,2344.7351868632036,"",""]
[null,null,"Bridge Year",{"$f":"D166-1","v":2020},null,{"$f":"$K$45","v":"Forecast"},1004.2915067757176,"",null,null,"Forecast",null,2031467.130700575,"",null,null,"Forecast",0,2022.7863294618605,"",""]
[null,null,"Test Year",{"$f":"TestYear","v":2021},null,{"$f":"$K$46","v":"Forecast"},1003.0900728461615,"",null,null,"Forecast",null,2267944.8710701508,"",null,null,"Forecast",0,2260.9583450817113,"",""]
[null,null,null,null,null,null,null,null,{"$f":"SUM(I159:I165)","v":0},null,null,null,null,null,{"$f":"SUM(O159:O165)","v":0},null,null,null,null,null,{"$f":"SUM(U159:U165)","v":0}]
[null,null,"Variance Analysis","Year",null,null,"Year-over-year",null,"Test Year Versus OEB-approved",null,"Year","Year-over-year",null,null,{"$f":"I168","v":"Test Year Versus OEB-approved"},null,"Year","Year-over-year",null,null,{"$f":"O168","v":"Test Year Versus OEB-approved"}]
[null,null,null,{"$f":"D159","v":2014},null,null,null,null,null,null,{"$f":"D169","v":2014},null,null,null,null,null,{"$f":"K169","v":2014}]
[null,null,null,2015,null,null,{"$f":"IF(G159=0,\"\",G160/G159-1)","v":6.32420743400397E-3},null,null,null,{"$f":"D170","v":2015},{"$f":"IF(L159=0,\"\",L160/L159-1)","v":3.1137277472748082E-4},2.3154701517960063E-3,null,null,null,{"$f":"K170","v":2015},{"$f":"IF(R159=\"\",\"\",IF(R159=0,\"\",R160/R159-1))","v":-5.9750472212213301E-3},-3.9835445203388886E-3]
[null,null,null,2016,null,null,6.325008108984731E-3,null,null,null,2016,{"$f":"IF(L160=0,\"\",L161/L160-1)","v":1.5350659197169492E-2},8.6181596725649623E-3,null,null,null,2016,{"$f":"IF(R160=\"\",\"\",IF(R160=0,\"\",R161/R160-1))","v":8.9689225801365957E-3},2.2787385239382285E-3]
[null,null,null,2017,null,null,-2.9492344883158883E-2,null,null,null,{"$f":"D172","v":2017},{"$f":"IF(L161=0,\"\",L162/L161-1)","v":-1.9316801518661331E-2},-2.6489116278580083E-2,null,null,null,{"$f":"K172","v":2017},{"$f":"IF(R161=\"\",\"\",IF(R161=0,\"\",R162/R161-1))","v":1.0484763629476479E-2},3.0944924429443521E-3]
[null,null,null,2018,null,null,-1.7768183327797948E-2,null,null,null,2018,{"$f":"IF(L162=0,\"\",L163/L162-1)","v":-4.4238952952224686E-3},-1.5997894478463226E-2,null,null,null,2018,{"$f":"IF(R162=\"\",\"\",IF(R162=0,\"\",R163/R162-1))","v":1.3585680901465613E-2},1.8023126712924942E-3]
[null,null,null,2019,null,null,-1.0143702451395065E-3,null,null,null,2019,{"$f":"IF(L163=0,\"\",L164/L163-1)","v":-3.3157964956350483E-2},-1.3131582072726244E-3,null,null,null,2019,{"$f":"IF(R163=\"\",\"\",IF(R163=0,\"\",R164/R163-1))","v":-3.2176233324896497E-2},-2.9909135150074651E-4]
[null,null,null,2020,null,null,1.9757833923558232E-2,null,null,null,2020,{"$f":"IF(K165=\"Forecast\",\"\",IF(L164=0,\"\",L165/L164-1))","v":""},{"$f":"IF(M164=0,\"\",M165/M164-1)","v":-0.12026218680081735},null,null,null,2020,{"$f":"IF(Q165=\"Forecast\",\"\",IF(R164=0,\"\",R165/R164-1))","v":""},{"$f":"IF(S164=\"\",\"\",IF(S164=0,\"\",S165/S164-1))","v":-0.1373071292677821}]
[null,null,null,2021,null,null,-1.196300000000261E-3,null,{"$f":"IF(I167=0,\"\",G166/I167-1)","v":""},null,2021,{"$f":"IF(K166=\"Forecast\",\"\",IF(L165=0,\"\",L166/L165-1))","v":""},{"$f":"IF(M165=0,\"\",M166/M165-1)","v":0.11640736726467416},null,{"$f":"IF(O167=0,\"\",M166/O167-1)","v":""},null,2021,{"$f":"IF(Q166=\"Forecast\",\"\",IF(R165=0,\"\",R166/R165-1))","v":""},{"$f":"IF(S165=\"\",\"\",IF(S165=0,\"\",S166/S165-1))","v":0.11774452503997979},null,{"$f":"IF(U167=0,\"\",S166/U167-1)","v":""}]
[null,null,null,"Geometric Mean",null,null,{"$f":"IF(G159=0,\"\",(G166/G159)^(1/($D166-$D159-1))-1)","v":-2.9790967089124987E-3},null,{"$f":"IF(I167=0,\"\",(G166/I167)^(1/(TestYear-RebaseYear-1))-1)","v":""},null,"Geometric Mean",{"$f":"IF(L159=0,\"\",(L164/L159)^(1/($D164-$D159-1))-1)","v":-1.0473347756643436E-2},{"$f":"IF(M159=0,\"\",(M166/M159)^(1/($D166-$D159-1))-1)","v":-8.5315715328000419E-3},null,{"$f":"IF(O167=0,\"\",(M166/O167)^(1/(TestYear-RebaseYear-1))-1)","v":""},null,"Geometric Mean",{"$f":"IF(R159=\"\",\"\",IF(R159=0,\"\",(R164/R159)^(1/($D164-$D159-1))-1))","v":-1.4601562860518946E-3},{"$f":"IF(S159=\"\",\"\",IF(S159=0,\"\",(S166/S159)^(1/($D166-$D159-1))-1))","v":-5.5690656089147916E-3},null,{"$f":"IF(U167=0,\"\",(S166/U167)^(1/(TestYear-RebaseYear-1))-1)","v":""}]
[]
[]
[null,null,null,"Calendar Year",null,"Revenues",null,null,null,null,{"$f":"IF(ISBLANK(Q155),\"\",CONCATENATE(\"Demand (\",Q155,\")\"))","v":"Demand (kW)"},null,null,null,null,null,{"$f":"CONCATENATE(\"Demand (\",Q155,\") per \",LEFT(F157,LEN(F157)-1))","v":"Demand (kW) per Customer"}]
[null,null,null,{"$f":"CONCATENATE(\"(for \",TestYear,\" Cost of Service\")","v":"(for 2021 Cost of Service"},null,null,null,null,null,null,null,"Actual (Weather actual)","Weather-normalized",null,{"$f":"M181","v":"Weather-normalized"},null,null,{"$f":"L181","v":"Actual (Weather actual)"},{"$f":"M181","v":"Weather-normalized"},null,{"$f":"O181","v":"Weather-normalized"}]
[null,null,"Historical",{"$f":"D183-1","v":2014},null,{"$f":"F159","v":"Actual"},7026525.9299999997,{"$f":"IF(D182=RebaseYear,\"OEB-approved\",\"\")","v":"OEB-approved"},null,null,{"$f":"K159","v":"Actual"},null,null,{"$f":"N159","v":"OEB-approved"},null,null,{"$f":"K182","v":"Actual"},{"$f":"IF(G182=0,\"\",L182/G182)","v":0},{"$f":"IF(G182=0,\"\",M182/G182)","v":0},{"$f":"N182","v":"OEB-approved"},{"$f":"IF(T182=\"\",\"\",IF(I182=0,\"\",O182/I182))","v":""}]
[null,null,"Historical",2015,null,"Actual",7098025.5999999996,{"$f":"IF(D183=RebaseYear,\"OEB-approved\",\"\")","v":""}]
[null,null,"Historical",2016,null,"Actual",7448485.9100000001,{"$f":"IF(D184=RebaseYear,\"OEB-approved\",\"\")","v":""},null,null,{"$f":"K161","v":"Actual"},null,null,{"$f":"N161","v":""},null,null,{"$f":"K184","v":"Actual"},{"$f":"IF(G184=0,\"\",L184/G184)","v":0},{"$f":"IF(G184=0,\"\",M184/G184)","v":0},{"$f":"N184","v":""},{"$f":"IF(T184=\"\",\"\",IF(I184=0,\"\",O184/I184))","v":""}]
[null,null,"Historical",2017,null,"Actual",7450542.4499999993,"",null,null,"Actual",null,null,"",null,null,"Actual",0,0,"",""]
[null,null,"Historical",2018,null,"Actual",7552404.0099999998,"",null,null,"Actual",null,null,"",null,null,"Actual",0,0,"",""]
[null,null,"Historical",2019,null,"Actual",7470865.3999999994,"",null,null,"Actual",null,null,"",null,null,"Actual",0,0,"",""]
[null,null,"Bridge Year (Forecast)",2020,null,"Forecast",6584976.1303595584,"",null,null,"Forecast",null,null,"",null,null,"Forecast",0,0,"",""]
[null,null,"Test Year (Forecast)",{"$f":"TestYear","v":2021},null,"Forecast",8136334.9494126271,"",null,null,"Forecast",null,null,"",null,null,"Forecast",0,0,"",""]
[null,null,null,null,null,null,null,null,{"$f":"SUM(I182:I188)","v":0},null,null,null,null,null,{"$f":"SUM(O182:O188)","v":0},null,null,null,null,null,{"$f":"SUM(U182:U188)","v":0}]
[null,null,"Variance Analysis","Year",null,null,"Year-over-year",null,{"$f":"I168","v":"Test Year Versus OEB-approved"},null,"Year","Year-over-year",null,null,{"$f":"I191","v":"Test Year Versus OEB-approved"},null,"Year","Year-over-year",null,null,{"$f":"O191","v":"Test Year Versus OEB-approved"}]
[null,null,null,{"$f":"D182","v":2014},null,null,null,null,null,null,{"$f":"D192","v":2014},null,null,null,null,null,{"$f":"K192","v":2014}]
[null,null,null,2015,null,null,{"$f":"IF(G182=0,\"\",G183/G182-1)","v":1.0175678665715893E-2}]
[null,null,null,2016,null,null,4.9374337280496672E-2,null,null,null,{"$f":"D194","v":2016},{"$f":"IF(L182=0,\"\",L184/L182-1)","v":""},"",null,null,null,{"$f":"K194","v":2016},{"$f":"IF(R182=\"\",\"\",IF(R182=0,\"\",R184/R182-1))","v":""},{"$f":"IF(S182=\"\",\"\",IF(S182=0,\"\",S184/S182-1))","v":""}]
[null,null,null,2017,null,null,2.7610175072467769E-4,null,null,null,2017,{"$f":"IF(L184=0,\"\",L185/L184-1)","v":""},"",null,null,null,2017,{"$f":"IF(R184=\"\",\"\",IF(R184=0,\"\",R185/R184-1))","v":""},""]
[null,null,null,2018,null,null,1.3671697152735529E-2,null,null,null,2018,{"$f":"IF(L185=0,\"\",L186/L185-1)","v":""},"",null,null,null,2018,{"$f":"IF(R185=\"\",\"\",IF(R185=0,\"\",R186/R185-1))","v":""},""]
[null,null,null,2019,null,null,-1.079637819852286E-2,null,null,null,2019,{"$f":"IF(L186=0,\"\",L187/L186-1)","v":""},"",null,null,null,2019,{"$f":"IF(R186=\"\",\"\",IF(R186=0,\"\",R187/R186-1))","v":""},""]
[null,null,null,2020,null,null,-0.11857920364091168,null,null,null,2020,{"$f":"IF(K188=\"Forecast\",\"\",IF(L187=0,\"\",L188/L187-1))","v":""},{"$f":"IF(M187=0,\"\",M188/M187-1)","v":""},null,null,null,2020,{"$f":"IF(Q188=\"Forecast\",\"\",IF(R187=0,\"\",R188/R187-1))","v":""},{"$f":"IF(S187=\"\",\"\",IF(S187=0,\"\",S188/S187-1))","v":""}]
[null,null,null,2021,null,null,0.23559065186290362,null,{"$f":"IF(I190=0,\"\",G189/I190-1)","v":""},null,2021,{"$f":"IF(K189=\"Forecast\",\"\",IF(L188=0,\"\",L189/L188-1))","v":""},{"$f":"IF(M188=0,\"\",M189/M188-1)","v":""},null,{"$f":"IF(O190=0,\"\",M189/O190-1)","v":""},null,2021,{"$f":"IF(Q189=\"Forecast\",\"\",IF(R188=0,\"\",R189/R188-1))","v":""},{"$f":"IF(S188=\"\",\"\",IF(S188=0,\"\",S189/S188-1))","v":""},null,{"$f":"IF(U190=0,\"\",S189/U190-1)","v":""}]
[null,null,null,"Geometric Mean",null,null,{"$f":"IF(G182=0,\"\",(G189/G182)^(1/($D189-$D182-1))-1)","v":2.4742372203518048E-2},null,{"$f":"IF(I190=0,\"\",(G189/I190)^(1/(TestYear-RebaseYear-1))-1)","v":""},null,"Geometric Mean",{"$f":"IF(L182=0,\"\",(L187/L182)^(1/($D187-$D182-1))-1)","v":""},{"$f":"IF(M182=0,\"\",(M189/M182)^(1/($D189-$D182-1))-1)","v":""},null,{"$f":"IF(O190=0,\"\",(M189/O190)^(1/(TestYear-RebaseYear-1))-1)","v":""},null,"Geometric Mean",{"$f":"IF(R182=\"\",\"\",IF(R182=0,\"\",(R187/R182)^(1/($D187-$D182-1))-1))","v":""},{"$f":"IF(S182=\"\",\"\",IF(S182=0,\"\",(S189/S182)^(1/($D189-$D182-1))-1))","v":""},null,{"$f":"IF(U190=0,\"\",(S189/U190)^(1/(TestYear-RebaseYear-1))-1)","v":""}]
[]
[null,4,"Customer Class:","Street Light (kW)",null,null,null,null,null,null,"Is the customer class billed on consumption (kWh) or demand (kW or kVA)?",null,null,null,null,null,"kW"]
[]
[null,null,null,"Calendar Year",null,"Customers",null,null,null,null,"Demand (kW) (3)",null,null,null,null,null,{"$f":"CONCATENATE(\"Demand (kW) per \",LEFT(F204,LEN(F204)-1))","v":"Demand (kW) per Customer"}]
[null,null,null,{"$f":"CONCATENATE(\"(for \",TestYear,\" Cost of Service\")","v":"(for 2021 Cost of Service"},null,null,null,null,null,null,null,"Actual (Weather actual)","Weather-normalized",null,"Weather-normalized",null,null,{"$f":"L205","v":"Actual (Weather actual)"},{"$f":"M205","v":"Weather-normalized"},null,{"$f":"O205","v":"Weather-normalized"}]
[null,null,"Historical",{"$f":"D207-1","v":2014},null,{"$f":"$K$42","v":"Actual"},15170.75,{"$f":"IF(D206=RebaseYear,\"OEB-approved\",\"\")","v":"OEB-approved"},null,null,{"$f":"F206","v":"Actual"},27636,27636,{"$f":"H206","v":"OEB-approved"},null,null,{"$f":"K206","v":"Actual"},{"$f":"IF(G206=0,\"\",L206/G206)","v":1.8216633983158381},{"$f":"IF(G206=0,\"\",M206/G206)","v":1.8216633983158381},{"$f":"N206","v":"OEB-approved"},{"$f":"IF(T206=\"\",\"\",IF(I206=0,\"\",O206/I206))","v":""}]
[null,null,"Historical",2015,null,{"$f":"$K$43","v":"Actual"},15228.583333333334,"",null,null,"Actual",27661,27661,"",null,null,"Actual",1.8163869477900658,1.8163869477900658,"",""]
[null,null,"Historical",2016,null,{"$f":"$K$41","v":"Actual"},15252.666666666666,{"$f":"IF(D208=RebaseYear,\"OEB-approved\",\"\")","v":""},null,null,{"$f":"F208","v":"Actual"},27648,27648,{"$f":"H208","v":""},null,null,{"$f":"K208","v":"Actual"},{"$f":"IF(G208=0,\"\",L208/G208)","v":1.8126666375278639},{"$f":"IF(G208=0,\"\",M208/G208)","v":1.8126666375278639},{"$f":"N208","v":""},{"$f":"IF(T208=\"\",\"\",IF(I208=0,\"\",O208/I208))","v":""}]
[null,null,"Historical",2017,null,{"$f":"$K$42","v":"Actual"},17184,"",null,null,"Actual",30451.800000000003,30451.800000000003,{"$f":"H209","v":""},null,null,"Actual",1.7721019553072628,1.7721019553072628,{"$f":"N209","v":""},{"$f":"IF(T209=\"\",\"\",IF(I209=0,\"\",O209/I209))","v":""}]
[null,null,"Historical",2018,null,{"$f":"$K$43","v":"Actual"},17184,"",null,null,"Actual",18200.899999999998,18200.899999999998,"",null,null,"Actual",1.0591771415270017,1.0591771415270017,"",""]
[null,null,"Historical",2019,null,{"$f":"$K$44","v":"Actual"},17184,"",null,null,"Actual",15445.800000000001,15445.800000000001,"",null,null,"Actual",0.8988477653631286,0.8988477653631286,"",""]
[null,null,"Bridge Year",{"$f":"D213-1","v":2020},null,{"$f":"$K$45","v":"Forecast"},17196.600593685107,"",null,null,"Forecast",null,15448,"",null,null,"Forecast",0,0.89831707818304374,"",""]
[null,null,"Test Year",{"$f":"TestYear","v":2021},null,{"$f":"$K$46","v":"Forecast"},17283.271460677272,"",null,null,"Forecast",null,15528,"",null,null,"Forecast",0,0.89844101768170181,"",""]
[null,null,null,null,null,null,null,null,{"$f":"SUM(I206:I212)","v":0},null,null,null,null,null,{"$f":"SUM(O206:O212)","v":0},null,null,null,null,null,{"$f":"SUM(U206:U212)","v":0}]
[null,null,"Variance Analysis","Year",null,null,"Year-over-year",null,"Test Year Versus OEB-approved",null,"Year","Year-over-year",null,null,{"$f":"I215","v":"Test Year Versus OEB-approved"},null,"Year","Year-over-year",null,null,{"$f":"O215","v":"Test Year Versus OEB-approved"}]
[null,null,null,{"$f":"D206","v":2014},null,null,null,null,null,null,{"$f":"D216","v":2014},null,null,null,null,null,{"$f":"K216","v":2014}]
[null,null,null,{"$f":"D207","v":2015},null,null,{"$f":"IF(G206=0,\"\",G207/G206-1)","v":3.8121604622931571E-3},null,null,null,{"$f":"D217","v":2015},{"$f":"IF(L206=0,\"\",L207/L206-1)","v":9.0461716601542008E-4},9.0461716601542008E-4,null,null,null,{"$f":"K217","v":2015},{"$f":"IF(R206=\"\",\"\",IF(R206=0,\"\",R207/R206-1))","v":-2.8965013682826779E-3},-2.8965013682826779E-3]
[null,null,null,2016,null,null,1.581455924440256E-3,null,null,null,2016,{"$f":"IF(L207=0,\"\",L208/L207-1)","v":-4.6997577817142755E-4},-4.6997577817142755E-4,null,null,null,2016,{"$f":"IF(R207=\"\",\"\",IF(R207=0,\"\",R208/R207-1))","v":-2.048192576327601E-3},-2.048192576327601E-3]
[null,null,null,{"$f":"D209","v":2017},null,null,{"$f":"IF(G208=0,\"\",G209/G208-1)","v":0.12662266707461001},null,null,null,{"$f":"D219","v":2017},{"$f":"IF(L208=0,\"\",L209/L208-1)","v":0.10141059027777799},0.10141059027777799,null,null,null,{"$f":"K219","v":2017},{"$f":"IF(R208=\"\",\"\",IF(R208=0,\"\",R209/R208-1))","v":-2.2378456899236454E-2},-2.2378456899236454E-2]
[null,null,null,{"$f":"D210","v":2018},null,null,{"$f":"IF(G209=0,\"\",G210/G209-1)","v":0},null,null,null,2018,{"$f":"IF(L209=0,\"\",L210/L209-1)","v":-0.40230462567073222},-0.40230462567073222,null,null,null,2018,{"$f":"IF(R209=\"\",\"\",IF(R209=0,\"\",R210/R209-1))","v":-0.40230462567073222},-0.40230462567073222]
[null,null,null,{"$f":"D211","v":2019},null,null,{"$f":"IF(G210=0,\"\",G211/G210-1)","v":0},null,null,null,2019,{"$f":"IF(L210=0,\"\",L211/L210-1)","v":-0.15137163546857557},-0.15137163546857557,null,null,null,2019,{"$f":"IF(R210=\"\",\"\",IF(R210=0,\"\",R211/R210-1))","v":-0.15137163546857546},-0.15137163546857546]
[null,null,null,{"$f":"D212","v":2020},null,null,{"$f":"IF(G211=0,\"\",G212/G211-1)","v":7.3327477217799419E-4},null,null,null,2020,{"$f":"IF(K212=\"Forecast\",\"\",IF(L211=0,\"\",L212/L211-1))","v":""},{"$f":"IF(M211=0,\"\",M212/M211-1)","v":1.4243354180409895E-4},null,null,null,2020,{"$f":"IF(Q212=\"Forecast\",\"\",IF(R211=0,\"\",R212/R211-1))","v":""},{"$f":"IF(S211=\"\",\"\",IF(S211=0,\"\",S212/S211-1))","v":-5.9040829886303214E-4}]
[null,null,null,{"$f":"D213","v":2021},null,null,{"$f":"IF(G212=0,\"\",G213/G212-1)","v":5.0399999999994893E-3},null,{"$f":"IF(I214=0,\"\",G213/I214-1)","v":""},null,2021,{"$f":"IF(K213=\"Forecast\",\"\",IF(L212=0,\"\",L213/L212-1))","v":""},{"$f":"IF(M212=0,\"\",M213/M212-1)","v":5.1786639047126659E-3},null,{"$f":"IF(O214=0,\"\",M213/O214-1)","v":""},null,2021,{"$f":"IF(Q213=\"Forecast\",\"\",IF(R212=0,\"\",R213/R212-1))","v":""},{"$f":"IF(S212=\"\",\"\",IF(S212=0,\"\",S213/S212-1))","v":1.3796854325498487E-4},null,{"$f":"IF(U214=0,\"\",S213/U214-1)","v":""}]
[null,null,null,"Geometric Mean",null,null,{"$f":"IF(G206=0,\"\",(G213/G206)^(1/($D213-$D206-1))-1)","v":2.1966084400428798E-2},null,{"$f":"IF(I214=0,\"\",(G213/I214)^(1/(TestYear-RebaseYear-1))-1)","v":""},null,"Geometric Mean",{"$f":"IF(L206=0,\"\",(L211/L206)^(1/($D211-$D206-1))-1)","v":-0.13536302067898243},{"$f":"IF(M206=0,\"\",(M213/M206)^(1/($D213-$D206-1))-1)","v":-9.160781406186469E-2},null,{"$f":"IF(O214=0,\"\",(M213/O214)^(1/(TestYear-RebaseYear-1))-1)","v":""},null,"Geometric Mean",{"$f":"IF(R206=\"\",\"\",IF(R206=0,\"\",(R211/R206)^(1/($D211-$D206-1))-1))","v":-0.1618832839067712},{"$f":"IF(S206=\"\",\"\",IF(S206=0,\"\",(S213/S206)^(1/($D213-$D206-1))-1))","v":-0.11113274715855714},null,{"$f":"IF(U214=0,\"\",(S213/U214)^(1/(TestYear-RebaseYear-1))-1)","v":""}]
[]
[]
[null,null,null,"Calendar Year",null,"Revenues",null,null,null,null,{"$f":"IF(ISBLANK(Q202),\"\",CONCATENATE(\"Demand (\",Q202,\")\"))","v":"Demand (kW)"},null,null,null,null,null,{"$f":"CONCATENATE(\"Demand (\",Q202,\") per \",LEFT(F204,LEN(F204)-1))","v":"Demand (kW) per Customer"}]
[null,null,null,{"$f":"CONCATENATE(\"(for \",TestYear,\" Cost of Service\")","v":"(for 2021 Cost of Service"},null,null,null,null,null,null,null,"Actual (Weather actual)","Weather-normalized",null,{"$f":"M228","v":"Weather-normalized"},null,null,{"$f":"L228","v":"Actual (Weather actual)"},{"$f":"M228","v":"Weather-normalized"},null,{"$f":"O228","v":"Weather-normalized"}]
[null,null,"Historical",{"$f":"D230-1","v":2014},null,{"$f":"F206","v":"Actual"},226482.52000000002,{"$f":"IF(D229=RebaseYear,\"OEB-approved\",\"\")","v":"OEB-approved"},null,null,{"$f":"K206","v":"Actual"},null,null,{"$f":"N206","v":"OEB-approved"},null,null,{"$f":"K229","v":"Actual"},{"$f":"IF(G229=0,\"\",L229/G229)","v":0},{"$f":"IF(G229=0,\"\",M229/G229)","v":0},{"$f":"N229","v":"OEB-approved"},{"$f":"IF(T229=\"\",\"\",IF(I229=0,\"\",O229/I229))","v":""}]
[null,null,"Historical",2015,null,"Actual",229170.75,""]
[null,null,"Historical",2016,null,"Actual",232469.41,{"$f":"IF(D231=RebaseYear,\"OEB-approved\",\"\")","v":""},null,null,{"$f":"K208","v":"Actual"},null,null,{"$f":"N208","v":""},null,null,{"$f":"K231","v":"Actual"},{"$f":"IF(G231=0,\"\",L231/G231)","v":0},{"$f":"IF(G231=0,\"\",M231/G231)","v":0},{"$f":"N231","v":""},{"$f":"IF(T231=\"\",\"\",IF(I231=0,\"\",O231/I231))","v":""}]
[null,null,"Historical",2017,null,"Actual",236634.58,"",null,null,"Actual",null,null,"",null,null,"Actual",0,0,"",""]
[null,null,"Historical",2018,null,"Actual",251190.52000000002,"",null,null,"Actual",null,null,"",null,null,"Actual",0,0,"",""]
[null,null,"Historical",2019,null,"Actual",230883.94,"",null,null,"Actual",null,null,"",null,null,"Actual",0,0,"",""]
[null,null,"Bridge Year (Forecast)",2020,null,"Forecast",206748.65007353859,"",null,null,"Forecast",null,null,"",null,null,"Forecast",0,0,"",""]
[null,null,"Test Year (Forecast)",{"$f":"TestYear","v":2021},null,"Forecast",187909.5576841039,"",null,null,"Forecast","v",null,"",null,null,"Forecast",{"$error":"#VALUE!"},0,"",""]
[null,null,null,null,null,null,null,null,{"$f":"SUM(I229:I235)","v":0},null,null,null,null,null,{"$f":"SUM(O229:O235)","v":0},null,null,null,null,null,{"$f":"SUM(U229:U235)","v":0}]
[null,null,"Variance Analysis","Year",null,null,"Year-over-year",null,{"$f":"I215","v":"Test Year Versus OEB-approved"},null,"Year","Year-over-year",null,null,{"$f":"I238","v":"Test Year Versus OEB-approved"},null,"Year","Year-over-year",null,null,{"$f":"O238","v":"Test Year Versus OEB-approved"}]
[null,null,null,{"$f":"D229","v":2014},null,null,null,null,null,null,{"$f":"D239","v":2014},null,null,null,null,null,{"$f":"K239","v":2014}]
[null,null,null,2015,null,null,{"$f":"IF(G229=0,\"\",G230/G229-1)","v":1.1869481141414173E-2}]
[null,null,null,2016,null,null,{"$f":"IF(G229=0,\"\",G231/G229-1)","v":2.6434225475767237E-2},null,null,null,{"$f":"D241","v":2016},{"$f":"IF(L229=0,\"\",L231/L229-1)","v":""},"",null,null,null,{"$f":"K241","v":2016},{"$f":"IF(R229=\"\",\"\",IF(R229=0,\"\",R231/R229-1))","v":""},{"$f":"IF(S229=\"\",\"\",IF(S229=0,\"\",S231/S229-1))","v":""}]
[null,null,null,2017,null,null,{"$f":"IF(G231=0,\"\",G232/G231-1)","v":1.7917067024000977E-2},null,null,null,2017,{"$f":"IF(L231=0,\"\",L232/L231-1)","v":""},"",null,null,null,2017,{"$f":"IF(R231=\"\",\"\",IF(R231=0,\"\",R232/R231-1))","v":""},""]
[null,null,null,2018,null,null,{"$f":"IF(G232=0,\"\",G233/G232-1)","v":6.1512311514234419E-2},null,null,null,2018,{"$f":"IF(L232=0,\"\",L233/L232-1)","v":""},"",null,null,null,2018,{"$f":"IF(R232=\"\",\"\",IF(R232=0,\"\",R233/R232-1))","v":""},""]
[null,null,null,2019,null,null,{"$f":"IF(G233=0,\"\",G234/G233-1)","v":-8.0841347038096867E-2},null,null,null,2019,{"$f":"IF(L233=0,\"\",L234/L233-1)","v":""},"",null,null,null,2019,{"$f":"IF(R233=\"\",\"\",IF(R233=0,\"\",R234/R233-1))","v":""},""]
[null,null,null,2020,null,null,{"$f":"IF(G234=0,\"\",G235/G234-1)","v":-0.10453429513746781},null,null,null,2020,{"$f":"IF(K235=\"Forecast\",\"\",IF(L234=0,\"\",L235/L234-1))","v":""},{"$f":"IF(M234=0,\"\",M235/M234-1)","v":""},null,null,null,2020,{"$f":"IF(Q235=\"Forecast\",\"\",IF(R234=0,\"\",R235/R234-1))","v":""},{"$f":"IF(S234=\"\",\"\",IF(S234=0,\"\",S235/S234-1))","v":""}]
[null,null,null,2021,null,null,{"$f":"IF(G235=0,\"\",G236/G235-1)","v":-9.1120751611842743E-2},null,{"$f":"IF(I237=0,\"\",G236/I237-1)","v":""},null,2021,{"$f":"IF(K236=\"Forecast\",\"\",IF(L235=0,\"\",L236/L235-1))","v":""},{"$f":"IF(M235=0,\"\",M236/M235-1)","v":""},null,{"$f":"IF(O237=0,\"\",M236/O237-1)","v":""},null,2021,{"$f":"IF(Q236=\"Forecast\",\"\",IF(R235=0,\"\",R236/R235-1))","v":""},{"$f":"IF(S235=\"\",\"\",IF(S235=0,\"\",S236/S235-1))","v":""},null,{"$f":"IF(U237=0,\"\",S236/U237-1)","v":""}]
[null,null,null,"Geometric Mean",null,null,{"$f":"IF(G229=0,\"\",(G236/G229)^(1/($D236-$D229-1))-1)","v":-3.0638656186856461E-2},null,{"$f":"IF(I237=0,\"\",(G236/I237)^(1/(TestYear-RebaseYear-1))-1)","v":""},null,"Geometric Mean",{"$f":"IF(L229=0,\"\",(L234/L229)^(1/($D234-$D229-1))-1)","v":""},{"$f":"IF(M229=0,\"\",(M236/M229)^(1/($D236-$D229-1))-1)","v":""},null,{"$f":"IF(O237=0,\"\",(M236/O237)^(1/(TestYear-RebaseYear-1))-1)","v":""},null,"Geometric Mean",{"$f":"IF(R229=\"\",\"\",IF(R229=0,\"\",(R234/R229)^(1/($D234-$D229-1))-1))","v":""},{"$f":"IF(S229=\"\",\"\",IF(S229=0,\"\",(S236/S229)^(1/($D236-$D229-1))-1))","v":""},null,{"$f":"IF(U237=0,\"\",(S236/U237)^(1/(TestYear-RebaseYear-1))-1)","v":""}]
[]
[null,5,"Customer Class:","USL",null,null,null,null,null,null,"Is the customer class billed on consumption (kWh) or demand (kW or kVA)?",null,null,null,null,null,"kWh"]
[]
[null,null,null,"Calendar Year",null,"Customers",null,null,null,null,"Consumption (kWh) (3)",null,null,null,null,null,{"$f":"CONCATENATE(\"Consumption (kWh) per \",LEFT(F251,LEN(F251)-1))","v":"Consumption (kWh) per Customer"}]
[null,null,null,{"$f":"CONCATENATE(\"(for \",TestYear,\" Cost of Service\")","v":"(for 2021 Cost of Service"},null,null,null,null,null,null,null,"Actual (Weather actual)","Weather-normalized",null,"Weather-normalized",null,null,{"$f":"L252","v":"Actual (Weather actual)"},{"$f":"M252","v":"Weather-normalized"},null,{"$f":"O252","v":"Weather-normalized"}]
[null,null,"Historical",{"$f":"D254-1","v":2014},null,{"$f":"$K$41","v":"Actual"},559,{"$f":"IF(D253=RebaseYear,\"OEB-approved\",\"\")","v":"OEB-approved"},null,null,{"$f":"F253","v":"Actual"},3098633,3098633,{"$f":"H253","v":"OEB-approved"},null,null,{"$f":"K253","v":"Actual"},{"$f":"IF(G253=0,\"\",L253/G253)","v":5543.1717352415026},{"$f":"IF(G253=0,\"\",M253/G253)","v":5543.1717352415026},{"$f":"N253","v":"OEB-approved"},{"$f":"IF(T253=\"\",\"\",IF(I253=0,\"\",O253/I253))","v":""}]
[null,null,"Historical",2015,null,{"$f":"$K$42","v":"Actual"},556.75,"",null,null,"Actual",3110148,3110148,{"$f":"H254","v":""},null,null,"Actual",5586.2559497081274,5586.2559497081274,{"$f":"N254","v":""},{"$f":"IF(T254=\"\",\"\",IF(I254=0,\"\",O254/I254))","v":""}]
[null,null,"Historical",2016,null,{"$f":"$K$41","v":"Actual"},559.08333333333337,{"$f":"IF(D255=RebaseYear,\"OEB-approved\",\"\")","v":""},null,null,{"$f":"F255","v":"Actual"},3115033,3115033,{"$f":"H255","v":""},null,null,{"$f":"K255","v":"Actual"},{"$f":"IF(G255=0,\"\",L255/G255)","v":5571.6792368460274},{"$f":"IF(G255=0,\"\",M255/G255)","v":5571.6792368460274},{"$f":"N255","v":""},{"$f":"IF(T255=\"\",\"\",IF(I255=0,\"\",O255/I255))","v":""}]
[null,null,"Historical",2017,null,{"$f":"$K$42","v":"Actual"},561.91666666666663,"",null,null,"Actual",3130244,3130244,{"$f":"H256","v":""},null,null,"Actual",5570.6551979830938,5570.6551979830938,{"$f":"N256","v":""},{"$f":"IF(T256=\"\",\"\",IF(I256=0,\"\",O256/I256))","v":""}]
[null,null,"Historical",2018,null,{"$f":"$K$43","v":"Actual"},563.33333333333337,"",null,null,"Actual",3138478,3138478,"",null,null,"Actual",5571.2627218934904,5571.2627218934904,"",""]
[null,null,"Historical",2019,null,{"$f":"$K$44","v":"Actual"},561.5,"",null,null,"Actual",3144191,3144191,"",null,null,"Actual",5599.6277827248441,5599.6277827248441,"",""]
[null,null,"Bridge Year",{"$f":"D260-1","v":2020},null,{"$f":"$K$45","v":"Forecast"},558.67964797739762,"",null,null,"Forecast",null,3128398.0784571716,"",null,null,"Forecast",0,5599.6277827248441,"",""]
[null,null,"Test Year",{"$f":"TestYear","v":2021},null,{"$f":"$K$46","v":"Forecast"},554.21021079357854,"",null,null,"Forecast",null,3103370.8938295147,"",null,null,"Forecast",0,5599.6277827248441,"",""]
[null,null,null,null,null,null,null,null,{"$f":"SUM(I253:I259)","v":0},null,null,null,null,null,{"$f":"SUM(O253:O259)","v":0},null,null,null,null,null,{"$f":"SUM(U253:U259)","v":0}]
[null,null,"Variance Analysis","Year",null,null,"Year-over-year",null,"Test Year Versus OEB-approved",null,"Year","Year-over-year",null,null,{"$f":"I262","v":"Test Year Versus OEB-approved"},null,"Year","Year-over-year",null,null,{"$f":"O262","v":"Test Year Versus OEB-approved"}]
[null,null,null,{"$f":"D253","v":2014},null,null,null,null,null,null,{"$f":"D263","v":2014},null,null,null,null,null,{"$f":"K263","v":2014}]
[null,null,null,2015,null,null,{"$f":"IF(G253=0,\"\",G254/G253-1)","v":-4.0250447227191399E-3},null,null,null,{"$f":"D264","v":2015},{"$f":"IF(L253=0,\"\",L254/L253-1)","v":3.7161548334379013E-3},3.7161548334379013E-3,null,null,null,{"$f":"K264","v":2015},{"$f":"IF(R253=\"\",\"\",IF(R253=0,\"\",R254/R253-1))","v":7.7724841524773325E-3},7.7724841524773325E-3]
[null,null,null,2016,null,null,4.1909893728484526E-3,null,null,null,2016,{"$f":"IF(L254=0,\"\",L255/L254-1)","v":1.5706648043758431E-3},1.5706648043758431E-3,null,null,null,2016,{"$f":"IF(R254=\"\",\"\",IF(R254=0,\"\",R255/R254-1))","v":-2.6093886483775641E-3},-2.6093886483775641E-3]
[null,null,null,2017,null,null,5.0678193471453969E-3,null,null,null,{"$f":"D266","v":2017},{"$f":"IF(L255=0,\"\",L256/L255-1)","v":4.8830943364002177E-3},4.8830943364002177E-3,null,null,null,{"$f":"K266","v":2017},{"$f":"IF(R255=\"\",\"\",IF(R255=0,\"\",R256/R255-1))","v":-1.8379357809428232E-4},-1.8379357809428232E-4]
[null,null,null,2018,null,null,2.52113302684287E-3,null,null,null,2018,{"$f":"IF(L256=0,\"\",L257/L256-1)","v":2.6304658678364401E-3},2.6304658678364401E-3,null,null,null,2018,{"$f":"IF(R256=\"\",\"\",IF(R256=0,\"\",R257/R256-1))","v":1.0905789154147527E-4},1.0905789154147527E-4]
[null,null,null,2019,null,null,-3.2544378698226017E-3,null,null,null,2019,{"$f":"IF(L257=0,\"\",L258/L257-1)","v":1.8203090797515031E-3},1.8203090797515031E-3,null,null,null,2019,{"$f":"IF(R257=\"\",\"\",IF(R257=0,\"\",R258/R257-1))","v":5.0913163222203739E-3},5.0913163222203739E-3]
[null,null,null,2020,null,null,-5.0228887312597781E-3,null,null,null,2020,{"$f":"IF(K259=\"Forecast\",\"\",IF(L258=0,\"\",L259/L258-1))","v":""},{"$f":"IF(M258=0,\"\",M259/M258-1)","v":-5.0228887312597781E-3},null,null,null,2020,{"$f":"IF(Q259=\"Forecast\",\"\",IF(R258=0,\"\",R259/R258-1))","v":""},{"$f":"IF(S258=\"\",\"\",IF(S258=0,\"\",S259/S258-1))","v":0}]
[null,null,null,2021,null,null,-7.9999999999997851E-3,null,{"$f":"IF(I261=0,\"\",G260/I261-1)","v":""},null,2021,{"$f":"IF(K260=\"Forecast\",\"\",IF(L259=0,\"\",L260/L259-1))","v":""},{"$f":"IF(M259=0,\"\",M260/M259-1)","v":-7.9999999999997851E-3},null,{"$f":"IF(O261=0,\"\",M260/O261-1)","v":""},null,2021,{"$f":"IF(Q260=\"Forecast\",\"\",IF(R259=0,\"\",R260/R259-1))","v":""},{"$f":"IF(S259=\"\",\"\",IF(S259=0,\"\",S260/S259-1))","v":0},null,{"$f":"IF(U261=0,\"\",S260/U261-1)","v":""}]
[null,null,null,"Geometric Mean",null,null,{"$f":"IF(G253=0,\"\",(G260/G253)^(1/($D260-$D253-1))-1)","v":-1.4332080602963426E-3},null,{"$f":"IF(I261=0,\"\",(G260/I261)^(1/(TestYear-RebaseYear-1))-1)","v":""},null,"Geometric Mean",{"$f":"IF(L253=0,\"\",(L258/L253)^(1/($D258-$D253-1))-1)","v":3.6555595349354597E-3},{"$f":"IF(M253=0,\"\",(M260/M253)^(1/($D260-$D253-1))-1)","v":2.5467564569403578E-4},null,{"$f":"IF(O261=0,\"\",(M260/O261)^(1/(TestYear-RebaseYear-1))-1)","v":""},null,"Geometric Mean",{"$f":"IF(R253=\"\",\"\",IF(R253=0,\"\",(R258/R253)^(1/($D258-$D253-1))-1))","v":2.5365305239133384E-3},{"$f":"IF(S253=\"\",\"\",IF(S253=0,\"\",(S260/S253)^(1/($D260-$D253-1))-1))","v":1.6903062665558632E-3},null,{"$f":"IF(U261=0,\"\",(S260/U261)^(1/(TestYear-RebaseYear-1))-1)","v":""}]
[]
[]
[null,null,null,"Calendar Year",null,"Revenues",null,null,null,null,{"$f":"IF(ISBLANK(Q249),\"\",CONCATENATE(\"Demand (\",Q249,\")\"))","v":"Demand (kWh)"},null,null,null,null,null,{"$f":"CONCATENATE(\"Demand (\",Q249,\") per \",LEFT(F251,LEN(F251)-1))","v":"Demand (kWh) per Customer"}]
[null,null,null,{"$f":"CONCATENATE(\"(for \",TestYear,\" Cost of Service\")","v":"(for 2021 Cost of Service"},null,null,null,null,null,null,null,"Actual (Weather actual)","Weather-normalized",null,{"$f":"M275","v":"Weather-normalized"},null,null,{"$f":"L275","v":"Actual (Weather actual)"},{"$f":"M275","v":"Weather-normalized"},null,{"$f":"O275","v":"Weather-normalized"}]
[null,null,"Historical",{"$f":"D277-1","v":2014},null,{"$f":"F253","v":"Actual"},113021.14,{"$f":"IF(D276=RebaseYear,\"OEB-approved\",\"\")","v":"OEB-approved"},null,null,{"$f":"K253","v":"Actual"},null,null,{"$f":"N253","v":"OEB-approved"},null,null,{"$f":"K276","v":"Actual"},{"$f":"IF(G276=0,\"\",L276/G276)","v":0},{"$f":"IF(G276=0,\"\",M276/G276)","v":0},{"$f":"N276","v":"OEB-approved"},{"$f":"IF(T276=\"\",\"\",IF(I276=0,\"\",O276/I276))","v":""}]
[null,null,"Historical",2015,null,"Actual",109588.3,""]
[null,null,"Historical",2016,null,"Actual",111567.38,{"$f":"IF(D278=RebaseYear,\"OEB-approved\",\"\")","v":""},null,null,{"$f":"K255","v":"Actual"},null,null,{"$f":"N255","v":""},null,null,{"$f":"K278","v":"Actual"},{"$f":"IF(G278=0,\"\",L278/G278)","v":0},{"$f":"IF(G278=0,\"\",M278/G278)","v":0},{"$f":"N278","v":""},{"$f":"IF(T278=\"\",\"\",IF(I278=0,\"\",O278/I278))","v":""}]
[null,null,"Historical",2017,null,"Actual",114258.58,"",null,null,"Actual",null,null,"",null,null,"Actual",0,0,"",""]
[null,null,"Historical",2018,null,"Actual",106831.66,"",null,null,"Actual",null,null,"",null,null,"Actual",0,0,"",""]
[null,null,"Historical",2019,null,"Actual",116159.43,"",null,null,"Actual",null,null,"",null,null,"Actual",0,0,"",""]
[null,null,"Bridge Year (Forecast)",2020,null,"Forecast",118101.36322376714,"",null,null,"Forecast",null,null,"",null,null,"Forecast",0,0,"",""]
[null,null,"Test Year (Forecast)",{"$f":"TestYear","v":2021},null,"Forecast",118412.11942386275,"",null,null,"Forecast",null,null,"",null,null,"Forecast",0,0,"",""]
[null,null,null,null,null,null,null,null,{"$f":"SUM(I276:I282)","v":0},null,null,null,null,null,{"$f":"SUM(O276:O282)","v":0},null,null,null,null,null,{"$f":"SUM(U276:U282)","v":0}]
[null,null,"Variance Analysis","Year",null,null,"Year-over-year",null,{"$f":"I262","v":"Test Year Versus OEB-approved"},null,"Year","Year-over-year",null,null,{"$f":"I285","v":"Test Year Versus OEB-approved"},null,"Year","Year-over-year",null,null,{"$f":"O285","v":"Test Year Versus OEB-approved"}]
[null,null,null,{"$f":"D276","v":2014},null,null,null,null,null,null,{"$f":"D286","v":2014},null,null,null,null,null,{"$f":"K286","v":2014}]
[null,null,null,2015,null,null,{"$f":"IF(G276=0,\"\",G277/G276-1)","v":-3.037343279319249E-2}]
[null,null,null,2016,null,null,{"$f":"IF(G276=0,\"\",G278/G276-1)","v":-1.2862726389063051E-2},null,null,null,{"$f":"D288","v":2016},{"$f":"IF(L276=0,\"\",L278/L276-1)","v":""},"",null,null,null,{"$f":"K288","v":2016},{"$f":"IF(R276=\"\",\"\",IF(R276=0,\"\",R278/R276-1))","v":""},{"$f":"IF(S276=\"\",\"\",IF(S276=0,\"\",S278/S276-1))","v":""}]
[null,null,null,2017,null,null,{"$f":"IF(G278=0,\"\",G279/G278-1)","v":2.4121745979873266E-2},null,null,null,2017,{"$f":"IF(L278=0,\"\",L279/L278-1)","v":""},"",null,null,null,2017,{"$f":"IF(R278=\"\",\"\",IF(R278=0,\"\",R279/R278-1))","v":""},""]
[null,null,null,2018,null,null,{"$f":"IF(G279=0,\"\",G280/G279-1)","v":-6.5000982858355094E-2},null,null,null,2018,{"$f":"IF(L279=0,\"\",L280/L279-1)","v":""},"",null,null,null,2018,{"$f":"IF(R279=\"\",\"\",IF(R279=0,\"\",R280/R279-1))","v":""},""]
[null,null,null,2019,null,null,{"$f":"IF(G280=0,\"\",G281/G280-1)","v":8.7312787239288259E-2},null,null,null,2019,{"$f":"IF(L280=0,\"\",L281/L280-1)","v":""},"",null,null,null,2019,{"$f":"IF(R280=\"\",\"\",IF(R280=0,\"\",R281/R280-1))","v":""},""]
[null,null,null,2020,null,null,{"$f":"IF(G281=0,\"\",G282/G281-1)","v":1.6717826729755414E-2},null,null,null,2020,{"$f":"IF(K282=\"Forecast\",\"\",IF(L281=0,\"\",L282/L281-1))","v":""},{"$f":"IF(M281=0,\"\",M282/M281-1)","v":""},null,null,null,2020,{"$f":"IF(Q282=\"Forecast\",\"\",IF(R281=0,\"\",R282/R281-1))","v":""},{"$f":"IF(S281=\"\",\"\",IF(S281=0,\"\",S282/S281-1))","v":""}]
[null,null,null,2021,null,null,{"$f":"IF(G282=0,\"\",G283/G282-1)","v":2.6312668339554257E-3},null,{"$f":"IF(I284=0,\"\",G283/I284-1)","v":""},null,2021,{"$f":"IF(K283=\"Forecast\",\"\",IF(L282=0,\"\",L283/L282-1))","v":""},{"$f":"IF(M282=0,\"\",M283/M282-1)","v":""},null,{"$f":"IF(O284=0,\"\",M283/O284-1)","v":""},null,2021,{"$f":"IF(Q283=\"Forecast\",\"\",IF(R282=0,\"\",R283/R282-1))","v":""},{"$f":"IF(S282=\"\",\"\",IF(S282=0,\"\",S283/S282-1))","v":""},null,{"$f":"IF(U284=0,\"\",S283/U284-1)","v":""}]
[null,null,null,"Geometric Mean",null,null,{"$f":"IF(G276=0,\"\",(G283/G276)^(1/($D283-$D276-1))-1)","v":7.7962665720090474E-3},null,{"$f":"IF(I284=0,\"\",(G283/I284)^(1/(TestYear-RebaseYear-1))-1)","v":""},null,"Geometric Mean",{"$f":"IF(L276=0,\"\",(L281/L276)^(1/($D281-$D276-1))-1)","v":""},{"$f":"IF(M276=0,\"\",(M283/M276)^(1/($D283-$D276-1))-1)","v":""},null,{"$f":"IF(O284=0,\"\",(M283/O284)^(1/(TestYear-RebaseYear-1))-1)","v":""},null,"Geometric Mean",{"$f":"IF(R276=\"\",\"\",IF(R276=0,\"\",(R281/R276)^(1/($D281-$D276-1))-1))","v":""},{"$f":"IF(S276=\"\",\"\",IF(S276=0,\"\",(S283/S276)^(1/($D283-$D276-1))-1))","v":""},null,{"$f":"IF(U284=0,\"\",(S283/U284)^(1/(TestYear-RebaseYear-1))-1)","v":""}]
[]
[null,6,"Customer Class:","GS > 50 kW (kWh)",null,null,null,null,null,null,"Is the customer class billed on consumption (kWh) or demand (kW or kVA)?",null,null,null,null,null,"kW"]
[]
[null,null,null,"Calendar Year",null,"Customers",null,null,null,null,"Consumption (kWh) (3)",null,null,null,null,null,{"$f":"CONCATENATE(\"Consumption (kWh) per \",LEFT(F298,LEN(F298)-1))","v":"Consumption (kWh) per Customer"}]
[null,null,null,{"$f":"CONCATENATE(\"(for \",TestYear,\" Cost of Service\")","v":"(for 2021 Cost of Service"},null,null,null,null,null,null,null,"Actual (Weather actual)","Weather-normalized",null,"Weather-normalized",null,null,{"$f":"L299","v":"Actual (Weather actual)"},{"$f":"M299","v":"Weather-normalized"},null,{"$f":"O299","v":"Weather-normalized"}]
[null,null,"Historical",{"$f":"D301-1","v":2014},null,{"$f":"$K$41","v":"Actual"},1021.2083333333334,{"$f":"IF(D300=RebaseYear,\"OEB-approved\",\"\")","v":"OEB-approved"},null,null,{"$f":"F300","v":"Actual"},901672321,907076871.57273662,{"$f":"H300","v":"OEB-approved"},null,null,{"$f":"K300","v":"Actual"},{"$f":"IF(G300=0,\"\",L300/G300)","v":882946.4973683136},{"$f":"IF(G300=0,\"\",M300/G300)","v":888238.8068768892},{"$f":"N300","v":"OEB-approved"},{"$f":"IF(T300=\"\",\"\",IF(I300=0,\"\",O300/I300))","v":""}]
[null,null,"Historical",2015,null,{"$f":"$K$42","v":"Actual"},1027.6666666666667,"",null,null,"Actual",907051642,910747096.30211627,{"$f":"H301","v":""},null,null,"Actual",882632.15244891332,886228.11836080067,{"$f":"N301","v":""},{"$f":"IF(T301=\"\",\"\",IF(I301=0,\"\",O301/I301))","v":""}]
[null,null,"Historical",2016,null,{"$f":"$K$41","v":"Actual"},1034.1666666666667,{"$f":"IF(D302=RebaseYear,\"OEB-approved\",\"\")","v":""},null,null,{"$f":"F302","v":"Actual"},920835908,911669081.66833889,{"$f":"H302","v":""},null,null,{"$f":"K302","v":"Actual"},{"$f":"IF(G302=0,\"\",L302/G302)","v":890413.4485092666},{"$f":"IF(G302=0,\"\",M302/G302)","v":881549.4746188611},{"$f":"N302","v":""},{"$f":"IF(T302=\"\",\"\",IF(I302=0,\"\",O302/I302))","v":""}]
[null,null,"Historical",2017,null,{"$f":"$K$42","v":"Actual"},1003.6666666666666,"",null,null,"Actual",885596225,880877226.21429229,{"$f":"H303","v":""},null,null,"Actual",882360.90169378952,877659.14269109163,{"$f":"N303","v":""},{"$f":"IF(T303=\"\",\"\",IF(I303=0,\"\",O303/I303))","v":""}]
[null,null,"Historical",2018,null,{"$f":"$K$43","v":"Actual"},985.83333333333337,"",null,null,"Actual",874283086,860345878.27989948,"",null,null,"Actual",886846.74826711742,872709.25945551926,"",""]
[null,null,"Historical",2019,null,{"$f":"$K$44","v":"Actual"},984.83333333333337,"",null,null,"Actual",837536595,852880236.9562192,"",null,null,"Actual",850434.85699779994,866014.79467546369,"",""]
[null,null,"Bridge Year",{"$f":"D307-1","v":2020},null,{"$f":"$K$45","v":"Forecast"},1004.2915067757176,"",null,null,"Forecast",null,744818691.58703709,"",null,null,"Forecast",0,741635.95585735945,"",""]
[null,null,"Test Year",{"$f":"TestYear","v":2021},null,{"$f":"$K$46","v":"Forecast"},1003.0900728461615,"",null,null,"Forecast",null,825433793.57532883,"",null,null,"Forecast",0,822891.00043951999,"",""]
[null,null,null,null,null,null,null,null,{"$f":"SUM(I300:I306)","v":0},null,null,null,null,null,{"$f":"SUM(O300:O306)","v":0},null,null,null,null,null,{"$f":"SUM(U300:U306)","v":0}]
[null,null,"Variance Analysis","Year",null,null,"Year-over-year",null,"Test Year Versus OEB-approved",null,"Year","Year-over-year",null,null,{"$f":"I309","v":"Test Year Versus OEB-approved"},null,"Year","Year-over-year",null,null,{"$f":"O309","v":"Test Year Versus OEB-approved"}]
[null,null,null,{"$f":"D300","v":2014},null,null,null,null,null,null,{"$f":"D310","v":2014},null,null,null,null,null,{"$f":"K310","v":2014}]
[null,null,null,2015,null,null,{"$f":"IF(G300=0,\"\",G301/G300-1)","v":6.32420743400397E-3},null,null,null,{"$f":"D311","v":2015},{"$f":"IF(L300=0,\"\",L301/L300-1)","v":5.9659378187788548E-3},4.0462113459205362E-3,null,null,null,{"$f":"K311","v":2015},{"$f":"IF(R300=\"\",\"\",IF(R300=0,\"\",R301/R300-1))","v":-3.5601808301777282E-4},-2.2636801055317957E-3]
[null,null,null,2016,null,null,{"$f":"IF(G300=0,\"\",G302/G300-1)","v":1.2689216206291709E-2},null,null,null,{"$f":"D312","v":2016},{"$f":"IF(L300=0,\"\",L302/L300-1)","v":2.1253382801799559E-2},5.0626471024888264E-3,null,null,null,{"$f":"K312","v":2016},{"$f":"IF(R300=\"\",\"\",IF(R300=0,\"\",R302/R300-1))","v":8.4568557247906018E-3},{"$f":"IF(S300=\"\",\"\",IF(S300=0,\"\",S302/S300-1))","v":-7.5310065336463561E-3}]
[null,null,null,2017,null,null,{"$f":"IF(G302=0,\"\",G303/G302-1)","v":-2.9492344883158883E-2},null,null,null,2017,{"$f":"IF(L302=0,\"\",L303/L302-1)","v":-3.8269232003059539E-2},-3.3775254720383896E-2,null,null,null,2017,{"$f":"IF(R302=\"\",\"\",IF(R302=0,\"\",R303/R302-1))","v":-9.0436042143777762E-3},-4.413061364991977E-3]
[null,null,null,2018,null,null,{"$f":"IF(G303=0,\"\",G304/G303-1)","v":-1.7768183327797948E-2},null,null,null,2018,{"$f":"IF(L303=0,\"\",L304/L303-1)","v":-1.2774601653253392E-2},-2.3307842822352765E-2,null,null,null,2018,{"$f":"IF(R303=\"\",\"\",IF(R303=0,\"\",R304/R303-1))","v":5.0839135831117765E-3},-5.6398697339321568E-3]
[null,null,null,2019,null,null,{"$f":"IF(G304=0,\"\",G305/G304-1)","v":-1.0143702451395065E-3},null,null,null,2019,{"$f":"IF(L304=0,\"\",L305/L304-1)","v":-4.2030426515651476E-2},-8.6774883359777011E-3,null,null,null,2019,{"$f":"IF(R304=\"\",\"\",IF(R304=0,\"\",R305/R304-1))","v":-4.1057703983766847E-2},-7.6708992227632056E-3]
[null,null,null,2020,null,null,{"$f":"IF(G305=0,\"\",G306/G305-1)","v":1.9757833923558232E-2},null,null,null,2020,{"$f":"IF(K306=\"Forecast\",\"\",IF(L305=0,\"\",L306/L305-1))","v":""},{"$f":"IF(M305=0,\"\",M306/M305-1)","v":-0.12670189868021198},null,null,null,2020,{"$f":"IF(Q306=\"Forecast\",\"\",IF(R305=0,\"\",R306/R305-1))","v":""},{"$f":"IF(S305=\"\",\"\",IF(S305=0,\"\",S306/S305-1))","v":-0.14362207156601159}]
[null,null,null,2021,null,null,{"$f":"IF(G306=0,\"\",G307/G306-1)","v":-1.196300000000261E-3},null,{"$f":"IF(I308=0,\"\",G307/I308-1)","v":""},null,2021,{"$f":"IF(K307=\"Forecast\",\"\",IF(L306=0,\"\",L307/L306-1))","v":""},{"$f":"IF(M306=0,\"\",M307/M306-1)","v":0.10823453130119431},null,{"$f":"IF(O308=0,\"\",M307/O308-1)","v":""},null,2021,{"$f":"IF(Q307=\"Forecast\",\"\",IF(R306=0,\"\",R307/R306-1))","v":""},{"$f":"IF(S306=\"\",\"\",IF(S306=0,\"\",S307/S306-1))","v":0.10956190020240664},null,{"$f":"IF(U308=0,\"\",S307/U308-1)","v":""}]
[null,null,null,"Geometric Mean",null,null,{"$f":"IF(G300=0,\"\",(G307/G300)^(1/($D307-$D300-1))-1)","v":-2.9790967089124987E-3},null,{"$f":"IF(I308=0,\"\",(G307/I308)^(1/(TestYear-RebaseYear-1))-1)","v":""},null,"Geometric Mean",{"$f":"IF(L300=0,\"\",(L305/L300)^(1/($D305-$D300-1))-1)","v":-1.8277457496864602E-2},{"$f":"IF(M300=0,\"\",(M307/M300)^(1/($D307-$D300-1))-1)","v":-1.5596780819141509E-2},null,{"$f":"IF(O308=0,\"\",(M307/O308)^(1/(TestYear-RebaseYear-1))-1)","v":""},null,"Geometric Mean",{"$f":"IF(R300=\"\",\"\",IF(R300=0,\"\",(R305/R300)^(1/($D305-$D300-1))-1))","v":-9.3353504535460541E-3},{"$f":"IF(S300=\"\",\"\",IF(S300=0,\"\",(S307/S300)^(1/($D307-$D300-1))-1))","v":-1.2655385728201907E-2},null,{"$f":"IF(U308=0,\"\",(S307/U308)^(1/(TestYear-RebaseYear-1))-1)","v":""}]
[]
[]
[null,null,null,"Calendar Year",null,"Revenues",null,null,null,null,{"$f":"IF(ISBLANK(Q296),\"\",CONCATENATE(\"Demand (\",Q296,\")\"))","v":"Demand (kW)"},null,null,null,null,null,{"$f":"CONCATENATE(\"Demand (\",Q296,\") per \",LEFT(F298,LEN(F298)-1))","v":"Demand (kW) per Customer"}]
[null,null,null,{"$f":"CONCATENATE(\"(for \",TestYear,\" Cost of Service\")","v":"(for 2021 Cost of Service"},null,null,null,null,null,null,null,"Actual (Weather actual)","Weather-normalized",null,{"$f":"M322","v":"Weather-normalized"},null,null,{"$f":"L322","v":"Actual (Weather actual)"},{"$f":"M322","v":"Weather-normalized"},null,{"$f":"O322","v":"Weather-normalized"}]
[null,null,"Historical",{"$f":"D324-1","v":2014},null,{"$f":"F300","v":"Actual"},null,{"$f":"IF(D323=RebaseYear,\"OEB-approved\",\"\")","v":"OEB-approved"},null,null,{"$f":"K300","v":"Actual"},null,null,{"$f":"N300","v":"OEB-approved"},null,null,{"$f":"K323","v":"Actual"},{"$f":"IF(G323=0,\"\",L323/G323)","v":""},{"$f":"IF(G323=0,\"\",M323/G323)","v":""},{"$f":"N323","v":"OEB-approved"},{"$f":"IF(T323=\"\",\"\",IF(I323=0,\"\",O323/I323))","v":""}]
[null,null,"Historical",2015,null,"Actual",null,""]
[null,null,"Historical",2016,null,"Actual",null,{"$f":"IF(D325=RebaseYear,\"OEB-approved\",\"\")","v":""},null,null,{"$f":"K302","v":"Actual"},null,null,{"$f":"N302","v":""},null,null,{"$f":"K325","v":"Actual"},{"$f":"IF(G325=0,\"\",L325/G325)","v":""},{"$f":"IF(G325=0,\"\",M325/G325)","v":""},{"$f":"N325","v":""},{"$f":"IF(T325=\"\",\"\",IF(I325=0,\"\",O325/I325))","v":""}]
[null,null,"Historical",2017,null,"Actual",null,"",null,null,"Actual",null,null,"",null,null,"Actual","","","",""]
[null,null,"Historical",2018,null,"Actual",null,"",null,null,"Actual",null,null,"",null,null,"Actual","","","",""]
[null,null,"Historical",2019,null,"Actual",null,"",null,null,"Actual",null,null,"",null,null,"Actual","","","",""]
[null,null,"Bridge Year (Forecast)",2020,null,"Forecast",null,"",null,null,"Forecast",null,null,"",null,null,"Forecast","","","",""]
[null,null,"Test Year (Forecast)",{"$f":"TestYear","v":2021},null,"Forecast",null,"",null,null,"Forecast",null,null,"",null,null,"Forecast","","","",""]
[null,null,null,null,null,null,null,null,{"$f":"SUM(I323:I329)","v":0},null,null,null,null,null,{"$f":"SUM(O323:O329)","v":0},null,null,null,null,null,{"$f":"SUM(U323:U329)","v":0}]
[null,null,"Variance Analysis","Year",null,null,"Year-over-year",null,{"$f":"I309","v":"Test Year Versus OEB-approved"},null,"Year","Year-over-year",null,null,{"$f":"I332","v":"Test Year Versus OEB-approved"},null,"Year","Year-over-year",null,null,{"$f":"O332","v":"Test Year Versus OEB-approved"}]
[null,null,null,{"$f":"D323","v":2014},null,null,null,null,null,null,{"$f":"D333","v":2014},null,null,null,null,null,{"$f":"K333","v":2014}]
[null,null,null,2015,null,null,{"$f":"IF(G323=0,\"\",G324/G323-1)","v":""}]
[null,null,null,2016,null,null,{"$f":"IF(G323=0,\"\",G325/G323-1)","v":""},null,null,null,{"$f":"D335","v":2016},{"$f":"IF(L323=0,\"\",L325/L323-1)","v":""},"",null,null,null,{"$f":"K335","v":2016},{"$f":"IF(R323=\"\",\"\",IF(R323=0,\"\",R325/R323-1))","v":""},{"$f":"IF(S323=\"\",\"\",IF(S323=0,\"\",S325/S323-1))","v":""}]
[null,null,null,2017,null,null,{"$f":"IF(G325=0,\"\",G326/G325-1)","v":""},null,null,null,2017,{"$f":"IF(L325=0,\"\",L326/L325-1)","v":""},"",null,null,null,2017,{"$f":"IF(R325=\"\",\"\",IF(R325=0,\"\",R326/R325-1))","v":""},""]
[null,null,null,2018,null,null,{"$f":"IF(G326=0,\"\",G327/G326-1)","v":""},null,null,null,2018,{"$f":"IF(L326=0,\"\",L327/L326-1)","v":""},"",null,null,null,2018,{"$f":"IF(R326=\"\",\"\",IF(R326=0,\"\",R327/R326-1))","v":""},""]
[null,null,null,2019,null,null,{"$f":"IF(G327=0,\"\",G328/G327-1)","v":""},null,null,null,2019,{"$f":"IF(L327=0,\"\",L328/L327-1)","v":""},"",null,null,null,2019,{"$f":"IF(R327=\"\",\"\",IF(R327=0,\"\",R328/R327-1))","v":""},""]
[null,null,null,2020,null,null,{"$f":"IF(G328=0,\"\",G329/G328-1)","v":""},null,null,null,2020,{"$f":"IF(K329=\"Forecast\",\"\",IF(L328=0,\"\",L329/L328-1))","v":""},{"$f":"IF(M328=0,\"\",M329/M328-1)","v":""},null,null,null,2020,{"$f":"IF(Q329=\"Forecast\",\"\",IF(R328=0,\"\",R329/R328-1))","v":""},{"$f":"IF(S328=\"\",\"\",IF(S328=0,\"\",S329/S328-1))","v":""}]
[null,null,null,2021,null,null,{"$f":"IF(G329=0,\"\",G330/G329-1)","v":""},null,{"$f":"IF(I331=0,\"\",G330/I331-1)","v":""},null,2021,{"$f":"IF(K330=\"Forecast\",\"\",IF(L329=0,\"\",L330/L329-1))","v":""},{"$f":"IF(M329=0,\"\",M330/M329-1)","v":""},null,{"$f":"IF(O331=0,\"\",M330/O331-1)","v":""},null,2021,{"$f":"IF(Q330=\"Forecast\",\"\",IF(R329=0,\"\",R330/R329-1))","v":""},{"$f":"IF(S329=\"\",\"\",IF(S329=0,\"\",S330/S329-1))","v":""},null,{"$f":"IF(U331=0,\"\",S330/U331-1)","v":""}]
[null,null,null,"Geometric Mean",null,null,{"$f":"IF(G323=0,\"\",(G330/G323)^(1/($D330-$D323-1))-1)","v":""},null,{"$f":"IF(I331=0,\"\",(G330/I331)^(1/(TestYear-RebaseYear-1))-1)","v":""},null,"Geometric Mean",{"$f":"IF(L323=0,\"\",(L328/L323)^(1/($D328-$D323-1))-1)","v":""},{"$f":"IF(M323=0,\"\",(M330/M323)^(1/($D330-$D323-1))-1)","v":""},null,{"$f":"IF(O331=0,\"\",(M330/O331)^(1/(TestYear-RebaseYear-1))-1)","v":""},null,"Geometric Mean",{"$f":"IF(R323=\"\",\"\",IF(R323=0,\"\",(R328/R323)^(1/($D328-$D323-1))-1))","v":""},{"$f":"IF(S323=\"\",\"\",IF(S323=0,\"\",(S330/S323)^(1/($D330-$D323-1))-1))","v":""},null,{"$f":"IF(U331=0,\"\",(S330/U331)^(1/(TestYear-RebaseYear-1))-1)","v":""}]
[]
[null,7,"Customer Class:","Street Light (kW)",null,null,null,null,null,null,"Is the customer class billed on consumption (kWh) or demand (kW or kVA)?",null,null,null,null,null,"kW"]
[]
[null,null,null,"Calendar Year",null,"Customers",null,null,null,null,"Consumption (kWh) (3)",null,null,null,null,null,{"$f":"CONCATENATE(\"Consumption (kWh) per \",LEFT(F345,LEN(F345)-1))","v":"Consumption (kWh) per Customer"}]
[null,null,null,{"$f":"CONCATENATE(\"(for \",TestYear,\" Cost of Service\")","v":"(for 2021 Cost of Service"},null,null,null,null,null,null,null,"Actual (Weather actual)","Weather-normalized",null,"Weather-normalized",null,null,{"$f":"L346","v":"Actual (Weather actual)"},{"$f":"M346","v":"Weather-normalized"},null,{"$f":"O346","v":"Weather-normalized"}]
[null,null,"Historical",{"$f":"D348-1","v":2014},null,{"$f":"$K$42","v":"Actual"},15170.75,{"$f":"IF(D347=RebaseYear,\"OEB-approved\",\"\")","v":"OEB-approved"},null,null,{"$f":"F347","v":"Actual"},9467387,9908447,{"$f":"H347","v":"OEB-approved"},null,null,{"$f":"K347","v":"Actual"},{"$f":"IF(G347=0,\"\",L347/G347)","v":624.05530379183631},{"$f":"IF(G347=0,\"\",M347/G347)","v":653.12835555262598},{"$f":"N347","v":"OEB-approved"},{"$f":"IF(T347=\"\",\"\",IF(I347=0,\"\",O347/I347))","v":""}]
[null,null,"Historical",2015,null,{"$f":"$K$42","v":"Actual"},15228.583333333334,{"$f":"IF(D348=RebaseYear,\"OEB-approved\",\"\")","v":""},null,null,{"$f":"F348","v":"Actual"},9847280,9918681,{"$f":"H348","v":""},null,null,{"$f":"K348","v":"Actual"},{"$f":"IF(G348=0,\"\",L348/G348)","v":646.63138943762544},{"$f":"IF(G348=0,\"\",M348/G348)","v":651.32000678548559},{"$f":"N348","v":""},{"$f":"IF(T348=\"\",\"\",IF(I348=0,\"\",O348/I348))","v":""}]
[null,null,"Historical",2016,null,{"$f":"$K$41","v":"Actual"},15252.666666666666,{"$f":"IF(D349=RebaseYear,\"OEB-approved\",\"\")","v":""},null,null,{"$f":"F349","v":"Actual"},9866380,9945876,{"$f":"H349","v":""},null,null,{"$f":"K349","v":"Actual"},{"$f":"IF(G349=0,\"\",L349/G349)","v":646.8626251147341},{"$f":"IF(G349=0,\"\",M349/G349)","v":652.07456619607501},{"$f":"N349","v":""},{"$f":"IF(T349=\"\",\"\",IF(I349=0,\"\",O349/I349))","v":""}]
[null,null,"Historical",2017,null,{"$f":"$K$42","v":"Actual"},17184,"",null,null,"Actual",9864267,11286654.700000001,{"$f":"H350","v":""},null,null,"Actual",574.0378840782123,656.81184241154574,{"$f":"N350","v":""},{"$f":"IF(T350=\"\",\"\",IF(I350=0,\"\",O350/I350))","v":""}]
[null,null,"Historical",2018,null,{"$f":"$K$43","v":"Actual"},17184,"",null,null,"Actual",9908447,6528022.6000000006,"",null,null,"Actual",576.60888035381754,379.88958333333335,"",""]
[null,null,"Historical",2019,null,{"$f":"$K$44","v":"Actual"},17184,"",null,null,"Actual",9918681,5537652.8999999994,"",null,null,"Actual",577.20443435754191,322.25633729050276,"",""]
[null,null,"Bridge Year",{"$f":"D354-1","v":2020},null,{"$f":"$K$45","v":"Forecast"},17196.600593685107,"",null,null,"Forecast",null,5541713.5211686473,"",null,null,"Forecast",0,322.25633729050276,"",""]
[null,null,"Test Year",{"$f":"TestYear","v":2021},null,{"$f":"$K$46","v":"Forecast"},17283.271460677272,"",null,null,"Forecast",null,5569643.7573153349,"",null,null,"Forecast",0,322.25633729050276,"",""]
[null,null,null,null,null,null,null,null,{"$f":"SUM(I347:I353)","v":0},null,null,null,null,null,{"$f":"SUM(O347:O353)","v":0},null,null,null,null,null,{"$f":"SUM(U347:U353)","v":0}]
[null,null,"Variance Analysis","Year",null,null,"Year-over-year",null,"Test Year Versus OEB-approved",null,"Year","Year-over-year",null,null,{"$f":"I356","v":"Test Year Versus OEB-approved"},null,"Year","Year-over-year",null,null,{"$f":"O356","v":"Test Year Versus OEB-approved"}]
[null,null,null,{"$f":"D347","v":2014},null,null,null,null,null,null,{"$f":"D357","v":2014},null,null,null,null,null,{"$f":"K357","v":2014}]
[null,null,null,2015,null,null,{"$f":"IF(G347=0,\"\",G348/G347-1)","v":3.8121604622931571E-3},null,null,null,{"$f":"D358","v":2015},{"$f":"IF(L347=0,\"\",L348/L347-1)","v":4.0126488966807816E-2},1.0328561075212406E-3,null,null,null,{"$f":"K358","v":2015},{"$f":"IF(R347=\"\",\"\",IF(R347=0,\"\",R348/R347-1))","v":3.6176418193410331E-2},-2.7687494376359423E-3]
[null,null,null,2016,null,null,{"$f":"IF(G347=0,\"\",G349/G347-1)","v":5.3996451504814136E-3},null,null,null,{"$f":"D359","v":2016},{"$f":"IF(L347=0,\"\",L349/L347-1)","v":4.2143941089552994E-2},3.7774839992583686E-3,null,null,null,{"$f":"K359","v":2016},{"$f":"IF(R347=\"\",\"\",IF(R347=0,\"\",R349/R347-1))","v":3.6546955348857324E-2},{"$f":"IF(S347=\"\",\"\",IF(S347=0,\"\",S349/S347-1))","v":-1.613449098622155E-3}]
[null,null,null,2017,null,null,{"$f":"IF(G349=0,\"\",G350/G349-1)","v":0.12662266707461001},null,null,null,2017,-2.1416162766896285E-4,0.13480750212449877,null,null,null,2017,-0.11258146352729048,7.2649302105216584E-3]
[null,null,null,2018,null,null,{"$f":"IF(G350=0,\"\",G351/G350-1)","v":0},null,null,null,2018,{"$f":"IF(L350=0,\"\",L351/L350-1)","v":4.4787919872808502E-3},-0.42161581323117825,null,null,null,2018,{"$f":"IF(R350=\"\",\"\",IF(R350=0,\"\",R351/R350-1))","v":4.4787919872810722E-3},-0.42161581323117836]
[null,null,null,2019,null,null,{"$f":"IF(G351=0,\"\",G352/G351-1)","v":0},null,null,null,2019,{"$f":"IF(L351=0,\"\",L352/L351-1)","v":1.0328561075212406E-3},-0.15171051950708647,null,null,null,2019,{"$f":"IF(R351=\"\",\"\",IF(R351=0,\"\",R352/R351-1))","v":1.0328561075212406E-3},-0.15171051950708636]
[null,null,null,2020,null,null,{"$f":"IF(G352=0,\"\",G353/G352-1)","v":7.3327477217799419E-4},null,null,null,2020,{"$f":"IF(K353=\"Forecast\",\"\",IF(L352=0,\"\",L353/L352-1))","v":""},{"$f":"IF(M352=0,\"\",M353/M352-1)","v":7.3327477217799419E-4},null,null,null,2020,{"$f":"IF(Q353=\"Forecast\",\"\",IF(R352=0,\"\",R353/R352-1))","v":""},{"$f":"IF(S352=\"\",\"\",IF(S352=0,\"\",S353/S352-1))","v":0}]
[null,null,null,2021,null,null,{"$f":"IF(G353=0,\"\",G354/G353-1)","v":5.0399999999994893E-3},null,{"$f":"IF(I355=0,\"\",G354/I355-1)","v":""},null,2021,{"$f":"IF(K354=\"Forecast\",\"\",IF(L353=0,\"\",L354/L353-1))","v":""},{"$f":"IF(M353=0,\"\",M354/M353-1)","v":5.0399999999994893E-3},null,{"$f":"IF(O355=0,\"\",M354/O355-1)","v":""},null,2021,{"$f":"IF(Q354=\"Forecast\",\"\",IF(R353=0,\"\",R354/R353-1))","v":""},{"$f":"IF(S353=\"\",\"\",IF(S353=0,\"\",S354/S353-1))","v":0},null,{"$f":"IF(U355=0,\"\",S354/U355-1)","v":""}]
[null,null,null,"Geometric Mean",null,null,{"$f":"IF(G347=0,\"\",(G354/G347)^(1/($D354-$D347-1))-1)","v":2.1966084400428798E-2},null,{"$f":"IF(I355=0,\"\",(G354/I355)^(1/(TestYear-RebaseYear-1))-1)","v":""},null,"Geometric Mean",{"$f":"IF(L347=0,\"\",(L352/L347)^(1/($D352-$D347-1))-1)","v":1.1709779815862298E-2},{"$f":"IF(M347=0,\"\",(M354/M347)^(1/($D354-$D347-1))-1)","v":-9.154454331298445E-2},null,{"$f":"IF(O355=0,\"\",(M354/O355)^(1/(TestYear-RebaseYear-1))-1)","v":""},null,"Geometric Mean",{"$f":"IF(R347=\"\",\"\",IF(R347=0,\"\",(R352/R347)^(1/($D352-$D347-1))-1))","v":-1.9321520385887747E-2},{"$f":"IF(S347=\"\",\"\",IF(S347=0,\"\",(S354/S347)^(1/($D354-$D347-1))-1))","v":-0.11107083634777182},null,{"$f":"IF(U355=0,\"\",(S354/U355)^(1/(TestYear-RebaseYear-1))-1)","v":""}]
[]
[]
[null,null,null,"Calendar Year",null,"Revenues",null,null,null,null,{"$f":"IF(ISBLANK(Q343),\"\",CONCATENATE(\"Demand (\",Q343,\")\"))","v":"Demand (kW)"},null,null,null,null,null,{"$f":"CONCATENATE(\"Demand (\",Q343,\") per \",LEFT(F345,LEN(F345)-1))","v":"Demand (kW) per Customer"}]
[null,null,null,{"$f":"CONCATENATE(\"(for \",TestYear,\" Cost of Service\")","v":"(for 2021 Cost of Service"},null,null,null,null,null,null,null,"Actual (Weather actual)","Weather-normalized",null,{"$f":"M369","v":"Weather-normalized"},null,null,{"$f":"L369","v":"Actual (Weather actual)"},{"$f":"M369","v":"Weather-normalized"},null,{"$f":"O369","v":"Weather-normalized"}]
[null,null,"Historical",{"$f":"D371-1","v":2014},null,{"$f":"F347","v":"Actual"},null,{"$f":"IF(D370=RebaseYear,\"OEB-approved\",\"\")","v":"OEB-approved"},null,null,{"$f":"K347","v":"Actual"},null,null,{"$f":"N347","v":"OEB-approved"},null,null,{"$f":"K370","v":"Actual"},{"$f":"IF(G370=0,\"\",L370/G370)","v":""},{"$f":"IF(G370=0,\"\",M370/G370)","v":""},{"$f":"N370","v":"OEB-approved"},{"$f":"IF(T370=\"\",\"\",IF(I370=0,\"\",O370/I370))","v":""}]
[null,null,"Historical",2015,null,"Actual",null,""]
[null,null,"Historical",2016,null,"Actual",null,{"$f":"IF(D372=RebaseYear,\"OEB-approved\",\"\")","v":""},null,null,{"$f":"K349","v":"Actual"},null,null,{"$f":"N349","v":""},null,null,{"$f":"K372","v":"Actual"},{"$f":"IF(G372=0,\"\",L372/G372)","v":""},{"$f":"IF(G372=0,\"\",M372/G372)","v":""},{"$f":"N372","v":""},{"$f":"IF(T372=\"\",\"\",IF(I372=0,\"\",O372/I372))","v":""}]
[null,null,"Historical",2017,null,"Actual",null,"",null,null,"Actual",null,null,"",null,null,"Actual","","","",""]
[null,null,"Historical",2018,null,"Actual",null,"",null,null,"Actual",null,null,"",null,null,"Actual","","","",""]
[null,null,"Historical",2019,null,"Actual",null,"",null,null,"Actual",null,null,"",null,null,"Actual","","","",""]
[null,null,"Bridge Year (Forecast)",2020,null,"Forecast",null,"",null,null,"Forecast",null,null,"",null,null,"Forecast","","","",""]
[null,null,"Test Year (Forecast)",{"$f":"TestYear","v":2021},null,"Forecast",null,"",null,null,"Forecast",null,null,"",null,null,"Forecast","","","",""]
[null,null,null,null,null,null,null,null,{"$f":"SUM(I370:I376)","v":0},null,null,null,null,null,{"$f":"SUM(O370:O376)","v":0},null,null,null,null,null,{"$f":"SUM(U370:U376)","v":0}]
[null,null,"Variance Analysis","Year",null,null,"Year-over-year",null,{"$f":"I356","v":"Test Year Versus OEB-approved"},null,"Year","Year-over-year",null,null,{"$f":"I379","v":"Test Year Versus OEB-approved"},null,"Year","Year-over-year",null,null,{"$f":"O379","v":"Test Year Versus OEB-approved"}]
[null,null,null,{"$f":"D370","v":2014},null,null,null,null,null,null,{"$f":"D380","v":2014},null,null,null,null,null,{"$f":"K380","v":2014}]
[null,null,null,2015,null,null,{"$f":"IF(G370=0,\"\",G371/G370-1)","v":""}]
[null,null,null,2016,null,null,{"$f":"IF(G370=0,\"\",G372/G370-1)","v":""},null,null,null,{"$f":"D382","v":2016},{"$f":"IF(L370=0,\"\",L372/L370-1)","v":""},"",null,null,null,{"$f":"K382","v":2016},{"$f":"IF(R370=\"\",\"\",IF(R370=0,\"\",R372/R370-1))","v":""},{"$f":"IF(S370=\"\",\"\",IF(S370=0,\"\",S372/S370-1))","v":""}]
[null,null,null,2017,null,null,{"$f":"IF(G372=0,\"\",G373/G372-1)","v":""},null,null,null,2017,{"$f":"IF(L372=0,\"\",L373/L372-1)","v":""},"",null,null,null,2017,{"$f":"IF(R372=\"\",\"\",IF(R372=0,\"\",R373/R372-1))","v":""},""]
[null,null,null,2018,null,null,{"$f":"IF(G373=0,\"\",G374/G373-1)","v":""},null,null,null,2018,{"$f":"IF(L373=0,\"\",L374/L373-1)","v":""},"",null,null,null,2018,{"$f":"IF(R373=\"\",\"\",IF(R373=0,\"\",R374/R373-1))","v":""},""]
[null,null,null,2019,null,null,{"$f":"IF(G374=0,\"\",G375/G374-1)","v":""},null,null,null,2019,{"$f":"IF(L374=0,\"\",L375/L374-1)","v":""},"",null,null,null,2019,{"$f":"IF(R374=\"\",\"\",IF(R374=0,\"\",R375/R374-1))","v":""},""]
[null,null,null,2020,null,null,{"$f":"IF(G375=0,\"\",G376/G375-1)","v":""},null,null,null,2020,{"$f":"IF(K376=\"Forecast\",\"\",IF(L375=0,\"\",L376/L375-1))","v":""},{"$f":"IF(M375=0,\"\",M376/M375-1)","v":""},null,null,null,2020,{"$f":"IF(Q376=\"Forecast\",\"\",IF(R375=0,\"\",R376/R375-1))","v":""},{"$f":"IF(S375=\"\",\"\",IF(S375=0,\"\",S376/S375-1))","v":""}]
[null,null,null,2021,null,null,{"$f":"IF(G376=0,\"\",G377/G376-1)","v":""},null,{"$f":"IF(I378=0,\"\",G377/I378-1)","v":""},null,2021,{"$f":"IF(K377=\"Forecast\",\"\",IF(L376=0,\"\",L377/L376-1))","v":""},{"$f":"IF(M376=0,\"\",M377/M376-1)","v":""},null,{"$f":"IF(O378=0,\"\",M377/O378-1)","v":""},null,2021,{"$f":"IF(Q377=\"Forecast\",\"\",IF(R376=0,\"\",R377/R376-1))","v":""},{"$f":"IF(S376=\"\",\"\",IF(S376=0,\"\",S377/S376-1))","v":""},null,{"$f":"IF(U378=0,\"\",S377/U378-1)","v":""}]
[null,null,null,"Geometric Mean",null,null,{"$f":"IF(G370=0,\"\",(G377/G370)^(1/($D377-$D370-1))-1)","v":""},null,{"$f":"IF(I378=0,\"\",(G377/I378)^(1/(TestYear-RebaseYear-1))-1)","v":""},null,"Geometric Mean",{"$f":"IF(L370=0,\"\",(L375/L370)^(1/($D375-$D370-1))-1)","v":""},{"$f":"IF(M370=0,\"\",(M377/M370)^(1/($D377-$D370-1))-1)","v":""},null,{"$f":"IF(O378=0,\"\",(M377/O378)^(1/(TestYear-RebaseYear-1))-1)","v":""},null,"Geometric Mean",{"$f":"IF(R370=\"\",\"\",IF(R370=0,\"\",(R375/R370)^(1/($D375-$D370-1))-1))","v":""},{"$f":"IF(S370=\"\",\"\",IF(S370=0,\"\",(S377/S370)^(1/($D377-$D370-1))-1))","v":""},null,{"$f":"IF(U378=0,\"\",(S377/U378)^(1/(TestYear-RebaseYear-1))-1)","v":""}]
[]
[null,8,"Customer Class:",null,null,null,null,null,null,null,"Is the customer class billed on consumption (kWh) or demand (kW or kVA)?",null,null,null,null,null,"kWh"]
[]
[null,null,null,"Calendar Year",null,"Customers",null,null,null,null,"Consumption (kWh) (3)",null,null,null,null,null,{"$f":"CONCATENATE(\"Consumption (kWh) per \",LEFT(F392,LEN(F392)-1))","v":"Consumption (kWh) per Customer"}]
[null,null,null,{"$f":"CONCATENATE(\"(for \",TestYear,\" Cost of Service\")","v":"(for 2021 Cost of Service"},null,null,null,null,null,null,null,"Actual (Weather actual)","Weather-normalized",null,"Weather-normalized",null,null,{"$f":"L393","v":"Actual (Weather actual)"},{"$f":"M393","v":"Weather-normalized"},null,{"$f":"O393","v":"Weather-normalized"}]
[null,null,"Historical",{"$f":"D395-1","v":2014},null,{"$f":"$K$42","v":"Actual"},null,{"$f":"IF(D394=RebaseYear,\"OEB-approved\",\"\")","v":"OEB-approved"},null,null,{"$f":"F394","v":"Actual"},null,null,{"$f":"H394","v":"OEB-approved"},null,null,{"$f":"K394","v":"Actual"},{"$f":"IF(G394=0,\"\",L394/G394)","v":""},{"$f":"IF(G394=0,\"\",M394/G394)","v":""},{"$f":"N394","v":"OEB-approved"},{"$f":"IF(T394=\"\",\"\",IF(I394=0,\"\",O394/I394))","v":""}]
[null,null,"Historical",2015,null,{"$f":"$K$42","v":"Actual"},null,{"$f":"IF(D395=RebaseYear,\"OEB-approved\",\"\")","v":""},null,null,{"$f":"F395","v":"Actual"},null,null,{"$f":"H395","v":""},null,null,{"$f":"K395","v":"Actual"},{"$f":"IF(G395=0,\"\",L395/G395)","v":""},{"$f":"IF(G395=0,\"\",M395/G395)","v":""},{"$f":"N395","v":""},{"$f":"IF(T395=\"\",\"\",IF(I395=0,\"\",O395/I395))","v":""}]
[null,null,"Historical",2016,null,{"$f":"$K$41","v":"Actual"},null,{"$f":"IF(D396=RebaseYear,\"OEB-approved\",\"\")","v":""},null,null,{"$f":"F396","v":"Actual"},null,null,{"$f":"H396","v":""},null,null,{"$f":"K396","v":"Actual"},{"$f":"IF(G396=0,\"\",L396/G396)","v":""},{"$f":"IF(G396=0,\"\",M396/G396)","v":""},{"$f":"N396","v":""},{"$f":"IF(T396=\"\",\"\",IF(I396=0,\"\",O396/I396))","v":""}]
[null,null,"Historical",2017,null,{"$f":"$K$42","v":"Actual"},null,"",null,null,"Actual",null,null,{"$f":"H397","v":""},null,null,"Actual","","",{"$f":"N397","v":""},{"$f":"IF(T397=\"\",\"\",IF(I397=0,\"\",O397/I397))","v":""}]
[null,null,"Historical",2018,null,{"$f":"$K$43","v":"Actual"},null,"",null,null,"Actual",null,null,"",null,null,"Actual","","","",""]
[null,null,"Historical",2019,null,{"$f":"$K$44","v":"Actual"},null,"",null,null,"Actual",null,null,"",null,null,"Actual","","","",""]
[null,null,"Bridge Year",{"$f":"D401-1","v":2020},null,{"$f":"$K$45","v":"Forecast"},null,"",null,null,"Forecast",null,null,"",null,null,"Forecast","","","",""]
[null,null,"Test Year",{"$f":"TestYear","v":2021},null,{"$f":"$K$46","v":"Forecast"},null,"",null,null,"Forecast",null,null,"",null,null,"Forecast","","","",""]
[null,null,null,null,null,null,null,null,{"$f":"SUM(I394:I400)","v":0},null,null,null,null,null,{"$f":"SUM(O394:O400)","v":0},null,null,null,null,null,{"$f":"SUM(U394:U400)","v":0}]
[null,null,"Variance Analysis","Year",null,null,"Year-over-year",null,"Test Year Versus OEB-approved",null,"Year","Year-over-year",null,null,{"$f":"I403","v":"Test Year Versus OEB-approved"},null,"Year","Year-over-year",null,null,{"$f":"O403","v":"Test Year Versus OEB-approved"}]
[null,null,null,{"$f":"D394","v":2014},null,null,null,null,null,null,{"$f":"D404","v":2014},null,null,null,null,null,{"$f":"K404","v":2014}]
[null,null,null,2015,null,null,{"$f":"IF(G394=0,\"\",G395/G394-1)","v":""},null,null,null,{"$f":"D405","v":2015},{"$f":"IF(L394=0,\"\",L395/L394-1)","v":""},"",null,null,null,{"$f":"K405","v":2015},{"$f":"IF(R394=\"\",\"\",IF(R394=0,\"\",R395/R394-1))","v":""},""]
[null,null,null,2016,null,null,{"$f":"IF(G394=0,\"\",G396/G394-1)","v":""},null,null,null,{"$f":"D406","v":2016},{"$f":"IF(L394=0,\"\",L396/L394-1)","v":""},"",null,null,null,{"$f":"K406","v":2016},{"$f":"IF(R394=\"\",\"\",IF(R394=0,\"\",R396/R394-1))","v":""},{"$f":"IF(S394=\"\",\"\",IF(S394=0,\"\",S396/S394-1))","v":""}]
[null,null,null,2017,null,null,{"$f":"IF(G396=0,\"\",G397/G396-1)","v":""},null,null,null,2017,{"$f":"IF(L396=0,\"\",L397/L396-1)","v":""},"",null,null,null,2017,{"$f":"IF(R396=\"\",\"\",IF(R396=0,\"\",R397/R396-1))","v":""},""]
[null,null,null,2018,null,null,{"$f":"IF(G397=0,\"\",G398/G397-1)","v":""},null,null,null,2018,{"$f":"IF(L397=0,\"\",L398/L397-1)","v":""},"",null,null,null,2018,{"$f":"IF(R397=\"\",\"\",IF(R397=0,\"\",R398/R397-1))","v":""},""]
[null,null,null,2019,null,null,{"$f":"IF(G398=0,\"\",G399/G398-1)","v":""},null,null,null,2019,{"$f":"IF(L398=0,\"\",L399/L398-1)","v":""},"",null,null,null,2019,{"$f":"IF(R398=\"\",\"\",IF(R398=0,\"\",R399/R398-1))","v":""},""]
[null,null,null,2020,null,null,{"$f":"IF(G399=0,\"\",G400/G399-1)","v":""},null,null,null,2020,{"$f":"IF(K400=\"Forecast\",\"\",IF(L399=0,\"\",L400/L399-1))","v":""},{"$f":"IF(M399=0,\"\",M400/M399-1)","v":""},null,null,null,2020,{"$f":"IF(Q400=\"Forecast\",\"\",IF(R399=0,\"\",R400/R399-1))","v":""},{"$f":"IF(S399=\"\",\"\",IF(S399=0,\"\",S400/S399-1))","v":""}]
[null,null,null,2021,null,null,{"$f":"IF(G400=0,\"\",G401/G400-1)","v":""},null,{"$f":"IF(I402=0,\"\",G401/I402-1)","v":""},null,2021,{"$f":"IF(K401=\"Forecast\",\"\",IF(L400=0,\"\",L401/L400-1))","v":""},{"$f":"IF(M400=0,\"\",M401/M400-1)","v":""},null,{"$f":"IF(O402=0,\"\",M401/O402-1)","v":""},null,2021,{"$f":"IF(Q401=\"Forecast\",\"\",IF(R400=0,\"\",R401/R400-1))","v":""},{"$f":"IF(S400=\"\",\"\",IF(S400=0,\"\",S401/S400-1))","v":""},null,{"$f":"IF(U402=0,\"\",S401/U402-1)","v":""}]
[null,null,null,"Geometric Mean",null,null,{"$f":"IF(G394=0,\"\",(G401/G394)^(1/($D401-$D394-1))-1)","v":""},null,{"$f":"IF(I402=0,\"\",(G401/I402)^(1/(TestYear-RebaseYear-1))-1)","v":""},null,"Geometric Mean",{"$f":"IF(L394=0,\"\",(L399/L394)^(1/($D399-$D394-1))-1)","v":""},{"$f":"IF(M394=0,\"\",(M401/M394)^(1/($D401-$D394-1))-1)","v":""},null,{"$f":"IF(O402=0,\"\",(M401/O402)^(1/(TestYear-RebaseYear-1))-1)","v":""},null,"Geometric Mean",{"$f":"IF(R394=\"\",\"\",IF(R394=0,\"\",(R399/R394)^(1/($D399-$D394-1))-1))","v":""},{"$f":"IF(S394=\"\",\"\",IF(S394=0,\"\",(S401/S394)^(1/($D401-$D394-1))-1))","v":""},null,{"$f":"IF(U402=0,\"\",(S401/U402)^(1/(TestYear-RebaseYear-1))-1)","v":""}]
[]
[]
[null,null,null,"Calendar Year",null,"Revenues",null,null,null,null,{"$f":"IF(ISBLANK(Q390),\"\",CONCATENATE(\"Demand (\",Q390,\")\"))","v":"Demand (kWh)"},null,null,null,null,null,{"$f":"CONCATENATE(\"Demand (\",Q390,\") per \",LEFT(F392,LEN(F392)-1))","v":"Demand (kWh) per Customer"}]
[null,null,null,{"$f":"CONCATENATE(\"(for \",TestYear,\" Cost of Service\")","v":"(for 2021 Cost of Service"},null,null,null,null,null,null,null,"Actual (Weather actual)","Weather-normalized",null,{"$f":"M416","v":"Weather-normalized"},null,null,{"$f":"L416","v":"Actual (Weather actual)"},{"$f":"M416","v":"Weather-normalized"},null,{"$f":"O416","v":"Weather-normalized"}]
[null,null,"Historical",{"$f":"D418-1","v":2014},null,{"$f":"F394","v":"Actual"},null,{"$f":"IF(D417=RebaseYear,\"OEB-approved\",\"\")","v":"OEB-approved"},null,null,{"$f":"K394","v":"Actual"},null,null,{"$f":"N394","v":"OEB-approved"},null,null,{"$f":"K417","v":"Actual"},{"$f":"IF(G417=0,\"\",L417/G417)","v":""},{"$f":"IF(G417=0,\"\",M417/G417)","v":""},{"$f":"N417","v":"OEB-approved"},{"$f":"IF(T417=\"\",\"\",IF(I417=0,\"\",O417/I417))","v":""}]
[null,null,"Historical",2015,null,"Actual",null,""]
[null,null,"Historical",2016,null,"Actual",null,{"$f":"IF(D419=RebaseYear,\"OEB-approved\",\"\")","v":""},null,null,{"$f":"K396","v":"Actual"},null,null,{"$f":"N396","v":""},null,null,{"$f":"K419","v":"Actual"},{"$f":"IF(G419=0,\"\",L419/G419)","v":""},{"$f":"IF(G419=0,\"\",M419/G419)","v":""},{"$f":"N419","v":""},{"$f":"IF(T419=\"\",\"\",IF(I419=0,\"\",O419/I419))","v":""}]
[null,null,"Historical",2017,null,"Actual",null,"",null,null,"Actual",null,null,"",null,null,"Actual","","","",""]
[null,null,"Historical",2018,null,"Actual",null,"",null,null,"Actual",null,null,"",null,null,"Actual","","","",""]
[null,null,"Historical",2019,null,"Actual",null,"",null,null,"Actual",null,null,"",null,null,"Actual","","","",""]
[null,null,"Bridge Year (Forecast)",2020,null,"Forecast",null,"",null,null,"Forecast",null,null,"",null,null,"Forecast","","","",""]
[null,null,"Test Year (Forecast)",{"$f":"TestYear","v":2021},null,"Forecast",null,"",null,null,"Forecast",null,null,"",null,null,"Forecast","","","",""]
[null,null,null,null,null,null,null,null,{"$f":"SUM(I417:I423)","v":0},null,null,null,null,null,{"$f":"SUM(O417:O423)","v":0},null,null,null,null,null,{"$f":"SUM(U417:U423)","v":0}]
[null,null,"Variance Analysis","Year",null,null,"Year-over-year",null,{"$f":"I403","v":"Test Year Versus OEB-approved"},null,"Year","Year-over-year",null,null,{"$f":"I426","v":"Test Year Versus OEB-approved"},null,"Year","Year-over-year",null,null,{"$f":"O426","v":"Test Year Versus OEB-approved"}]
[null,null,null,{"$f":"D417","v":2014},null,null,null,null,null,null,{"$f":"D427","v":2014},null,null,null,null,null,{"$f":"K427","v":2014}]
[null,null,null,2015,null,null,{"$f":"IF(G417=0,\"\",G418/G417-1)","v":""}]
[null,null,null,2016,null,null,{"$f":"IF(G417=0,\"\",G419/G417-1)","v":""},null,null,null,{"$f":"D429","v":2016},{"$f":"IF(L417=0,\"\",L419/L417-1)","v":""},"",null,null,null,{"$f":"K429","v":2016},{"$f":"IF(R417=\"\",\"\",IF(R417=0,\"\",R419/R417-1))","v":""},{"$f":"IF(S417=\"\",\"\",IF(S417=0,\"\",S419/S417-1))","v":""}]
[null,null,null,2017,null,null,{"$f":"IF(G419=0,\"\",G420/G419-1)","v":""},null,null,null,2017,{"$f":"IF(L419=0,\"\",L420/L419-1)","v":""},"",null,null,null,2017,{"$f":"IF(R419=\"\",\"\",IF(R419=0,\"\",R420/R419-1))","v":""},""]
[null,null,null,2018,null,null,{"$f":"IF(G420=0,\"\",G421/G420-1)","v":""},null,null,null,2018,{"$f":"IF(L420=0,\"\",L421/L420-1)","v":""},"",null,null,null,2018,{"$f":"IF(R420=\"\",\"\",IF(R420=0,\"\",R421/R420-1))","v":""},""]
[null,null,null,2019,null,null,{"$f":"IF(G421=0,\"\",G422/G421-1)","v":""},null,null,null,2019,{"$f":"IF(L421=0,\"\",L422/L421-1)","v":""},"",null,null,null,2019,{"$f":"IF(R421=\"\",\"\",IF(R421=0,\"\",R422/R421-1))","v":""},""]
[null,null,null,2020,null,null,{"$f":"IF(G422=0,\"\",G423/G422-1)","v":""},null,null,null,2020,{"$f":"IF(K423=\"Forecast\",\"\",IF(L422=0,\"\",L423/L422-1))","v":""},{"$f":"IF(M422=0,\"\",M423/M422-1)","v":""},null,null,null,2020,{"$f":"IF(Q423=\"Forecast\",\"\",IF(R422=0,\"\",R423/R422-1))","v":""},{"$f":"IF(S422=\"\",\"\",IF(S422=0,\"\",S423/S422-1))","v":""}]
[null,null,null,2021,null,null,{"$f":"IF(G423=0,\"\",G424/G423-1)","v":""},null,{"$f":"IF(I425=0,\"\",G424/I425-1)","v":""},null,2021,{"$f":"IF(K424=\"Forecast\",\"\",IF(L423=0,\"\",L424/L423-1))","v":""},{"$f":"IF(M423=0,\"\",M424/M423-1)","v":""},null,{"$f":"IF(O425=0,\"\",M424/O425-1)","v":""},null,2021,{"$f":"IF(Q424=\"Forecast\",\"\",IF(R423=0,\"\",R424/R423-1))","v":""},{"$f":"IF(S423=\"\",\"\",IF(S423=0,\"\",S424/S423-1))","v":""},null,{"$f":"IF(U425=0,\"\",S424/U425-1)","v":""}]
[null,null,null,"Geometric Mean",null,null,{"$f":"IF(G417=0,\"\",(G424/G417)^(1/($D424-$D417-1))-1)","v":""},null,{"$f":"IF(I425=0,\"\",(G424/I425)^(1/(TestYear-RebaseYear-1))-1)","v":""},null,"Geometric Mean",{"$f":"IF(L417=0,\"\",(L422/L417)^(1/($D422-$D417-1))-1)","v":""},{"$f":"IF(M417=0,\"\",(M424/M417)^(1/($D424-$D417-1))-1)","v":""},null,{"$f":"IF(O425=0,\"\",(M424/O425)^(1/(TestYear-RebaseYear-1))-1)","v":""},null,"Geometric Mean",{"$f":"IF(R417=\"\",\"\",IF(R417=0,\"\",(R422/R417)^(1/($D422-$D417-1))-1))","v":""},{"$f":"IF(S417=\"\",\"\",IF(S417=0,\"\",(S424/S417)^(1/($D424-$D417-1))-1))","v":""},null,{"$f":"IF(U425=0,\"\",(S424/U425)^(1/(TestYear-RebaseYear-1))-1)","v":""}]
[]
[null,9,"Customer Class:",null,null,null,null,null,null,null,"Is the customer class billed on consumption (kWh) or demand (kW or kVA)?",null,null,null,null,null,"kWh"]
[]
[null,null,null,"Calendar Year",null,"Customers",null,null,null,null,"Consumption (kWh) (3)",null,null,null,null,null,{"$f":"CONCATENATE(\"Consumption (kWh) per \",LEFT(F439,LEN(F439)-1))","v":"Consumption (kWh) per Customer"}]
[null,null,null,{"$f":"CONCATENATE(\"(for \",TestYear,\" Cost of Service\")","v":"(for 2021 Cost of Service"},null,null,null,null,null,null,null,"Actual (Weather actual)","Weather-normalized",null,"Weather-normalized",null,null,{"$f":"L440","v":"Actual (Weather actual)"},{"$f":"M440","v":"Weather-normalized"},null,{"$f":"O440","v":"Weather-normalized"}]
[null,null,"Historical",{"$f":"D442-1","v":2014},null,{"$f":"$K$42","v":"Actual"},null,{"$f":"IF(D441=RebaseYear,\"OEB-approved\",\"\")","v":"OEB-approved"},null,null,{"$f":"F441","v":"Actual"},null,null,{"$f":"H441","v":"OEB-approved"},null,null,{"$f":"K441","v":"Actual"},{"$f":"IF(G441=0,\"\",L441/G441)","v":""},{"$f":"IF(G441=0,\"\",M441/G441)","v":""},{"$f":"N441","v":"OEB-approved"},{"$f":"IF(T441=\"\",\"\",IF(I441=0,\"\",O441/I441))","v":""}]
[null,null,"Historical",2015,null,{"$f":"$K$43","v":"Actual"},null,"",null,null,"Actual",null,null,"",null,null,"Actual","","","",""]
[null,null,"Historical",2016,null,{"$f":"$K$41","v":"Actual"},null,{"$f":"IF(D443=RebaseYear,\"OEB-approved\",\"\")","v":""},null,null,{"$f":"F443","v":"Actual"},null,null,{"$f":"H443","v":""},null,null,{"$f":"K443","v":"Actual"},{"$f":"IF(G443=0,\"\",L443/G443)","v":""},{"$f":"IF(G443=0,\"\",M443/G443)","v":""},{"$f":"N443","v":""},{"$f":"IF(T443=\"\",\"\",IF(I443=0,\"\",O443/I443))","v":""}]
[null,null,"Historical",2017,null,{"$f":"$K$42","v":"Actual"},null,"",null,null,"Actual",null,null,{"$f":"H444","v":""},null,null,"Actual","","",{"$f":"N444","v":""},{"$f":"IF(T444=\"\",\"\",IF(I444=0,\"\",O444/I444))","v":""}]
[null,null,"Historical",2018,null,{"$f":"$K$43","v":"Actual"},null,"",null,null,"Actual",null,null,"",null,null,"Actual","","","",""]
[null,null,"Historical",2019,null,{"$f":"$K$44","v":"Actual"},null,"",null,null,"Actual",null,null,"",null,null,"Actual","","","",""]
[null,null,"Bridge Year",{"$f":"D448-1","v":2020},null,{"$f":"$K$45","v":"Forecast"},null,"",null,null,"Forecast",null,null,"",null,null,"Forecast","","","",""]
[null,null,"Test Year",{"$f":"TestYear","v":2021},null,{"$f":"$K$46","v":"Forecast"},null,"",null,null,"Forecast",null,null,"",null,null,"Forecast","","","",""]
[null,null,null,null,null,null,null,null,{"$f":"SUM(I441:I447)","v":0},null,null,null,null,null,{"$f":"SUM(O441:O447)","v":0},null,null,null,null,null,{"$f":"SUM(U441:U447)","v":0}]
[null,null,"Variance Analysis","Year",null,null,"Year-over-year",null,"Test Year Versus OEB-approved",null,"Year","Year-over-year",null,null,{"$f":"I450","v":"Test Year Versus OEB-approved"},null,"Year","Year-over-year",null,null,{"$f":"O450","v":"Test Year Versus OEB-approved"}]
[null,null,null,{"$f":"D441","v":2014},null,null,null,null,null,null,{"$f":"D451","v":2014},null,null,null,null,null,{"$f":"K451","v":2014}]
[null,null,null,2015,null,null,{"$f":"IF(G441=0,\"\",G442/G441-1)","v":""},null,null,null,{"$f":"D452","v":2015},{"$f":"IF(L441=0,\"\",L442/L441-1)","v":""},"",null,null,null,{"$f":"K452","v":2015},{"$f":"IF(R441=\"\",\"\",IF(R441=0,\"\",R442/R441-1))","v":""},""]
[null,null,null,2016,null,null,{"$f":"IF(G441=0,\"\",G443/G441-1)","v":""},null,null,null,{"$f":"D453","v":2016},{"$f":"IF(L441=0,\"\",L443/L441-1)","v":""},"",null,null,null,{"$f":"K453","v":2016},{"$f":"IF(R441=\"\",\"\",IF(R441=0,\"\",R443/R441-1))","v":""},{"$f":"IF(S441=\"\",\"\",IF(S441=0,\"\",S443/S441-1))","v":""}]
[null,null,null,2017,null,null,{"$f":"IF(G443=0,\"\",G444/G443-1)","v":""},null,null,null,2017,{"$f":"IF(L443=0,\"\",L444/L443-1)","v":""},"",null,null,null,2017,{"$f":"IF(R443=\"\",\"\",IF(R443=0,\"\",R444/R443-1))","v":""},""]
[null,null,null,2018,null,null,{"$f":"IF(G444=0,\"\",G445/G444-1)","v":""},null,null,null,2018,{"$f":"IF(L444=0,\"\",L445/L444-1)","v":""},"",null,null,null,2018,{"$f":"IF(R444=\"\",\"\",IF(R444=0,\"\",R445/R444-1))","v":""},""]
[null,null,null,2019,null,null,{"$f":"IF(G445=0,\"\",G446/G445-1)","v":""},null,null,null,2019,{"$f":"IF(L445=0,\"\",L446/L445-1)","v":""},"",null,null,null,2019,{"$f":"IF(R445=\"\",\"\",IF(R445=0,\"\",R446/R445-1))","v":""},""]
[null,null,null,2020,null,null,{"$f":"IF(G446=0,\"\",G447/G446-1)","v":""},null,null,null,2020,{"$f":"IF(K447=\"Forecast\",\"\",IF(L446=0,\"\",L447/L446-1))","v":""},{"$f":"IF(M446=0,\"\",M447/M446-1)","v":""},null,null,null,2020,{"$f":"IF(Q447=\"Forecast\",\"\",IF(R446=0,\"\",R447/R446-1))","v":""},{"$f":"IF(S446=\"\",\"\",IF(S446=0,\"\",S447/S446-1))","v":""}]
[null,null,null,2021,null,null,{"$f":"IF(G447=0,\"\",G448/G447-1)","v":""},null,{"$f":"IF(I449=0,\"\",G448/I449-1)","v":""},null,2021,{"$f":"IF(K448=\"Forecast\",\"\",IF(L447=0,\"\",L448/L447-1))","v":""},{"$f":"IF(M447=0,\"\",M448/M447-1)","v":""},null,{"$f":"IF(O449=0,\"\",M448/O449-1)","v":""},null,2021,{"$f":"IF(Q448=\"Forecast\",\"\",IF(R447=0,\"\",R448/R447-1))","v":""},{"$f":"IF(S447=\"\",\"\",IF(S447=0,\"\",S448/S447-1))","v":""},null,{"$f":"IF(U449=0,\"\",S448/U449-1)","v":""}]
[null,null,null,"Geometric Mean",null,null,{"$f":"IF(G441=0,\"\",(G448/G441)^(1/($D448-$D441-1))-1)","v":""},null,{"$f":"IF(I449=0,\"\",(G448/I449)^(1/(TestYear-RebaseYear-1))-1)","v":""},null,"Geometric Mean",{"$f":"IF(L441=0,\"\",(L446/L441)^(1/($D446-$D441-1))-1)","v":""},{"$f":"IF(M441=0,\"\",(M448/M441)^(1/($D448-$D441-1))-1)","v":""},null,{"$f":"IF(O449=0,\"\",(M448/O449)^(1/(TestYear-RebaseYear-1))-1)","v":""},null,"Geometric Mean",{"$f":"IF(R441=\"\",\"\",IF(R441=0,\"\",(R446/R441)^(1/($D446-$D441-1))-1))","v":""},{"$f":"IF(S441=\"\",\"\",IF(S441=0,\"\",(S448/S441)^(1/($D448-$D441-1))-1))","v":""},null,{"$f":"IF(U449=0,\"\",(S448/U449)^(1/(TestYear-RebaseYear-1))-1)","v":""}]
[]
[]
[null,null,null,"Calendar Year",null,"Revenues",null,null,null,null,{"$f":"IF(ISBLANK(Q437),\"\",CONCATENATE(\"Demand (\",Q437,\")\"))","v":"Demand (kWh)"},null,null,null,null,null,{"$f":"CONCATENATE(\"Demand (\",Q437,\") per \",LEFT(F439,LEN(F439)-1))","v":"Demand (kWh) per Customer"}]
[null,null,null,{"$f":"CONCATENATE(\"(for \",TestYear,\" Cost of Service\")","v":"(for 2021 Cost of Service"},null,null,null,null,null,null,null,"Actual (Weather actual)","Weather-normalized",null,{"$f":"M463","v":"Weather-normalized"},null,null,{"$f":"L463","v":"Actual (Weather actual)"},{"$f":"M463","v":"Weather-normalized"},null,{"$f":"O463","v":"Weather-normalized"}]
[null,null,"Historical",{"$f":"D465-1","v":2014},null,{"$f":"F441","v":"Actual"},null,{"$f":"IF(D464=RebaseYear,\"OEB-approved\",\"\")","v":"OEB-approved"},null,null,{"$f":"K441","v":"Actual"},null,null,{"$f":"N441","v":"OEB-approved"},null,null,{"$f":"K464","v":"Actual"},{"$f":"IF(G464=0,\"\",L464/G464)","v":""},{"$f":"IF(G464=0,\"\",M464/G464)","v":""},{"$f":"N464","v":"OEB-approved"},{"$f":"IF(T464=\"\",\"\",IF(I464=0,\"\",O464/I464))","v":""}]
[null,null,"Historical",2015,null,"Actual",null,""]
[null,null,"Historical",2016,null,"Actual",null,{"$f":"IF(D466=RebaseYear,\"OEB-approved\",\"\")","v":""},null,null,{"$f":"K443","v":"Actual"},null,null,{"$f":"N443","v":""},null,null,{"$f":"K466","v":"Actual"},{"$f":"IF(G466=0,\"\",L466/G466)","v":""},{"$f":"IF(G466=0,\"\",M466/G466)","v":""},{"$f":"N466","v":""},{"$f":"IF(T466=\"\",\"\",IF(I466=0,\"\",O466/I466))","v":""}]
[null,null,"Historical",2017,null,"Actual",null,"",null,null,"Actual",null,null,"",null,null,"Actual","","","",""]
[null,null,"Historical",2018,null,"Actual",null,"",null,null,"Actual",null,null,"",null,null,"Actual","","","",""]
[null,null,"Historical",2019,null,"Actual",null,"",null,null,"Actual",null,null,"",null,null,"Actual","","","",""]
[null,null,"Bridge Year (Forecast)",2020,null,"Forecast",null,"",null,null,"Forecast",null,null,"",null,null,"Forecast","","","",""]
[null,null,"Test Year (Forecast)",{"$f":"TestYear","v":2021},null,"Forecast",null,"",null,null,"Forecast",null,null,"",null,null,"Forecast","","","",""]
[null,null,null,null,null,null,null,null,{"$f":"SUM(I464:I470)","v":0},null,null,null,null,null,{"$f":"SUM(O464:O470)","v":0},null,null,null,null,null,{"$f":"SUM(U464:U470)","v":0}]
[null,null,"Variance Analysis","Year",null,null,"Year-over-year",null,{"$f":"I450","v":"Test Year Versus OEB-approved"},null,"Year","Year-over-year",null,null,{"$f":"I473","v":"Test Year Versus OEB-approved"},null,"Year","Year-over-year",null,null,{"$f":"O473","v":"Test Year Versus OEB-approved"}]
[null,null,null,{"$f":"D464","v":2014},null,null,null,null,null,null,{"$f":"D474","v":2014},null,null,null,null,null,{"$f":"K474","v":2014}]
[null,null,null,2015,null,null,{"$f":"IF(G464=0,\"\",G465/G464-1)","v":""},null,null,null,{"$f":"D475","v":2015}]
[null,null,null,2016,null,null,{"$f":"IF(G464=0,\"\",G466/G464-1)","v":""},null,null,null,{"$f":"D476","v":2016},{"$f":"IF(L464=0,\"\",L466/L464-1)","v":""},"",null,null,null,{"$f":"K476","v":2016},{"$f":"IF(R464=\"\",\"\",IF(R464=0,\"\",R466/R464-1))","v":""},{"$f":"IF(S464=\"\",\"\",IF(S464=0,\"\",S466/S464-1))","v":""}]
[null,null,null,2017,null,null,{"$f":"IF(G466=0,\"\",G467/G466-1)","v":""},null,null,null,2017,{"$f":"IF(L466=0,\"\",L467/L466-1)","v":""},"",null,null,null,2017,{"$f":"IF(R466=\"\",\"\",IF(R466=0,\"\",R467/R466-1))","v":""},""]
[null,null,null,2018,null,null,{"$f":"IF(G467=0,\"\",G468/G467-1)","v":""},null,null,null,2018,{"$f":"IF(L467=0,\"\",L468/L467-1)","v":""},"",null,null,null,2018,{"$f":"IF(R467=\"\",\"\",IF(R467=0,\"\",R468/R467-1))","v":""},""]
[null,null,null,2019,null,null,{"$f":"IF(G468=0,\"\",G469/G468-1)","v":""},null,null,null,2019,{"$f":"IF(L468=0,\"\",L469/L468-1)","v":""},"",null,null,null,2019,{"$f":"IF(R468=\"\",\"\",IF(R468=0,\"\",R469/R468-1))","v":""},""]
[null,null,null,2020,null,null,{"$f":"IF(G469=0,\"\",G470/G469-1)","v":""},null,null,null,2020,{"$f":"IF(K470=\"Forecast\",\"\",IF(L469=0,\"\",L470/L469-1))","v":""},{"$f":"IF(M469=0,\"\",M470/M469-1)","v":""},null,null,null,2020,{"$f":"IF(Q470=\"Forecast\",\"\",IF(R469=0,\"\",R470/R469-1))","v":""},{"$f":"IF(S469=\"\",\"\",IF(S469=0,\"\",S470/S469-1))","v":""}]
[null,null,null,2021,null,null,{"$f":"IF(G470=0,\"\",G471/G470-1)","v":""},null,{"$f":"IF(I472=0,\"\",G471/I472-1)","v":""},null,2021,{"$f":"IF(K471=\"Forecast\",\"\",IF(L470=0,\"\",L471/L470-1))","v":""},{"$f":"IF(M470=0,\"\",M471/M470-1)","v":""},null,{"$f":"IF(O472=0,\"\",M471/O472-1)","v":""},null,2021,{"$f":"IF(Q471=\"Forecast\",\"\",IF(R470=0,\"\",R471/R470-1))","v":""},{"$f":"IF(S470=\"\",\"\",IF(S470=0,\"\",S471/S470-1))","v":""},null,{"$f":"IF(U472=0,\"\",S471/U472-1)","v":""}]
[null,null,null,"Geometric Mean",null,null,{"$f":"IF(G464=0,\"\",(G471/G464)^(1/($D471-$D464-1))-1)","v":""},null,{"$f":"IF(I472=0,\"\",(G471/I472)^(1/(TestYear-RebaseYear-1))-1)","v":""},null,"Geometric Mean",{"$f":"IF(L464=0,\"\",(L469/L464)^(1/($D469-$D464-1))-1)","v":""},{"$f":"IF(M464=0,\"\",(M471/M464)^(1/($D471-$D464-1))-1)","v":""},null,{"$f":"IF(O472=0,\"\",(M471/O472)^(1/(TestYear-RebaseYear-1))-1)","v":""},null,"Geometric Mean",{"$f":"IF(R464=\"\",\"\",IF(R464=0,\"\",(R469/R464)^(1/($D469-$D464-1))-1))","v":""},{"$f":"IF(S464=\"\",\"\",IF(S464=0,\"\",(S471/S464)^(1/($D471-$D464-1))-1))","v":""},null,{"$f":"IF(U472=0,\"\",(S471/U472)^(1/(TestYear-RebaseYear-1))-1)","v":""}]
[]
[null,10,"Customer Class:",null,null,null,null,null,null,null,"Is the customer class billed on consumption (kWh) or demand (kW or kVA)?",null,null,null,null,null,"kWh"]
[]
[null,null,null,"Calendar Year",null,"Customers",null,null,null,null,"Consumption (kWh) (3)",null,null,null,null,null,{"$f":"CONCATENATE(\"Consumption (kWh) per \",LEFT(F486,LEN(F486)-1))","v":"Consumption (kWh) per Customer"}]
[null,null,null,{"$f":"CONCATENATE(\"(for \",TestYear,\" Cost of Service\")","v":"(for 2021 Cost of Service"},null,null,null,null,null,null,null,"Actual (Weather actual)","Weather-normalized",null,"Weather-normalized",null,null,{"$f":"L487","v":"Actual (Weather actual)"},{"$f":"M487","v":"Weather-normalized"},null,{"$f":"O487","v":"Weather-normalized"}]
[null,null,"Historical",{"$f":"D489-1","v":2014},null,{"$f":"$K$41","v":"Actual"},null,{"$f":"IF(D488=RebaseYear,\"OEB-approved\",\"\")","v":"OEB-approved"},null,null,{"$f":"F488","v":"Actual"},null,null,{"$f":"H488","v":"OEB-approved"},null,null,{"$f":"K488","v":"Actual"},{"$f":"IF(G488=0,\"\",L488/G488)","v":""},{"$f":"IF(G488=0,\"\",M488/G488)","v":""},{"$f":"N488","v":"OEB-approved"},{"$f":"IF(T488=\"\",\"\",IF(I488=0,\"\",O488/I488))","v":""}]
[null,null,"Historical",2015,null,{"$f":"$K$42","v":"Actual"},null,"",null,null,"Actual",null,null,{"$f":"H489","v":""},null,null,"Actual","","",{"$f":"N489","v":""},{"$f":"IF(T489=\"\",\"\",IF(I489=0,\"\",O489/I489))","v":""}]
[null,null,"Historical",2016,null,{"$f":"$K$41","v":"Actual"},null,{"$f":"IF(D490=RebaseYear,\"OEB-approved\",\"\")","v":""},null,null,{"$f":"F490","v":"Actual"},null,null,{"$f":"H490","v":""},null,null,{"$f":"K490","v":"Actual"},{"$f":"IF(G490=0,\"\",L490/G490)","v":""},{"$f":"IF(G490=0,\"\",M490/G490)","v":""},{"$f":"N490","v":""},{"$f":"IF(T490=\"\",\"\",IF(I490=0,\"\",O490/I490))","v":""}]
[null,null,"Historical",2017,null,{"$f":"$K$42","v":"Actual"},null,"",null,null,"Actual",null,null,{"$f":"H491","v":""},null,null,"Actual","","",{"$f":"N491","v":""},{"$f":"IF(T491=\"\",\"\",IF(I491=0,\"\",O491/I491))","v":""}]
[null,null,"Historical",2018,null,{"$f":"$K$43","v":"Actual"},null,"",null,null,"Actual",null,null,"",null,null,"Actual","","","",""]
[null,null,"Historical",2019,null,{"$f":"$K$44","v":"Actual"},null,"",null,null,"Actual",null,null,"",null,null,"Actual","","","",""]
[null,null,"Bridge Year",{"$f":"D495-1","v":2020},null,{"$f":"$K$45","v":"Forecast"},null,"",null,null,"Forecast",null,null,"",null,null,"Forecast","","","",""]
[null,null,"Test Year",{"$f":"TestYear","v":2021},null,{"$f":"$K$46","v":"Forecast"},null,"",null,null,"Forecast",null,null,"",null,null,"Forecast","","","",""]
[null,null,null,null,null,null,null,null,{"$f":"SUM(I488:I494)","v":0},null,null,null,null,null,{"$f":"SUM(O488:O494)","v":0},null,null,null,null,null,{"$f":"SUM(U488:U494)","v":0}]
[null,null,"Variance Analysis","Year",null,null,"Year-over-year",null,"Test Year Versus OEB-approved",null,"Year","Year-over-year",null,null,{"$f":"I497","v":"Test Year Versus OEB-approved"},null,"Year","Year-over-year",null,null,{"$f":"O497","v":"Test Year Versus OEB-approved"}]
[null,null,null,{"$f":"D488","v":2014},null,null,null,null,null,null,{"$f":"D498","v":2014},null,null,null,null,null,{"$f":"K498","v":2014}]
[null,null,null,2015,null,null,{"$f":"IF(G488=0,\"\",G489/G488-1)","v":""},null,null,null,{"$f":"D499","v":2015},{"$f":"IF(L488=0,\"\",L489/L488-1)","v":""},"",null,null,null,{"$f":"K499","v":2015},{"$f":"IF(R488=\"\",\"\",IF(R488=0,\"\",R489/R488-1))","v":""},""]
[null,null,null,2016,null,null,{"$f":"IF(G488=0,\"\",G490/G488-1)","v":""},null,null,null,{"$f":"D500","v":2016},{"$f":"IF(L488=0,\"\",L490/L488-1)","v":""},"",null,null,null,{"$f":"K500","v":2016},{"$f":"IF(R488=\"\",\"\",IF(R488=0,\"\",R490/R488-1))","v":""},{"$f":"IF(S488=\"\",\"\",IF(S488=0,\"\",S490/S488-1))","v":""}]
[null,null,null,2017,null,null,{"$f":"IF(G490=0,\"\",G491/G490-1)","v":""},null,null,null,2017,{"$f":"IF(L490=0,\"\",L491/L490-1)","v":""},"",null,null,null,2017,{"$f":"IF(R490=\"\",\"\",IF(R490=0,\"\",R491/R490-1))","v":""},""]
[null,null,null,2018,null,null,{"$f":"IF(G491=0,\"\",G492/G491-1)","v":""},null,null,null,2018,{"$f":"IF(L491=0,\"\",L492/L491-1)","v":""},"",null,null,null,2018,{"$f":"IF(R491=\"\",\"\",IF(R491=0,\"\",R492/R491-1))","v":""},""]
[null,null,null,2019,null,null,{"$f":"IF(G492=0,\"\",G493/G492-1)","v":""},null,null,null,2019,{"$f":"IF(L492=0,\"\",L493/L492-1)","v":""},"",null,null,null,2019,{"$f":"IF(R492=\"\",\"\",IF(R492=0,\"\",R493/R492-1))","v":""},""]
[null,null,null,2020,null,null,{"$f":"IF(G493=0,\"\",G494/G493-1)","v":""},null,null,null,2020,{"$f":"IF(K494=\"Forecast\",\"\",IF(L493=0,\"\",L494/L493-1))","v":""},{"$f":"IF(M493=0,\"\",M494/M493-1)","v":""},null,null,null,2020,{"$f":"IF(Q494=\"Forecast\",\"\",IF(R493=0,\"\",R494/R493-1))","v":""},{"$f":"IF(S493=\"\",\"\",IF(S493=0,\"\",S494/S493-1))","v":""}]
[null,null,null,2021,null,null,{"$f":"IF(G494=0,\"\",G495/G494-1)","v":""},null,{"$f":"IF(I496=0,\"\",G495/I496-1)","v":""},null,2021,{"$f":"IF(K495=\"Forecast\",\"\",IF(L494=0,\"\",L495/L494-1))","v":""},{"$f":"IF(M494=0,\"\",M495/M494-1)","v":""},null,{"$f":"IF(O496=0,\"\",M495/O496-1)","v":""},null,2021,{"$f":"IF(Q495=\"Forecast\",\"\",IF(R494=0,\"\",R495/R494-1))","v":""},{"$f":"IF(S494=\"\",\"\",IF(S494=0,\"\",S495/S494-1))","v":""},null,{"$f":"IF(U496=0,\"\",S495/U496-1)","v":""}]
[null,null,null,"Geometric Mean",null,null,{"$f":"IF(G488=0,\"\",(G495/G488)^(1/($D495-$D488-1))-1)","v":""},null,{"$f":"IF(I496=0,\"\",(G495/I496)^(1/(TestYear-RebaseYear-1))-1)","v":""},null,"Geometric Mean",{"$f":"IF(L488=0,\"\",(L493/L488)^(1/($D493-$D488-1))-1)","v":""},{"$f":"IF(M488=0,\"\",(M495/M488)^(1/($D495-$D488-1))-1)","v":""},null,{"$f":"IF(O496=0,\"\",(M495/O496)^(1/(TestYear-RebaseYear-1))-1)","v":""},null,"Geometric Mean",{"$f":"IF(R488=\"\",\"\",IF(R488=0,\"\",(R493/R488)^(1/($D493-$D488-1))-1))","v":""},{"$f":"IF(S488=\"\",\"\",IF(S488=0,\"\",(S495/S488)^(1/($D495-$D488-1))-1))","v":""},null,{"$f":"IF(U496=0,\"\",(S495/U496)^(1/(TestYear-RebaseYear-1))-1)","v":""}]
[]
[]
[null,null,null,"Calendar Year",null,"Revenues",null,null,null,null,{"$f":"IF(ISBLANK(Q484),\"\",CONCATENATE(\"Demand (\",Q484,\")\"))","v":"Demand (kWh)"},null,null,null,null,null,{"$f":"CONCATENATE(\"Demand (\",Q484,\") per \",LEFT(F486,LEN(F486)-1))","v":"Demand (kWh) per Customer"}]
[null,null,null,{"$f":"CONCATENATE(\"(for \",TestYear,\" Cost of Service\")","v":"(for 2021 Cost of Service"},null,null,null,null,null,null,null,"Actual (Weather actual)","Weather-normalized",null,{"$f":"M510","v":"Weather-normalized"},null,null,{"$f":"L510","v":"Actual (Weather actual)"},{"$f":"M510","v":"Weather-normalized"},null,{"$f":"O510","v":"Weather-normalized"}]
[null,null,"Historical",{"$f":"D512-1","v":2014},null,{"$f":"F488","v":"Actual"},null,{"$f":"IF(D511=RebaseYear,\"OEB-approved\",\"\")","v":"OEB-approved"},null,null,{"$f":"K488","v":"Actual"},null,null,{"$f":"N488","v":"OEB-approved"},null,null,{"$f":"K511","v":"Actual"},{"$f":"IF(G511=0,\"\",L511/G511)","v":""},{"$f":"IF(G511=0,\"\",M511/G511)","v":""},{"$f":"N511","v":"OEB-approved"},{"$f":"IF(T511=\"\",\"\",IF(I511=0,\"\",O511/I511))","v":""}]
[null,null,"Historical",2015,null,"Actual",null,""]
[null,null,"Historical",2016,null,"Actual",null,{"$f":"IF(D513=RebaseYear,\"OEB-approved\",\"\")","v":""},null,null,{"$f":"K490","v":"Actual"},null,null,{"$f":"N490","v":""},null,null,{"$f":"K513","v":"Actual"},{"$f":"IF(G513=0,\"\",L513/G513)","v":""},{"$f":"IF(G513=0,\"\",M513/G513)","v":""},{"$f":"N513","v":""},{"$f":"IF(T513=\"\",\"\",IF(I513=0,\"\",O513/I513))","v":""}]
[null,null,"Historical",2017,null,"Actual",null,"",null,null,"Actual",null,null,"",null,null,"Actual","","","",""]
[null,null,"Historical",2018,null,"Actual",null,"",null,null,"Actual",null,null,"",null,null,"Actual","","","",""]
[null,null,"Historical",2019,null,"Actual",null,"",null,null,"Actual",null,null,"",null,null,"Actual","","","",""]
[null,null,"Bridge Year (Forecast)",2020,null,"Forecast",null,"",null,null,"Forecast",null,null,"",null,null,"Forecast","","","",""]
[null,null,"Test Year (Forecast)",{"$f":"TestYear","v":2021},null,"Forecast",null,"",null,null,"Forecast",null,null,"",null,null,"Forecast","","","",""]
[null,null,null,null,null,null,null,null,{"$f":"SUM(I511:I517)","v":0},null,null,null,null,null,{"$f":"SUM(O511:O517)","v":0},null,null,null,null,null,{"$f":"SUM(U511:U517)","v":0}]
[null,null,"Variance Analysis","Year",null,null,"Year-over-year",null,{"$f":"I497","v":"Test Year Versus OEB-approved"},null,"Year","Year-over-year",null,null,{"$f":"I520","v":"Test Year Versus OEB-approved"},null,"Year","Year-over-year",null,null,{"$f":"O520","v":"Test Year Versus OEB-approved"}]
[null,null,null,{"$f":"D511","v":2014},null,null,null,null,null,null,{"$f":"D521","v":2014},null,null,null,null,null,{"$f":"K521","v":2014}]
[null,null,null,2015,null,null,{"$f":"IF(G511=0,\"\",G512/G511-1)","v":""}]
[null,null,null,2016,null,null,{"$f":"IF(G511=0,\"\",G513/G511-1)","v":""},null,null,null,{"$f":"D523","v":2016},{"$f":"IF(L511=0,\"\",L513/L511-1)","v":""},"",null,null,null,{"$f":"K523","v":2016},{"$f":"IF(R511=\"\",\"\",IF(R511=0,\"\",R513/R511-1))","v":""},{"$f":"IF(S511=\"\",\"\",IF(S511=0,\"\",S513/S511-1))","v":""}]
[null,null,null,2017,null,null,{"$f":"IF(G513=0,\"\",G514/G513-1)","v":""},null,null,null,2017,{"$f":"IF(L513=0,\"\",L514/L513-1)","v":""},"",null,null,null,2017,{"$f":"IF(R513=\"\",\"\",IF(R513=0,\"\",R514/R513-1))","v":""},""]
[null,null,null,2018,null,null,{"$f":"IF(G514=0,\"\",G515/G514-1)","v":""},null,null,null,2018,{"$f":"IF(L514=0,\"\",L515/L514-1)","v":""},"",null,null,null,2018,{"$f":"IF(R514=\"\",\"\",IF(R514=0,\"\",R515/R514-1))","v":""},""]
[null,null,null,2019,null,null,{"$f":"IF(G515=0,\"\",G516/G515-1)","v":""},null,null,null,2019,{"$f":"IF(L515=0,\"\",L516/L515-1)","v":""},"",null,null,null,2019,{"$f":"IF(R515=\"\",\"\",IF(R515=0,\"\",R516/R515-1))","v":""},""]
[null,null,null,2020,null,null,{"$f":"IF(G516=0,\"\",G517/G516-1)","v":""},null,null,null,2020,{"$f":"IF(K517=\"Forecast\",\"\",IF(L516=0,\"\",L517/L516-1))","v":""},{"$f":"IF(M516=0,\"\",M517/M516-1)","v":""},null,null,null,2020,{"$f":"IF(Q517=\"Forecast\",\"\",IF(R516=0,\"\",R517/R516-1))","v":""},{"$f":"IF(S516=\"\",\"\",IF(S516=0,\"\",S517/S516-1))","v":""}]
[null,null,null,2021,null,null,{"$f":"IF(G517=0,\"\",G518/G517-1)","v":""},null,{"$f":"IF(I519=0,\"\",G518/I519-1)","v":""},null,2021,{"$f":"IF(K518=\"Forecast\",\"\",IF(L517=0,\"\",L518/L517-1))","v":""},{"$f":"IF(M517=0,\"\",M518/M517-1)","v":""},null,{"$f":"IF(O519=0,\"\",M518/O519-1)","v":""},null,2021,{"$f":"IF(Q518=\"Forecast\",\"\",IF(R517=0,\"\",R518/R517-1))","v":""},{"$f":"IF(S517=\"\",\"\",IF(S517=0,\"\",S518/S517-1))","v":""},null,{"$f":"IF(U519=0,\"\",S518/U519-1)","v":""}]
[null,null,null,"Geometric Mean",null,null,{"$f":"IF(G511=0,\"\",(G518/G511)^(1/($D518-$D511-1))-1)","v":""},null,{"$f":"IF(I519=0,\"\",(G518/I519)^(1/(TestYear-RebaseYear-1))-1)","v":""},null,"Geometric Mean",{"$f":"IF(L511=0,\"\",(L516/L511)^(1/($D516-$D511-1))-1)","v":""},{"$f":"IF(M511=0,\"\",(M518/M511)^(1/($D518-$D511-1))-1)","v":""},null,{"$f":"IF(O519=0,\"\",(M518/O519)^(1/(TestYear-RebaseYear-1))-1)","v":""},null,"Geometric Mean",{"$f":"IF(R511=\"\",\"\",IF(R511=0,\"\",(R516/R511)^(1/($D516-$D511-1))-1))","v":""},{"$f":"IF(S511=\"\",\"\",IF(S511=0,\"\",(S518/S511)^(1/($D518-$D511-1))-1))","v":""},null,{"$f":"IF(U519=0,\"\",(S518/U519)^(1/(TestYear-RebaseYear-1))-1)","v":""}]
[]
[null,"Note: If there are more than ten (10) customer classes, please contact OEB Staff to add tables for additional customer classes."]

{"sheet":"App.2-JA_OM&A_Summary_Analys","index":30,"n_rows":42,"n_cols":29,"rows_kept":42,"cut":false,"hidden":false,"merged":[[43,1,44,10],[39,0,39,42],[8,0,8,11],[9,0,9,11],[11,12,11,13],[40,0,40,42],[41,0,41,42]]}
[null,null,null,null,null,null,null,null,null,null,"File Number:",{"$f":"EBNUMBER","v":0},{"$f":"'LDC Info'!$E$28","v":2014},"Last Rebasing Year","Column"]
[null,null,null,null,null,null,null,null,null,null,"Exhibit:",null,{"$f":"TestYear","v":2021},2010,"B","ae"]
[null,null,null,null,null,null,null,null,null,null,"Tab:",null,{"$f":"'LDC Info'!$E$28","v":2014},2011,"D","ah"]
["TO BE UPDATED AT THE DRAFT RATE ORDER STAGE",null,null,null,null,null,null,null,null,null,"Schedule:",null,null,2012,"G","ak"]
[null,null,null,null,null,null,null,null,null,null,"Page:",null,null,2013,"J","an"]
[null,null,null,null,null,null,null,null,null,null,null,null,null,2014,"M","aq"]
[null,null,null,null,null,null,null,null,null,null,"Date:",null,null,2015,"P","at"]
[null,null,null,null,null,null,null,null,null,null,null,null,null,2016,"S","aw"]
["Appendix 2-JA",null,null,null,null,null,null,null,null,null,null,null,null,2017,"V","az"]
["Summary of Recoverable OM&A Expenses"]
[null,null,{"$f":"RebaseYear","v":2014},{"$f":"TestYear-8","v":2013},{"$f":"TestYear-7","v":2014},{"$f":"TestYear-6","v":2015},{"$f":"TestYear-5","v":2016},{"$f":"TestYear-4","v":2017},{"$f":"TestYear-3","v":2018},{"$f":"TestYear-2","v":2019},{"$f":"BridgeYear","v":2020},{"$f":"TestYear","v":2021},null,null,null,{"$f":"C11","v":2014},null,null,{"$f":"D11","v":2013},{"$f":"E11","v":2014},2015,2016,2017,2018,2019,2020,null,{"$f":"L11","v":2021}]
[null,{"$f":"CONCATENATE(C11,\" \",IF($M1=C11,\"Last Rebasing Year \",\"\"),\"OEB Approved\")","v":"2014 Last Rebasing Year OEB Approved"},{"$f":"CONCATENATE(C11,\" \",IF($M1=C11,\"Last Rebasing Year \",\"\"),\"Actuals\")","v":"2014 Last Rebasing Year Actuals"},"2013 Actuals","2014 Last Rebasing Year Actuals","2015 Actuals","2016 Actuals","2017 Actuals","2018 Actuals","2019 Actuals",{"$f":"BridgeYear & \" Bridge Year\"","v":"2020 Bridge Year"},{"$f":"TestYear & \" Test Year\"","v":"2021 Test Year"},null,null,null,{"$f":"CONCATENATE(IF($M1=P11,\"Last Rebasing Year \",\"\"),,P11,\" OEB Approved\")","v":"Last Rebasing Year 2014 OEB Approved"},{"$f":"CONCATENATE(IF($M1=P11,\"Last Rebasing Year \",\"\"),P11,\" Actuals\")","v":"Last Rebasing Year 2014 Actuals"},{"$f":"CONCATENATE(\"Variance \",P11,\" OEB Approved - \",P11,\" Actuals\")","v":"Variance 2014 OEB Approved - 2014 Actuals"},{"$f":"CONCATENATE(IF($M1=S11,\"Last Rebasing Year \",\"\"),S11,\" Actuals\")","v":"2013 Actuals"},"Last Rebasing Year 2014 Actuals","2015 Actuals","2016 Actuals","2017 Actuals","2018 Actuals","2019 Actuals",{"$f":"CONCATENATE(Z11,\" Bridge Year\")","v":"2020 Bridge Year"},{"$f":"CONCATENATE(\"Variance \",Z11,\" Bridge vs. \",Z11-1,\" Actuals\")","v":"Variance 2020 Bridge vs. 2019 Actuals"},{"$f":"CONCATENATE(AB11,\" Test Year\")","v":"2021 Test Year"},{"$f":"CONCATENATE(\"Variance \",AB11,\" Test vs. \",AB11-1,\" Bridge\")","v":"Variance 2021 Test vs. 2020 Bridge"}]
["Reporting Basis",null,null,null,null,null,null,null,null,null,null,null,null,null,"Operations",{"$f":"B14","v":0},{"$f":"C14","v":0},{"$f":"P13-Q13","v":0},{"$f":"D14","v":0},0,0,0,0,0,0,0,{"$f":"Z13-Y13","v":0},{"$f":"L14","v":0},{"$f":"AB13-Z13","v":0}]
["Operations",null,null,null,null,null,null,null,null,null,null,null,null,null,"Maintenance ",{"$f":"B15","v":0},{"$f":"C15","v":0},0,0,0,0,0,0,0,0,0,0,{"$f":"L15","v":0},{"$f":"AB14-Z14","v":0}]
["Maintenance",null,null,null,null,null,null,null,null,null,null,null,null,null,"Billing and Collecting ",{"$f":"B19","v":0},0,0,{"$f":"D19","v":0},0,0,0,0,0,0,0,0,{"$f":"L19","v":0},0]
["SubTotal",{"$f":"SUM(B14:B15)","v":0},{"$f":"SUM(C14:C15)","v":0},0,0,0,{"$f":"SUM(G14:G15)","v":0},0,0,0,0,0,null,null,"Community Relations ",0,0,0,0,0,0,0,0,0,0,0,0,{"$f":"L20","v":0},{"$f":"AB16-Z16","v":0}]
["%Change (year over year)",null,{"$f":"IF(ISERROR((C16-B16)/B16), \"\", (C16-B16)/B16)","v":""},{"$f":"IF(ISERROR((D16-HLOOKUP(D11-1,$A$11:C26,6,FALSE))/HLOOKUP(D11-1,$A$11:C26,6,FALSE)), \"\", (D16-HLOOKUP(D11-1,$A$11:C26,6,FALSE))/HLOOKUP(D11-1,$A$11:C26,6,FALSE))","v":""},{"$f":"IF(ISERROR((E16-HLOOKUP(E11-1,$A$11:D26,6,FALSE))/HLOOKUP(E11-1,$A$11:D26,6,FALSE)), \"\", (E16-HLOOKUP(E11-1,$A$11:D26,6,FALSE))/HLOOKUP(E11-1,$A$11:D26,6,FALSE))","v":""},{"$f":"IF(ISERROR((F16-HLOOKUP(F11-1,$A$11:E26,6,FALSE))/HLOOKUP(F11-1,$A$11:E26,6,FALSE)), \"\", (F16-HLOOKUP(F11-1,$A$11:E26,6,FALSE))/HLOOKUP(F11-1,$A$11:E26,6,FALSE))","v":""},{"$f":"IF(ISERROR((G16-HLOOKUP(G11-1,$A$11:F26,6,FALSE))/HLOOKUP(G11-1,$A$11:F26,6,FALSE)), \"\", (G16-HLOOKUP(G11-1,$A$11:F26,6,FALSE))/HLOOKUP(G11-1,$A$11:F26,6,FALSE))","v":""},{"$f":"IF(ISERROR((H16-HLOOKUP(H11-1,$A$11:G26,6,FALSE))/HLOOKUP(H11-1,$A$11:G26,6,FALSE)), \"\", (H16-HLOOKUP(H11-1,$A$11:G26,6,FALSE))/HLOOKUP(H11-1,$A$11:G26,6,FALSE))","v":""},{"$f":"IF(ISERROR((I16-HLOOKUP(I11-1,$A$11:H26,6,FALSE))/HLOOKUP(I11-1,$A$11:H26,6,FALSE)), \"\", (I16-HLOOKUP(I11-1,$A$11:H26,6,FALSE))/HLOOKUP(I11-1,$A$11:H26,6,FALSE))","v":""},{"$f":"IF(ISERROR((J16-HLOOKUP(J11-1,$A$11:I26,6,FALSE))/HLOOKUP(J11-1,$A$11:I26,6,FALSE)), \"\", (J16-HLOOKUP(J11-1,$A$11:I26,6,FALSE))/HLOOKUP(J11-1,$A$11:I26,6,FALSE))","v":""},{"$f":"IF(ISERROR((K16-HLOOKUP(K11-1,$A$11:J26,6,FALSE))/HLOOKUP(K11-1,$A$11:J26,6,FALSE)), \"\", (K16-HLOOKUP(K11-1,$A$11:J26,6,FALSE))/HLOOKUP(K11-1,$A$11:J26,6,FALSE))","v":""},{"$f":"IF(ISERROR((L16-K16)/K16), \"\", (L16-K16)/K16)","v":""},null,null,"Administrative and General ",0,0,0,0,0,0,0,0,0,0,0,0,{"$f":"L21","v":0},0]
["%Change (Test Year vs \nLast Rebasing Year - Actual)",null,null,null,null,null,null,null,null,null,null,{"$f":"IF(ISERROR((L16-C16)/C16), \"\", (L16-C16)/C16)","v":""},null,null,"Total OM&A Expenses ",{"$f":"B25","v":0},{"$f":"C25","v":0},{"$f":"P18-Q18","v":0},0,0,0,0,{"$f":"H25","v":0},{"$f":"I25","v":0},{"$f":"J25","v":0},{"$f":"K25","v":0},0,{"$f":"L25","v":0},0]
["Billing and Collecting",null,null,null,null,null,null,null,null,null,null,null,null,null,"Adjustments for Total non-recoverable items3"]
["Community Relations",null,null,null,null,null,null,null,null,null,null,null,null,null,"Total Recoverable OM&A Expenses ",{"$f":"P18-P19","v":0},0,0,{"$f":"IF(S11<=RebaseYear, 0, S18-S19)","v":0},0,0,0,0,0,0,0,{"$f":"AA18-AA19","v":0},0,0]
["Administrative and General",null,null,null,null,null,null,null,null,null,null,null,null,null,"Variance from previous year ",null,null,null,{"$f":"IF(S11<=RebaseYear, 0, S20-Q20)","v":0},{"$f":"IF(T11<=RebaseYear, 0, IF(T11=RebaseYear+1, T20-$Q$20, T20-S20))","v":0},0,0,0,0,0,0,null,{"$f":"AB20-Z20","v":0}]
["SubTotal",{"$f":"SUM(B19:B21)","v":0},{"$f":"SUM(C19:C21)","v":0},0,0,0,0,0,0,{"$f":"SUM(J19:J21)","v":0},{"$f":"SUM(K19:K21)","v":0},{"$f":"SUM(L19:L21)","v":0},null,null,"Percent change (year over year) ",null,null,null,{"$f":"IF(S11<=RebaseYear, 0, IF(ISERROR(S21/Q20), \"\", S21/Q20))","v":0},{"$f":"IF(S11<=RebaseYear, 0, IF(T11=RebaseYear+1, IF(ISERROR(T21/$Q$20), \"\", T21/$Q$20),IF(ISERROR(T21/S20), \"\", T21/S20)))","v":0},0,"","","","","",null,{"$f":"IF(ISERROR(AB21/Z20), \"\", AB21/Z20)","v":""}]
["%Change (year over year)",null,{"$f":"IF(ISERROR((C22-B22)/B22), \"\", (C22-B22)/B22)","v":""},{"$f":"IF(ISERROR((D22-HLOOKUP(D11-1,$A$11:C26,12,FALSE))/HLOOKUP(D11-1,$A$11:C26,12,FALSE)), \"\", (D22-HLOOKUP(D11-1,$A$11:C26,12,FALSE))/HLOOKUP(D11-1,$A$11:C26,12,FALSE))","v":""},{"$f":"IF(ISERROR((E22-HLOOKUP(E11-1,$A$11:D26,12,FALSE))/HLOOKUP(E11-1,$A$11:D26,12,FALSE)), \"\", (E22-HLOOKUP(E11-1,$A$11:D26,12,FALSE))/HLOOKUP(E11-1,$A$11:D26,12,FALSE))","v":""},{"$f":"IF(ISERROR((F22-HLOOKUP(F11-1,$A$11:E26,12,FALSE))/HLOOKUP(F11-1,$A$11:E26,12,FALSE)), \"\", (F22-HLOOKUP(F11-1,$A$11:E26,12,FALSE))/HLOOKUP(F11-1,$A$11:E26,12,FALSE))","v":""},{"$f":"IF(ISERROR((G22-HLOOKUP(G11-1,$A$11:F26,12,FALSE))/HLOOKUP(G11-1,$A$11:F26,12,FALSE)), \"\", (G22-HLOOKUP(G11-1,$A$11:F26,12,FALSE))/HLOOKUP(G11-1,$A$11:F26,12,FALSE))","v":""},{"$f":"IF(ISERROR((H22-HLOOKUP(H11-1,$A$11:G26,12,FALSE))/HLOOKUP(H11-1,$A$11:G26,12,FALSE)), \"\", (H22-HLOOKUP(H11-1,$A$11:G26,12,FALSE))/HLOOKUP(H11-1,$A$11:G26,12,FALSE))","v":""},{"$f":"IF(ISERROR((I22-HLOOKUP(I11-1,$A$11:H26,12,FALSE))/HLOOKUP(I11-1,$A$11:H26,12,FALSE)), \"\", (I22-HLOOKUP(I11-1,$A$11:H26,12,FALSE))/HLOOKUP(I11-1,$A$11:H26,12,FALSE))","v":""},{"$f":"IF(ISERROR((J22-HLOOKUP(J11-1,$A$11:I26,12,FALSE))/HLOOKUP(J11-1,$A$11:I26,12,FALSE)), \"\", (J22-HLOOKUP(J11-1,$A$11:I26,12,FALSE))/HLOOKUP(J11-1,$A$11:I26,12,FALSE))","v":""},{"$f":"IF(ISERROR((K22-HLOOKUP(K11-1,$A$11:J26,12,FALSE))/HLOOKUP(K11-1,$A$11:J26,12,FALSE)), \"\", (K22-HLOOKUP(K11-1,$A$11:J26,12,FALSE))/HLOOKUP(K11-1,$A$11:J26,12,FALSE))","v":""},{"$f":"IF(ISERROR((L22-K22)/K22), \"\", (L22-K22)/K22)","v":""},null,null,"Percent Change:                                                    Test year vs. Most Current Actual ",null,null,null,null,null,null,null,null,null,null,null,null,{"$f":"IF(ISERROR((AB20-Y20)/Y20), \"\", (AB20-Y20)/Y20)","v":""}]
["%Change (Test Year vs \nLast Rebasing Year - Actual)",null,null,null,null,null,null,null,null,null,null,{"$f":"IF(ISERROR((L22-C22)/C22), \"\", (L22-C22)/C22)","v":""},null,null,"Simple average of % variance for all years",null,null,null,null,null,null,null,null,null,null,null,null,{"$f":"IF(ISERROR(AVERAGEIF(S22:AB22,\"<>0\")),0,AVERAGEIF(S22:AB22,\"<>0\"))","v":0}]
["Total",{"$f":"SUM(B22,B16)","v":0},{"$f":"SUM(C22,C16)","v":0},0,0,0,{"$f":"SUM(G22,G16)","v":0},{"$f":"SUM(H22,H16)","v":0},0,{"$f":"SUM(J22,J16)","v":0},{"$f":"SUM(K22,K16)","v":0},{"$f":"SUM(L22,L16)","v":0},null,null,"Compound Annual Growth Rate for all years",null,null,null,null,null,null,null,null,null,null,null,null,null,{"$f":"IF((AB20-Q20)=0, \"\", (AB20/Q20)^(1/(TestYear-RebaseYear))-1)","v":""}]
["%Change (year over year)",null,{"$f":"IF(ISERROR((C25-B25)/B25), \"\", (C25-B25)/B25)","v":""},{"$f":"IF(ISERROR((D25-HLOOKUP(D11-1,$A$11:C26,15,FALSE))/HLOOKUP(D11-1,$A$11:C26,15,FALSE)), \"\", (D25-HLOOKUP(D11-1,$A$11:C26,15,FALSE))/HLOOKUP(D11-1,$A$11:C26,15,FALSE))","v":""},{"$f":"IF(ISERROR((E25-HLOOKUP(E11-1,$A$11:D26,15,FALSE))/HLOOKUP(E11-1,$A$11:D26,15,FALSE)), \"\", (E25-HLOOKUP(E11-1,$A$11:D26,15,FALSE))/HLOOKUP(E11-1,$A$11:D26,15,FALSE))","v":""},{"$f":"IF(ISERROR((F25-HLOOKUP(F11-1,$A$11:E26,15,FALSE))/HLOOKUP(F11-1,$A$11:E26,15,FALSE)), \"\", (F25-HLOOKUP(F11-1,$A$11:E26,15,FALSE))/HLOOKUP(F11-1,$A$11:E26,15,FALSE))","v":""},{"$f":"IF(ISERROR((G25-HLOOKUP(G11-1,$A$11:F26,15,FALSE))/HLOOKUP(G11-1,$A$11:F26,15,FALSE)), \"\", (G25-HLOOKUP(G11-1,$A$11:F26,15,FALSE))/HLOOKUP(G11-1,$A$11:F26,15,FALSE))","v":""},{"$f":"IF(ISERROR((H25-HLOOKUP(H11-1,$A$11:G26,15,FALSE))/HLOOKUP(H11-1,$A$11:G26,15,FALSE)), \"\", (H25-HLOOKUP(H11-1,$A$11:G26,15,FALSE))/HLOOKUP(H11-1,$A$11:G26,15,FALSE))","v":""},{"$f":"IF(ISERROR((I25-HLOOKUP(I11-1,$A$11:H26,15,FALSE))/HLOOKUP(I11-1,$A$11:H26,15,FALSE)), \"\", (I25-HLOOKUP(I11-1,$A$11:H26,15,FALSE))/HLOOKUP(I11-1,$A$11:H26,15,FALSE))","v":""},{"$f":"IF(ISERROR((J25-HLOOKUP(J11-1,$A$11:I26,15,FALSE))/HLOOKUP(J11-1,$A$11:I26,15,FALSE)), \"\", (J25-HLOOKUP(J11-1,$A$11:I26,15,FALSE))/HLOOKUP(J11-1,$A$11:I26,15,FALSE))","v":""},{"$f":"IF(ISERROR((K25-HLOOKUP(K11-1,$A$11:J26,15,FALSE))/HLOOKUP(K11-1,$A$11:J26,15,FALSE)), \"\", (K25-HLOOKUP(K11-1,$A$11:J26,15,FALSE))/HLOOKUP(K11-1,$A$11:J26,15,FALSE))","v":""},{"$f":"IF(ISERROR((L25-K25)/K25), \"\", (L25-K25)/K25)","v":""},null,null,{"$f":"\"Compound Growth Rate                                                            (\" & TestYear - 2 & \" vs. \" & 'LDC Info'!E28 & \" Actuals)\"","v":"Compound Growth Rate                                                            (2019 vs. 2014 Actuals)"},null,null,null,null,null,null,null,null,null,null,null,null,{"$f":"IF((Y20-Q20)=0, \"\", (Y20/Q20)^(1/(TestYear-2-RebaseYear))-1)","v":""}]
[]
[]
[null,{"$f":"B12","v":"2014 Last Rebasing Year OEB Approved"},"2014 Last Rebasing Year Actuals","2013 Actuals","2014 Last Rebasing Year Actuals","2015 Actuals","2016 Actuals","2017 Actuals","2018 Actuals","2019 Actuals","2020 Bridge Year","2021 Test Year"]
["Operations",{"$f":"B14","v":0},0,0,0,0,0,0,0,0,0,0]
["Maintenance",{"$f":"B15","v":0},0,0,0,0,0,0,0,0,0,0]
["Billing and Collecting",{"$f":"B19","v":0},0,0,0,0,0,0,0,0,0,0]
["Community Relations",{"$f":"B20","v":0},0,0,0,0,0,0,0,0,0,0]
["Administrative and General",{"$f":"B21","v":0},0,0,0,0,0,0,0,0,0,0]
["Total",{"$f":"SUM(B30:B34)","v":0},{"$f":"SUM(C30:C34)","v":0},{"$f":"SUM(D30:D34)","v":0},{"$f":"SUM(E30:E34)","v":0},0,0,0,0,0,0,0]
["%Change (year over year)",null,{"$f":"IF(ISERROR((C35-B35)/B35), \"\", (C35-B35)/B35)","v":""},{"$f":"IF(R11<=RebaseYear,\"\",IF(R11=RebaseYear+1,IF(ISERROR((D35-$C$35)/$C$35),\"\",(D35-$C$35)/$C$35),IF(ISERROR((D35-C35)/C35),\"\",(D35-C35)/C35)))","v":""},{"$f":"IF(S11<=RebaseYear,\"\",IF(S11=RebaseYear+1,IF(ISERROR((E35-$C$35)/$C$35),\"\",(E35-$C$35)/$C$35),IF(ISERROR((E35-D35)/D35),\"\",(E35-D35)/D35)))","v":""},{"$f":"IF(T11<=RebaseYear,\"\",IF(T11=RebaseYear+1,IF(ISERROR((F35-$C$35)/$C$35),\"\",(F35-$C$35)/$C$35),IF(ISERROR((F35-E35)/E35),\"\",(F35-E35)/E35)))","v":""},{"$f":"IF(U11<=RebaseYear,\"\",IF(U11=RebaseYear+1,IF(ISERROR((G35-$C$35)/$C$35),\"\",(G35-$C$35)/$C$35),IF(ISERROR((G35-F35)/F35),\"\",(G35-F35)/F35)))","v":""},{"$f":"IF(W11<=RebaseYear,\"\",IF(W11=RebaseYear+1,IF(ISERROR((H35-$C$35)/$C$35),\"\",(H35-$C$35)/$C$35),IF(ISERROR((H35-G35)/G35),\"\",(H35-G35)/G35)))","v":""},{"$f":"IF(X11<=RebaseYear,\"\",IF(X11=RebaseYear+1,IF(ISERROR((I35-$C$35)/$C$35),\"\",(I35-$C$35)/$C$35),IF(ISERROR((I35-H35)/H35),\"\",(I35-H35)/H35)))","v":""},{"$f":"IF(Y11<=RebaseYear,\"\",IF(Y11=RebaseYear+1,IF(ISERROR((J35-$C$35)/$C$35),\"\",(J35-$C$35)/$C$35),IF(ISERROR((J35-I35)/I35),\"\",(J35-I35)/I35)))","v":""},{"$f":"IF(Z11<=RebaseYear,\"\",IF(Z11=RebaseYear+1,IF(ISERROR((K35-$C$35)/$C$35),\"\",(K35-$C$35)/$C$35),IF(ISERROR((K35-J35)/J35),\"\",(K35-J35)/J35)))","v":""},{"$f":"IF(Z11<=RebaseYear,0,IF(Z11=RebaseYear+1,IF(ISERROR((L35-$C$35)/$C$35),\"\",(L35-$C$35)/$C$35),IF(ISERROR((L35-K35)/K35),\"\",(L35-K35)/K35)))","v":""}]
[]
["Note:"]
[]
["1     Historical actuals going back to the last cost of service application are required to be entered by the applicant."]
["2     Recoverable OM&A that is included on these tables should be identical to the recoverable OM&A that is shown for the corresponding periods on Appendix 2-JB."]
["3     For unrecoverable OM&A Expenses see Section 2.4.3.7"]

{"sheet":"Hidden_OM&A Summary","index":31,"n_rows":56,"n_cols":8,"rows_kept":56,"cut":false,"hidden":true,"merged":[]}
["Utility Name","EB Number","Test Year","Bridge Year","Last Rebasing Year","Heading","Year","Amount"]
[{"$f":"'LDC Info'!$E$14","v":0},{"$f":"EBNUMBER","v":0},{"$f":"TestYear","v":2021},{"$f":"BridgeYear","v":2020},{"$f":"RebaseYear","v":2014},"Operations",{"$f":"'App.2-JA_OM&A_Summary_Analys'!$B$12","v":"2014 Last Rebasing Year OEB Approved"},{"$f":"'App.2-JA_OM&A_Summary_Analys'!B$14","v":0}]
[{"$f":"'LDC Info'!$E$14","v":0},0,2021,2020,2014,"Maintenance",{"$f":"'App.2-JA_OM&A_Summary_Analys'!$B$12","v":"2014 Last Rebasing Year OEB Approved"},{"$f":"'App.2-JA_OM&A_Summary_Analys'!B$15","v":0}]
[{"$f":"'LDC Info'!$E$14","v":0},0,2021,2020,2014,"Billing and Collecting",{"$f":"'App.2-JA_OM&A_Summary_Analys'!$B$12","v":"2014 Last Rebasing Year OEB Approved"},{"$f":"'App.2-JA_OM&A_Summary_Analys'!B$19","v":0}]
[{"$f":"'LDC Info'!$E$14","v":0},0,2021,2020,2014,"Community Relations",{"$f":"'App.2-JA_OM&A_Summary_Analys'!$B$12","v":"2014 Last Rebasing Year OEB Approved"},{"$f":"'App.2-JA_OM&A_Summary_Analys'!B$20","v":0}]
[{"$f":"'LDC Info'!$E$14","v":0},0,2021,2020,2014,"Administrative and General",{"$f":"'App.2-JA_OM&A_Summary_Analys'!$B$12","v":"2014 Last Rebasing Year OEB Approved"},{"$f":"'App.2-JA_OM&A_Summary_Analys'!B$21","v":0}]
[{"$f":"'LDC Info'!$E$14","v":0},0,2021,2020,2014,"Operations",{"$f":"'App.2-JA_OM&A_Summary_Analys'!$C$12","v":"2014 Last Rebasing Year Actuals"},{"$f":"'App.2-JA_OM&A_Summary_Analys'!C$14","v":0}]
[{"$f":"'LDC Info'!$E$14","v":0},0,2021,2020,2014,"Maintenance",{"$f":"'App.2-JA_OM&A_Summary_Analys'!$C$12","v":"2014 Last Rebasing Year Actuals"},{"$f":"'App.2-JA_OM&A_Summary_Analys'!C$15","v":0}]
[{"$f":"'LDC Info'!$E$14","v":0},0,2021,2020,2014,"Billing and Collecting",{"$f":"'App.2-JA_OM&A_Summary_Analys'!$C$12","v":"2014 Last Rebasing Year Actuals"},{"$f":"'App.2-JA_OM&A_Summary_Analys'!C$19","v":0}]
[{"$f":"'LDC Info'!$E$14","v":0},0,2021,2020,2014,"Community Relations",{"$f":"'App.2-JA_OM&A_Summary_Analys'!$C$12","v":"2014 Last Rebasing Year Actuals"},{"$f":"'App.2-JA_OM&A_Summary_Analys'!C$20","v":0}]
[{"$f":"'LDC Info'!$E$14","v":0},0,2021,2020,2014,"Administrative and General",{"$f":"'App.2-JA_OM&A_Summary_Analys'!$C$12","v":"2014 Last Rebasing Year Actuals"},{"$f":"'App.2-JA_OM&A_Summary_Analys'!C$21","v":0}]
[{"$f":"'LDC Info'!$E$14","v":0},0,2021,2020,2014,"Operations",{"$f":"'App.2-JA_OM&A_Summary_Analys'!$D$12","v":"2013 Actuals"},{"$f":"'App.2-JA_OM&A_Summary_Analys'!D$14","v":0}]
[{"$f":"'LDC Info'!$E$14","v":0},0,2021,2020,2014,"Maintenance",{"$f":"'App.2-JA_OM&A_Summary_Analys'!$D$12","v":"2013 Actuals"},{"$f":"'App.2-JA_OM&A_Summary_Analys'!D$15","v":0}]
[{"$f":"'LDC Info'!$E$14","v":0},0,2021,2020,2014,"Billing and Collecting",{"$f":"'App.2-JA_OM&A_Summary_Analys'!$D$12","v":"2013 Actuals"},{"$f":"'App.2-JA_OM&A_Summary_Analys'!D$19","v":0}]
[{"$f":"'LDC Info'!$E$14","v":0},0,2021,2020,2014,"Community Relations",{"$f":"'App.2-JA_OM&A_Summary_Analys'!$D$12","v":"2013 Actuals"},{"$f":"'App.2-JA_OM&A_Summary_Analys'!D$20","v":0}]
[{"$f":"'LDC Info'!$E$14","v":0},0,2021,2020,2014,"Administrative and General",{"$f":"'App.2-JA_OM&A_Summary_Analys'!$D$12","v":"2013 Actuals"},{"$f":"'App.2-JA_OM&A_Summary_Analys'!D$21","v":0}]
[{"$f":"'LDC Info'!$E$14","v":0},0,2021,2020,2014,"Operations",{"$f":"'App.2-JA_OM&A_Summary_Analys'!$E$12","v":"2014 Last Rebasing Year Actuals"},{"$f":"'App.2-JA_OM&A_Summary_Analys'!E$14","v":0}]
[{"$f":"'LDC Info'!$E$14","v":0},0,2021,2020,2014,"Maintenance",{"$f":"'App.2-JA_OM&A_Summary_Analys'!$E$12","v":"2014 Last Rebasing Year Actuals"},{"$f":"'App.2-JA_OM&A_Summary_Analys'!E$15","v":0}]
[{"$f":"'LDC Info'!$E$14","v":0},{"$f":"EBNUMBER","v":0},{"$f":"TestYear","v":2021},{"$f":"BridgeYear","v":2020},{"$f":"RebaseYear","v":2014},"Billing and Collecting",{"$f":"'App.2-JA_OM&A_Summary_Analys'!$E$12","v":"2014 Last Rebasing Year Actuals"},{"$f":"'App.2-JA_OM&A_Summary_Analys'!E$19","v":0}]
[{"$f":"'LDC Info'!$E$14","v":0},0,2021,2020,2014,"Community Relations",{"$f":"'App.2-JA_OM&A_Summary_Analys'!$E$12","v":"2014 Last Rebasing Year Actuals"},{"$f":"'App.2-JA_OM&A_Summary_Analys'!E$20","v":0}]
[{"$f":"'LDC Info'!$E$14","v":0},0,2021,2020,2014,"Administrative and General",{"$f":"'App.2-JA_OM&A_Summary_Analys'!$E$12","v":"2014 Last Rebasing Year Actuals"},{"$f":"'App.2-JA_OM&A_Summary_Analys'!E$21","v":0}]
[{"$f":"'LDC Info'!$E$14","v":0},0,2021,2020,2014,"Operations",{"$f":"'App.2-JA_OM&A_Summary_Analys'!$F$12","v":"2015 Actuals"},{"$f":"'App.2-JA_OM&A_Summary_Analys'!F$14","v":0}]
[{"$f":"'LDC Info'!$E$14","v":0},0,2021,2020,2014,"Maintenance",{"$f":"'App.2-JA_OM&A_Summary_Analys'!$F$12","v":"2015 Actuals"},{"$f":"'App.2-JA_OM&A_Summary_Analys'!F$15","v":0}]
[{"$f":"'LDC Info'!$E$14","v":0},0,2021,2020,2014,"Billing and Collecting",{"$f":"'App.2-JA_OM&A_Summary_Analys'!$F$12","v":"2015 Actuals"},{"$f":"'App.2-JA_OM&A_Summary_Analys'!F$19","v":0}]
[{"$f":"'LDC Info'!$E$14","v":0},0,2021,2020,2014,"Community Relations",{"$f":"'App.2-JA_OM&A_Summary_Analys'!$F$12","v":"2015 Actuals"},{"$f":"'App.2-JA_OM&A_Summary_Analys'!F$20","v":0}]
[{"$f":"'LDC Info'!$E$14","v":0},0,2021,2020,2014,"Administrative and General",{"$f":"'App.2-JA_OM&A_Summary_Analys'!$F$12","v":"2015 Actuals"},{"$f":"'App.2-JA_OM&A_Summary_Analys'!F$21","v":0}]
[{"$f":"'LDC Info'!$E$14","v":0},0,2021,2020,2014,"Operations",{"$f":"'App.2-JA_OM&A_Summary_Analys'!$G$12","v":"2016 Actuals"},{"$f":"'App.2-JA_OM&A_Summary_Analys'!G$14","v":0}]
[{"$f":"'LDC Info'!$E$14","v":0},0,2021,2020,2014,"Maintenance",{"$f":"'App.2-JA_OM&A_Summary_Analys'!$G$12","v":"2016 Actuals"},{"$f":"'App.2-JA_OM&A_Summary_Analys'!G$15","v":0}]
[{"$f":"'LDC Info'!$E$14","v":0},0,2021,2020,2014,"Billing and Collecting",{"$f":"'App.2-JA_OM&A_Summary_Analys'!$G$12","v":"2016 Actuals"},{"$f":"'App.2-JA_OM&A_Summary_Analys'!G$19","v":0}]
[{"$f":"'LDC Info'!$E$14","v":0},0,2021,2020,2014,"Community Relations",{"$f":"'App.2-JA_OM&A_Summary_Analys'!$G$12","v":"2016 Actuals"},{"$f":"'App.2-JA_OM&A_Summary_Analys'!G$20","v":0}]
[{"$f":"'LDC Info'!$E$14","v":0},{"$f":"EBNUMBER","v":0},{"$f":"TestYear","v":2021},{"$f":"BridgeYear","v":2020},{"$f":"RebaseYear","v":2014},"Administrative and General",{"$f":"'App.2-JA_OM&A_Summary_Analys'!$G$12","v":"2016 Actuals"},{"$f":"'App.2-JA_OM&A_Summary_Analys'!G$21","v":0}]
[{"$f":"'LDC Info'!$E$14","v":0},0,2021,2020,2014,"Operations",{"$f":"'App.2-JA_OM&A_Summary_Analys'!$H$12","v":"2017 Actuals"},{"$f":"'App.2-JA_OM&A_Summary_Analys'!H$14","v":0}]
[{"$f":"'LDC Info'!$E$14","v":0},0,2021,2020,2014,"Maintenance",{"$f":"'App.2-JA_OM&A_Summary_Analys'!$H$12","v":"2017 Actuals"},{"$f":"'App.2-JA_OM&A_Summary_Analys'!H$15","v":0}]
[{"$f":"'LDC Info'!$E$14","v":0},0,2021,2020,2014,"Billing and Collecting",{"$f":"'App.2-JA_OM&A_Summary_Analys'!$H$12","v":"2017 Actuals"},{"$f":"'App.2-JA_OM&A_Summary_Analys'!H$19","v":0}]
[{"$f":"'LDC Info'!$E$14","v":0},0,2021,2020,2014,"Community Relations",{"$f":"'App.2-JA_OM&A_Summary_Analys'!$H$12","v":"2017 Actuals"},{"$f":"'App.2-JA_OM&A_Summary_Analys'!H$20","v":0}]
[{"$f":"'LDC Info'!$E$14","v":0},0,2021,2020,2014,"Administrative and General",{"$f":"'App.2-JA_OM&A_Summary_Analys'!$H$12","v":"2017 Actuals"},{"$f":"'App.2-JA_OM&A_Summary_Analys'!H$21","v":0}]
[{"$f":"'LDC Info'!$E$14","v":0},0,2021,2020,2014,"Operations",{"$f":"'App.2-JA_OM&A_Summary_Analys'!$I$12","v":"2018 Actuals"},{"$f":"'App.2-JA_OM&A_Summary_Analys'!I$14","v":0}]
[{"$f":"'LDC Info'!$E$14","v":0},0,2021,2020,2014,"Maintenance",{"$f":"'App.2-JA_OM&A_Summary_Analys'!$I$12","v":"2018 Actuals"},{"$f":"'App.2-JA_OM&A_Summary_Analys'!I$15","v":0}]
[{"$f":"'LDC Info'!$E$14","v":0},0,2021,2020,2014,"Billing and Collecting",{"$f":"'App.2-JA_OM&A_Summary_Analys'!$I$12","v":"2018 Actuals"},{"$f":"'App.2-JA_OM&A_Summary_Analys'!I$19","v":0}]
[{"$f":"'LDC Info'!$E$14","v":0},0,2021,2020,2014,"Community Relations",{"$f":"'App.2-JA_OM&A_Summary_Analys'!$I$12","v":"2018 Actuals"},{"$f":"'App.2-JA_OM&A_Summary_Analys'!I$20","v":0}]
[{"$f":"'LDC Info'!$E$14","v":0},0,2021,2020,2014,"Administrative and General",{"$f":"'App.2-JA_OM&A_Summary_Analys'!$I$12","v":"2018 Actuals"},{"$f":"'App.2-JA_OM&A_Summary_Analys'!I$21","v":0}]
[{"$f":"'LDC Info'!$E$14","v":0},{"$f":"EBNUMBER","v":0},{"$f":"TestYear","v":2021},{"$f":"BridgeYear","v":2020},{"$f":"RebaseYear","v":2014},"Operations",{"$f":"'App.2-JA_OM&A_Summary_Analys'!$J$12","v":"2019 Actuals"},{"$f":"'App.2-JA_OM&A_Summary_Analys'!J$14","v":0}]
[{"$f":"'LDC Info'!$E$14","v":0},0,2021,2020,2014,"Maintenance",{"$f":"'App.2-JA_OM&A_Summary_Analys'!$J$12","v":"2019 Actuals"},{"$f":"'App.2-JA_OM&A_Summary_Analys'!J$15","v":0}]
[{"$f":"'LDC Info'!$E$14","v":0},0,2021,2020,2014,"Billing and Collecting",{"$f":"'App.2-JA_OM&A_Summary_Analys'!$J$12","v":"2019 Actuals"},{"$f":"'App.2-JA_OM&A_Summary_Analys'!J$19","v":0}]
[{"$f":"'LDC Info'!$E$14","v":0},0,2021,2020,2014,"Community Relations",{"$f":"'App.2-JA_OM&A_Summary_Analys'!$J$12","v":"2019 Actuals"},{"$f":"'App.2-JA_OM&A_Summary_Analys'!J$20","v":0}]
[{"$f":"'LDC Info'!$E$14","v":0},0,2021,2020,2014,"Administrative and General",{"$f":"'App.2-JA_OM&A_Summary_Analys'!$J$12","v":"2019 Actuals"},{"$f":"'App.2-JA_OM&A_Summary_Analys'!J$21","v":0}]
[{"$f":"'LDC Info'!$E$14","v":0},0,2021,2020,2014,"Operations",{"$f":"'App.2-JA_OM&A_Summary_Analys'!$K$12","v":"2020 Bridge Year"},{"$f":"'App.2-JA_OM&A_Summary_Analys'!K$14","v":0}]
[{"$f":"'LDC Info'!$E$14","v":0},0,2021,2020,2014,"Maintenance",{"$f":"'App.2-JA_OM&A_Summary_Analys'!$K$12","v":"2020 Bridge Year"},{"$f":"'App.2-JA_OM&A_Summary_Analys'!K$15","v":0}]
[{"$f":"'LDC Info'!$E$14","v":0},0,2021,2020,2014,"Billing and Collecting",{"$f":"'App.2-JA_OM&A_Summary_Analys'!$K$12","v":"2020 Bridge Year"},{"$f":"'App.2-JA_OM&A_Summary_Analys'!K$19","v":0}]
[{"$f":"'LDC Info'!$E$14","v":0},0,2021,2020,2014,"Community Relations",{"$f":"'App.2-JA_OM&A_Summary_Analys'!$K$12","v":"2020 Bridge Year"},{"$f":"'App.2-JA_OM&A_Summary_Analys'!K$20","v":0}]
[{"$f":"'LDC Info'!$E$14","v":0},0,2021,2020,2014,"Administrative and General",{"$f":"'App.2-JA_OM&A_Summary_Analys'!$K$12","v":"2020 Bridge Year"},{"$f":"'App.2-JA_OM&A_Summary_Analys'!K$21","v":0}]
[{"$f":"'LDC Info'!$E$14","v":0},0,2021,2020,2014,"Operations",{"$f":"'App.2-JA_OM&A_Summary_Analys'!$L$12","v":"2021 Test Year"},{"$f":"'App.2-JA_OM&A_Summary_Analys'!L14","v":0}]
[{"$f":"'LDC Info'!$E$14","v":0},0,2021,2020,2014,"Maintenance",{"$f":"'App.2-JA_OM&A_Summary_Analys'!$L$12","v":"2021 Test Year"},{"$f":"'App.2-JA_OM&A_Summary_Analys'!L15","v":0}]
[{"$f":"'LDC Info'!$E$14","v":0},0,2021,2020,2014,"Billing and Collecting",{"$f":"'App.2-JA_OM&A_Summary_Analys'!$L$12","v":"2021 Test Year"},{"$f":"'App.2-JA_OM&A_Summary_Analys'!L19","v":0}]
[{"$f":"'LDC Info'!$E$14","v":0},0,2021,2020,2014,"Community Relations",{"$f":"'App.2-JA_OM&A_Summary_Analys'!$L$12","v":"2021 Test Year"},{"$f":"'App.2-JA_OM&A_Summary_Analys'!L20","v":0}]
[{"$f":"'LDC Info'!$E$14","v":0},0,2021,2020,2014,"Administrative and General",{"$f":"'App.2-JA_OM&A_Summary_Analys'!$L$12","v":"2021 Test Year"},{"$f":"'App.2-JA_OM&A_Summary_Analys'!L21","v":0}]

{"sheet":"App.2-JB_OM&A_Cost _Drivers","index":32,"n_rows":48,"n_cols":11,"rows_kept":48,"cut":false,"hidden":false,"merged":[[9,0,9,9],[10,0,10,9],[45,1,45,10],[46,1,46,10],[47,1,51,10]]}
[null,null,null,null,null,null,null,null,null,"File Number:",{"$f":"EBNUMBER","v":0}]
[null,null,null,null,null,null,null,null,null,"Exhibit:"]
[null,null,null,null,null,null,null,null,null,"Tab:"]
[null,null,null,null,null,null,null,null,null,"Schedule:"]
[null,null,null,null,null,null,null,null,null,"Page:"]
[]
[null,null,null,null,null,null,null,null,null,"Date:"]
[]
[]
["Appendix 2-JB"]
[{"$f":"\"Recoverable OM&A Cost Driver Table\" & CHAR(185)&CHAR(183)&CHAR(179)","v":"Recoverable OM&A Cost Driver Table¹·³"}]
[]
["OM&A",{"$f":"\"Last Rebasing Year (\"&RebaseYear&\" Actuals)\"","v":"Last Rebasing Year (2014 Actuals)"},{"$f":"BridgeYear -7 & \" Actuals\"","v":"2013 Actuals"},{"$f":"BridgeYear -6 & \" Actuals\"","v":"2014 Actuals"},{"$f":"BridgeYear -5 & \" Actuals\"","v":"2015 Actuals"},{"$f":"BridgeYear -4 & \" Actuals\"","v":"2016 Actuals"},{"$f":"BridgeYear -3 & \" Actuals\"","v":"2017 Actuals"},{"$f":"BridgeYear -2 & \" Actuals\"","v":"2018 Actuals"},{"$f":"BridgeYear -1 & \" Actuals\"","v":"2019 Actuals"},{"$f":"BridgeYear & \" Bridge Year\"","v":"2020 Bridge Year"},{"$f":"TestYear & \" Test Year\"","v":"2021 Test Year"}]
["Reporting Basis"]
["Opening Balance²",null,{"$f":"IF(BridgeYear-7<=RebaseYear,0,B42)","v":0},{"$f":"IF(BridgeYear-6<=RebaseYear,0,IF((BridgeYear-6)=(RebaseYear+1),$B$42,C42))","v":0},{"$f":"IF(BridgeYear-5<=RebaseYear,0,IF((BridgeYear-5)=(RebaseYear+1),$B$42,D42))","v":0},{"$f":"IF(BridgeYear-4<=RebaseYear,0,IF((BridgeYear-4)=(RebaseYear+1),$B$42,E42))","v":0},{"$f":"IF(BridgeYear-3<=RebaseYear,0,IF((BridgeYear-3)=(RebaseYear+1),$B$42,F42))","v":0},{"$f":"IF(BridgeYear-2<=RebaseYear,0,IF((BridgeYear-2)=(RebaseYear+1),$B$42,G42))","v":0},{"$f":"IF(BridgeYear-1<=RebaseYear,0,IF((BridgeYear-1)=(RebaseYear+1),$B$42,H42))","v":0},{"$f":"I42","v":0},{"$f":"J42","v":0}]
["Cost Driver # 1"]
["Cost Driver # 2"]
["Cost Driver # 3"]
["Cost Driver # 4"]
["etc."]
[]
[]
[]
[]
[]
[]
[]
[]
[]
[]
[]
[]
[]
[]
[]
[]
[]
[]
[]
[]
[]
[{"$f":"\"Closing Balance\"&CHAR(178)","v":"Closing Balance²"},{"$f":"SUM(B15:B41)","v":0},0,0,0,0,0,0,0,0,0]
[]
["Notes:"]
[]
[1,"For each year, a detailed explanation for each cost driver and associated amount is requied in Exhibit 4."]
[2,"Opening Balance for \"Last Rebasing Year\" (cell B15) should be equal to the OEB-Approved amount. For purposes of assessing incremental cost drivers, the closing balance for each year becomes the opening balance for the next year."]
[3,"If it has been more than four years since the applicant last filed a cost of service application, additional years of historical actuals should be incorporated into the table, as necessary, to go back to the last cost of service application.  If the applicant last filed a cost of service application less than four years ago, a minimum of three years of actual information is required."]

{"sheet":"App.2-JC_OMA Programs","index":33,"n_rows":56,"n_cols":14,"rows_kept":56,"cut":false,"hidden":false,"merged":[[8,0,8,11],[9,0,9,11],[11,0,11,11],[54,0,54,12],[55,0,55,12]]}
[null,null,null,null,null,null,null,null,null,null,null,"File Number:",{"$f":"EBNUMBER","v":0}]
[null,null,null,null,null,null,null,null,null,null,null,"Exhibit:"]
[null,null,null,null,null,null,null,null,null,null,null,"Tab:"]
[null,null,null,null,null,null,null,null,null,null,null,"Schedule:"]
[null,null,null,null,null,null,null,null,null,null,null,"Page:"]
[]
[null,null,null,null,null,null,null,null,null,null,null,"Date:"]
[]
["Appendix 2-JC"]
["OM&A Programs Table"]
[]
[]
["Programs",{"$f":"\"Last Rebasing Year (\" & RebaseYear & \" OEB-Approved)\"","v":"Last Rebasing Year (2014 OEB-Approved)"},{"$f":"\"Last Rebasing Year (\" & RebaseYear & \" Actuals)\"","v":"Last Rebasing Year (2014 Actuals)"},{"$f":"BridgeYear-7&\" Actuals\"","v":"2013 Actuals"},{"$f":"BridgeYear-6&\" Actuals\"","v":"2014 Actuals"},{"$f":"BridgeYear-5&\" Actuals\"","v":"2015 Actuals"},{"$f":"BridgeYear-4&\" Actuals\"","v":"2016 Actuals"},{"$f":"BridgeYear-3&\" Actuals\"","v":"2017 Actuals"},{"$f":"BridgeYear -2 & \" Actuals\"","v":"2018 Actuals"},{"$f":"BridgeYear -1 & \" Actuals\"","v":"2019 Actuals"},{"$f":"BridgeYear & \" Bridge Year\"","v":"2020 Bridge Year"},{"$f":"TestYear & \" Test Year\"","v":"2021 Test Year"},{"$f":"\"Variance \n(Test Year vs. \" & J13 &\")\"","v":"Variance \n(Test Year vs. 2019 Actuals)"},{"$f":"\"Variance \n(Test Year vs. \" & B13","v":"Variance \n(Test Year vs. Last Rebasing Year (2014 OEB-Approved)"}]
["Reporting Basis"]
["Program Name #1"]
[null,null,null,null,null,null,null,null,null,null,null,null,{"$f":"L16-J16","v":0},{"$f":"L16-B16","v":0}]
[null,null,null,null,null,null,null,null,null,null,null,null,{"$f":"L17-J17","v":0},0]
[null,null,null,null,null,null,null,null,null,null,null,null,0,0]
[null,null,null,null,null,null,null,null,null,null,null,null,0,0]
[null,null,null,null,null,null,null,null,null,null,null,null,0,0]
["Sub-Total",{"$f":"SUM(B16:B20)","v":0},{"$f":"SUM(C16:C20)","v":0},0,0,0,0,0,0,0,0,0,0,0]
["Program Name #2"]
[null,null,null,null,null,null,null,null,null,null,null,null,0,{"$f":"L23-B23","v":0}]
[null,null,null,null,null,null,null,null,null,null,null,null,0,0]
[null,null,null,null,null,null,null,null,null,null,null,null,0,0]
[null,null,null,null,null,null,null,null,null,null,null,null,0,0]
[null,null,null,null,null,null,null,null,null,null,null,null,0,0]
["Sub-Total",{"$f":"SUM(B23:B27)","v":0},0,0,0,0,0,0,0,0,0,0,0,0]
["Program Name #3"]
[null,null,null,null,null,null,null,null,null,null,null,null,0,{"$f":"L30-B30","v":0}]
[null,null,null,null,null,null,null,null,null,null,null,null,0,0]
[null,null,null,null,null,null,null,null,null,null,null,null,0,0]
[null,null,null,null,null,null,null,null,null,null,null,null,0,0]
[null,null,null,null,null,null,null,null,null,null,null,null,0,0]
["Sub-Total",{"$f":"SUM(B30:B34)","v":0},0,0,0,0,0,0,0,0,0,0,0,0]
["Program Name #4"]
[null,null,null,null,null,null,null,null,null,null,null,null,0,{"$f":"L37-B37","v":0}]
[null,null,null,null,null,null,null,null,null,null,null,null,0,0]
[null,null,null,null,null,null,null,null,null,null,null,null,0,0]
[null,null,null,null,null,null,null,null,null,null,null,null,0,0]
[null,null,null,null,null,null,null,null,null,null,null,null,0,0]
["Sub-Total",{"$f":"SUM(B37:B41)","v":0},0,0,0,0,0,0,0,0,0,0,0,0]
["Program Name #5"]
[null,null,null,null,null,null,null,null,null,null,null,null,{"$f":"L44-J44","v":0},{"$f":"L44-B44","v":0}]
[null,null,null,null,null,null,null,null,null,null,null,null,0,0]
[null,null,null,null,null,null,null,null,null,null,null,null,0,0]
[null,null,null,null,null,null,null,null,null,null,null,null,0,0]
[null,null,null,null,null,null,null,null,null,null,null,null,0,0]
["Sub-Total",{"$f":"SUM(B44:B48)","v":0},0,0,0,0,0,0,0,0,0,0,0,0]
["Miscellaneous",null,null,null,null,null,null,null,null,null,null,null,0,0]
["Total",{"$f":"SUMPRODUCT(--($A15:$A50=\"Sub-Total\"), B$15:B$50)+B50","v":0},0,0,0,0,0,0,0,0,0,0,{"$f":"L51-J51","v":0},0]
[]
["Notes:"]
[]
["1   Please provide a breakdown of the major components of each OM&A Program undertaken in each year.  Please ensure that all programs below the materiality threshold are included in the miscellaneous line.  Add more Programs as required."]
["2   The applicant should group projects appropriately and avoid presentations that result in classification of significant components of the OM&A budget in the miscellaneous category"]

{"sheet":"App.2-K_Employee Costs","index":34,"n_rows":31,"n_cols":26,"rows_kept":31,"cut":false,"hidden":false,"merged":[[3,0,3,23],[31,0,31,25],[24,0,24,25],[8,0,8,25],[9,0,9,25],[12,0,12,25],[16,0,16,25],[20,0,20,25],[29,0,29,25],[30,0,30,25]]}
[null,null,null,null,null,null,null,null,null,null,null,null,null,null,null,null,null,null,null,null,null,null,null,null,"File Number:",{"$f":"EBNUMBER","v":0}]
[null,null,null,null,null,null,null,null,null,null,null,null,null,null,null,null,null,null,null,null,null,null,null,null,"Exhibit:"]
[null,null,null,null,null,null,null,null,null,null,null,null,null,null,null,null,null,null,null,null,null,null,null,null,"Tab:"]
["TO BE UPDATED AT THE DRAFT RATE ORDER STAGE",null,null,null,null,null,null,null,null,null,null,null,null,null,null,null,null,null,null,null,null,null,null,null,"Schedule:"]
[null,null,null,null,null,null,null,null,null,null,null,null,null,null,null,null,null,null,null,null,null,null,null,null,"Page:"]
[]
[null,null,null,null,null,null,null,null,null,null,null,null,null,null,null,null,null,null,null,null,null,null,null,null,"Date:"]
[]
["Appendix 2-K"]
["Employee Costs"]
[]
[null,"Last Rebasing Year (2010 OEB Approved)","Last Rebasing Year (2010 Actuals)",{"$f":"\"Last Rebasing Year (\" & TestYear -8 & \" OEB Approved)\"","v":"Last Rebasing Year (2013 OEB Approved)"},{"$f":"\"Last Rebasing Year (\" & TestYear -8 & \" Actuals)\"","v":"Last Rebasing Year (2013 Actuals)"},{"$f":"TestYear -8 & \" Actuals\"","v":"2013 Actuals"},{"$f":"\"Last Rebasing Year (\" & TestYear -7 & \" OEB Approved)\"","v":"Last Rebasing Year (2014 OEB Approved)"},{"$f":"\"Last Rebasing Year (\" & TestYear -7 & \" Actuals)\"","v":"Last Rebasing Year (2014 Actuals)"},{"$f":"TestYear -7 & \" Actuals\"","v":"2014 Actuals"},{"$f":"\"Last Rebasing Year (\" & TestYear -6 & \" OEB Approved)\"","v":"Last Rebasing Year (2015 OEB Approved)"},{"$f":"\"Last Rebasing Year (\" & TestYear -6 & \" Actuals)\"","v":"Last Rebasing Year (2015 Actuals)"},{"$f":"TestYear -6 & \" Actuals\"","v":"2015 Actuals"},{"$f":"\"Last Rebasing Year (\" & TestYear -5 & \" OEB Approved)\"","v":"Last Rebasing Year (2016 OEB Approved)"},{"$f":"\"Last Rebasing Year (\" & TestYear -5 & \" Actuals)\"","v":"Last Rebasing Year (2016 Actuals)"},{"$f":"TestYear -5 & \" Actuals\"","v":"2016 Actuals"},{"$f":"\"Last Rebasing Year (\" & TestYear -4 & \" OEB Approved)\"","v":"Last Rebasing Year (2017 OEB Approved)"},{"$f":"\"Last Rebasing Year (\" & TestYear -4 & \" Actuals)\"","v":"Last Rebasing Year (2017 Actuals)"},{"$f":"TestYear -4 & \" Actuals\"","v":"2017 Actuals"},{"$f":"\"Last Rebasing Year (\" & TestYear -3 & \" OEB Approved)\"","v":"Last Rebasing Year (2018 OEB Approved)"},{"$f":"\"Last Rebasing Year (\" & TestYear -3 & \" Actuals)\"","v":"Last Rebasing Year (2018 Actuals)"},{"$f":"TestYear -3 & \" Actuals\"","v":"2018 Actuals"},{"$f":"\"Last Rebasing Year (\" & TestYear -2 & \" OEB Approved)\"","v":"Last Rebasing Year (2019 OEB Approved)"},{"$f":"\"Last Rebasing Year (\" & TestYear -2 & \" Actuals)\"","v":"Last Rebasing Year (2019 Actuals)"},{"$f":"TestYear -2 & \" Actuals\"","v":"2019 Actuals"},{"$f":"BridgeYear & \" Bridge Year\"","v":"2020 Bridge Year"},{"$f":"TestYear & \" Test Year\"","v":"2021 Test Year"}]
["Number of Employees (FTEs including Part-Time)1"]
["Management (including executive)"]
["Non-Management (union and non-union)"]
["Total",{"$f":"SUM(B14:B15)","v":0},0,0,0,0,0,0,0,0,0,0,0,0,0,0,0,0,0,0,0,0,0,0,0,0]
["Total Salary and Wages including ovetime and incentive pay"]
["Management (including executive)"]
["Non-Management (union and non-union)"]
["Total",{"$f":"SUM(B18:B19)","v":0},0,0,0,0,0,0,0,0,0,0,0,0,0,0,0,0,0,0,0,0,0,0,0,0]
["Total Benefits (Current + Accrued)"]
["Management (including executive)"]
["Non-Management (union and non-union)"]
["Total",{"$f":"SUM(B22:B23)","v":0},{"$f":"SUM(C22:C23)","v":0},0,0,0,0,0,0,0,0,0,0,0,0,0,0,0,0,0,0,0,0,0,0,0]
["Total Compensation (Salary, Wages, & Benefits)"]
["Management (including executive)",{"$f":"B18+B22","v":0},0,0,0,0,0,0,0,0,0,0,0,0,0,0,0,0,0,0,0,0,0,0,0,0]
["Non-Management (union and non-union)",0,0,0,0,0,0,0,0,0,0,0,0,0,0,0,0,0,0,0,0,0,0,0,0,0]
["Total",0,0,0,0,0,0,0,0,0,0,0,0,0,0,0,0,0,0,0,0,0,0,0,0,0]
[]
["Note:"]
["1.   If an applicant wishes to use headcount, it must also file the same schedule on an FTE basis."]

{"sheet":"Hidden_Employee Costs","index":35,"n_rows":201,"n_cols":9,"rows_kept":201,"cut":false,"hidden":true,"merged":[]}
["Utility Name","EB Number","Test Year","Bridge Year","Last Rebasing Year","Employee Cost Info","Heading","Year","Amount"]
[{"$f":"'LDC Info'!$E$14","v":0},{"$f":"EBNUMBER","v":0},{"$f":"TestYear","v":2021},{"$f":"BridgeYear","v":2020},{"$f":"RebaseYear","v":2014},"Management (including executive)","Number of Employees (FTEs including Part-Time)",{"$f":"'App.2-K_Employee Costs'!B$12","v":"Last Rebasing Year (2010 OEB Approved)"},{"$f":"'App.2-K_Employee Costs'!B$14","v":0}]
[{"$f":"'LDC Info'!$E$14","v":0},0,2021,2020,2014,"Non-Management (union and non-union)","Number of Employees (FTEs including Part-Time)",{"$f":"'App.2-K_Employee Costs'!B$12","v":"Last Rebasing Year (2010 OEB Approved)"},{"$f":"'App.2-K_Employee Costs'!B$15","v":0}]
[{"$f":"'LDC Info'!$E$14","v":0},0,2021,2020,2014,"Management (including executive)","Total Salary and Wages including ovetime and incentive pay",{"$f":"'App.2-K_Employee Costs'!B$12","v":"Last Rebasing Year (2010 OEB Approved)"},{"$f":"'App.2-K_Employee Costs'!B$18","v":0}]
[{"$f":"'LDC Info'!$E$14","v":0},0,2021,2020,2014,"Non-Management (union and non-union)","Total Salary and Wages including ovetime and incentive pay",{"$f":"'App.2-K_Employee Costs'!B$12","v":"Last Rebasing Year (2010 OEB Approved)"},{"$f":"'App.2-K_Employee Costs'!B$19","v":0}]
[{"$f":"'LDC Info'!$E$14","v":0},0,2021,2020,2014,"Management (including executive)","Total Benefits (Current + Accrued)",{"$f":"'App.2-K_Employee Costs'!B$12","v":"Last Rebasing Year (2010 OEB Approved)"},{"$f":"'App.2-K_Employee Costs'!B$22","v":0}]
[{"$f":"'LDC Info'!$E$14","v":0},0,2021,2020,2014,"Non-Management (union and non-union)","Total Benefits (Current + Accrued)",{"$f":"'App.2-K_Employee Costs'!B$12","v":"Last Rebasing Year (2010 OEB Approved)"},{"$f":"'App.2-K_Employee Costs'!B$23","v":0}]
[{"$f":"'LDC Info'!$E$14","v":0},0,2021,2020,2014,"Management (including executive)","Total Compensation (Salary, Wages, & Benefits)",{"$f":"'App.2-K_Employee Costs'!B$12","v":"Last Rebasing Year (2010 OEB Approved)"},{"$f":"'App.2-K_Employee Costs'!B$26","v":0}]
[{"$f":"'LDC Info'!$E$14","v":0},0,2021,2020,2014,"Non-Management (union and non-union)","Total Compensation (Salary, Wages, & Benefits)",{"$f":"'App.2-K_Employee Costs'!B$12","v":"Last Rebasing Year (2010 OEB Approved)"},{"$f":"'App.2-K_Employee Costs'!B$27","v":0}]
[{"$f":"'LDC Info'!$E$14","v":0},0,2021,2020,2014,"Management (including executive)","Number of Employees (FTEs including Part-Time)",{"$f":"'App.2-K_Employee Costs'!C$12","v":"Last Rebasing Year (2010 Actuals)"},{"$f":"'App.2-K_Employee Costs'!C$14","v":0}]
[{"$f":"'LDC Info'!$E$14","v":0},0,2021,2020,2014,"Non-Management (union and non-union)","Number of Employees (FTEs including Part-Time)",{"$f":"'App.2-K_Employee Costs'!C$12","v":"Last Rebasing Year (2010 Actuals)"},{"$f":"'App.2-K_Employee Costs'!C$15","v":0}]
[{"$f":"'LDC Info'!$E$14","v":0},0,2021,2020,2014,"Management (including executive)","Total Salary and Wages including ovetime and incentive pay",{"$f":"'App.2-K_Employee Costs'!C$12","v":"Last Rebasing Year (2010 Actuals)"},{"$f":"'App.2-K_Employee Costs'!C$18","v":0}]
[{"$f":"'LDC Info'!$E$14","v":0},0,2021,2020,2014,"Non-Management (union and non-union)","Total Salary and Wages including ovetime and incentive pay",{"$f":"'App.2-K_Employee Costs'!C$12","v":"Last Rebasing Year (2010 Actuals)"},{"$f":"'App.2-K_Employee Costs'!C$19","v":0}]
[{"$f":"'LDC Info'!$E$14","v":0},0,2021,2020,2014,"Management (including executive)","Total Benefits (Current + Accrued)",{"$f":"'App.2-K_Employee Costs'!C$12","v":"Last Rebasing Year (2010 Actuals)"},{"$f":"'App.2-K_Employee Costs'!C$22","v":0}]
[{"$f":"'LDC Info'!$E$14","v":0},0,2021,2020,2014,"Non-Management (union and non-union)","Total Benefits (Current + Accrued)",{"$f":"'App.2-K_Employee Costs'!C$12","v":"Last Rebasing Year (2010 Actuals)"},{"$f":"'App.2-K_Employee Costs'!C$23","v":0}]
[{"$f":"'LDC Info'!$E$14","v":0},0,2021,2020,2014,"Management (including executive)","Total Compensation (Salary, Wages, & Benefits)",{"$f":"'App.2-K_Employee Costs'!C$12","v":"Last Rebasing Year (2010 Actuals)"},{"$f":"'App.2-K_Employee Costs'!C$26","v":0}]
[{"$f":"'LDC Info'!$E$14","v":0},0,2021,2020,2014,"Non-Management (union and non-union)","Total Compensation (Salary, Wages, & Benefits)",{"$f":"'App.2-K_Employee Costs'!C$12","v":"Last Rebasing Year (2010 Actuals)"},{"$f":"'App.2-K_Employee Costs'!C$27","v":0}]
[{"$f":"'LDC Info'!$E$14","v":0},0,2021,2020,2014,"Management (including executive)","Number of Employees (FTEs including Part-Time)",{"$f":"'App.2-K_Employee Costs'!D$12","v":"Last Rebasing Year (2013 OEB Approved)"},{"$f":"'App.2-K_Employee Costs'!D$14","v":0}]
[{"$f":"'LDC Info'!$E$14","v":0},0,2021,2020,2014,"Non-Management (union and non-union)","Number of Employees (FTEs including Part-Time)",{"$f":"'App.2-K_Employee Costs'!D$12","v":"Last Rebasing Year (2013 OEB Approved)"},{"$f":"'App.2-K_Employee Costs'!D$15","v":0}]
[{"$f":"'LDC Info'!$E$14","v":0},0,2021,2020,2014,"Management (including executive)","Total Salary and Wages including ovetime and incentive pay",{"$f":"'App.2-K_Employee Costs'!D$12","v":"Last Rebasing Year (2013 OEB Approved)"},{"$f":"'App.2-K_Employee Costs'!D$18","v":0}]
[{"$f":"'LDC Info'!$E$14","v":0},0,2021,2020,2014,"Non-Management (union and non-union)","Total Salary and Wages including ovetime and incentive pay",{"$f":"'App.2-K_Employee Costs'!D$12","v":"Last Rebasing Year (2013 OEB Approved)"},{"$f":"'App.2-K_Employee Costs'!D$19","v":0}]
[{"$f":"'LDC Info'!$E$14","v":0},0,2021,2020,2014,"Management (including executive)","Total Benefits (Current + Accrued)",{"$f":"'App.2-K_Employee Costs'!D$12","v":"Last Rebasing Year (2013 OEB Approved)"},{"$f":"'App.2-K_Employee Costs'!D$22","v":0}]
[{"$f":"'LDC Info'!$E$14","v":0},0,2021,2020,2014,"Non-Management (union and non-union)","Total Benefits (Current + Accrued)",{"$f":"'App.2-K_Employee Costs'!D$12","v":"Last Rebasing Year (2013 OEB Approved)"},{"$f":"'App.2-K_Employee Costs'!D$23","v":0}]
[{"$f":"'LDC Info'!$E$14","v":0},0,2021,2020,2014,"Management (including executive)","Total Compensation (Salary, Wages, & Benefits)",{"$f":"'App.2-K_Employee Costs'!D$12","v":"Last Rebasing Year (2013 OEB Approved)"},{"$f":"'App.2-K_Employee Costs'!D$26","v":0}]
[{"$f":"'LDC Info'!$E$14","v":0},0,2021,2020,2014,"Non-Management (union and non-union)","Total Compensation (Salary, Wages, & Benefits)",{"$f":"'App.2-K_Employee Costs'!D$12","v":"Last Rebasing Year (2013 OEB Approved)"},{"$f":"'App.2-K_Employee Costs'!D$27","v":0}]
[{"$f":"'LDC Info'!$E$14","v":0},0,2021,2020,2014,"Management (including executive)","Number of Employees (FTEs including Part-Time)",{"$f":"'App.2-K_Employee Costs'!E$12","v":"Last Rebasing Year (2013 Actuals)"},{"$f":"'App.2-K_Employee Costs'!E$14","v":0}]
[{"$f":"'LDC Info'!$E$14","v":0},0,2021,2020,2014,"Non-Management (union and non-union)","Number of Employees (FTEs including Part-Time)",{"$f":"'App.2-K_Employee Costs'!E$12","v":"Last Rebasing Year (2013 Actuals)"},{"$f":"'App.2-K_Employee Costs'!E$15","v":0}]
[{"$f":"'LDC Info'!$E$14","v":0},0,2021,2020,2014,"Management (including executive)","Total Salary and Wages including ovetime and incentive pay",{"$f":"'App.2-K_Employee Costs'!E$12","v":"Last Rebasing Year (2013 Actuals)"},{"$f":"'App.2-K_Employee Costs'!E$18","v":0}]
[{"$f":"'LDC Info'!$E$14","v":0},0,2021,2020,2014,"Non-Management (union and non-union)","Total Salary and Wages including ovetime and incentive pay",{"$f":"'App.2-K_Employee Costs'!E$12","v":"Last Rebasing Year (2013 Actuals)"},{"$f":"'App.2-K_Employee Costs'!E$19","v":0}]
[{"$f":"'LDC Info'!$E$14","v":0},0,2021,2020,2014,"Management (including executive)","Total Benefits (Current + Accrued)",{"$f":"'App.2-K_Employee Costs'!E$12","v":"Last Rebasing Year (2013 Actuals)"},{"$f":"'App.2-K_Employee Costs'!E$22","v":0}]
[{"$f":"'LDC Info'!$E$14","v":0},0,2021,2020,2014,"Non-Management (union and non-union)","Total Benefits (Current + Accrued)",{"$f":"'App.2-K_Employee Costs'!E$12","v":"Last Rebasing Year (2013 Actuals)"},{"$f":"'App.2-K_Employee Costs'!E$23","v":0}]
[{"$f":"'LDC Info'!$E$14","v":0},0,2021,2020,2014,"Management (including executive)","Total Compensation (Salary, Wages, & Benefits)",{"$f":"'App.2-K_Employee Costs'!E$12","v":"Last Rebasing Year (2013 Actuals)"},{"$f":"'App.2-K_Employee Costs'!E$26","v":0}]
[{"$f":"'LDC Info'!$E$14","v":0},0,2021,2020,2014,"Non-Management (union and non-union)","Total Compensation (Salary, Wages, & Benefits)",{"$f":"'App.2-K_Employee Costs'!E$12","v":"Last Rebasing Year (2013 Actuals)"},{"$f":"'App.2-K_Employee Costs'!E$27","v":0}]
[{"$f":"'LDC Info'!$E$14","v":0},{"$f":"EBNUMBER","v":0},{"$f":"TestYear","v":2021},{"$f":"BridgeYear","v":2020},{"$f":"RebaseYear","v":2014},"Management (including executive)","Number of Employees (FTEs including Part-Time)",{"$f":"'App.2-K_Employee Costs'!F$12","v":"2013 Actuals"},{"$f":"'App.2-K_Employee Costs'!F$14","v":0}]
[{"$f":"'LDC Info'!$E$14","v":0},0,2021,2020,2014,"Non-Management (union and non-union)","Number of Employees (FTEs including Part-Time)",{"$f":"'App.2-K_Employee Costs'!F$12","v":"2013 Actuals"},{"$f":"'App.2-K_Employee Costs'!F$15","v":0}]
[{"$f":"'LDC Info'!$E$14","v":0},0,2021,2020,2014,"Management (including executive)","Total Salary and Wages including ovetime and incentive pay",{"$f":"'App.2-K_Employee Costs'!F$12","v":"2013 Actuals"},{"$f":"'App.2-K_Employee Costs'!F$18","v":0}]
[{"$f":"'LDC Info'!$E$14","v":0},0,2021,2020,2014,"Non-Management (union and non-union)","Total Salary and Wages including ovetime and incentive pay",{"$f":"'App.2-K_Employee Costs'!F$12","v":"2013 Actuals"},{"$f":"'App.2-K_Employee Costs'!F$19","v":0}]
[{"$f":"'LDC Info'!$E$14","v":0},0,2021,2020,2014,"Management (including executive)","Total Benefits (Current + Accrued)",{"$f":"'App.2-K_Employee Costs'!F$12","v":"2013 Actuals"},{"$f":"'App.2-K_Employee Costs'!F$22","v":0}]
[{"$f":"'LDC Info'!$E$14","v":0},0,2021,2020,2014,"Non-Management (union and non-union)","Total Benefits (Current + Accrued)",{"$f":"'App.2-K_Employee Costs'!F$12","v":"2013 Actuals"},{"$f":"'App.2-K_Employee Costs'!F$23","v":0}]
[{"$f":"'LDC Info'!$E$14","v":0},0,2021,2020,2014,"Management (including executive)","Total Compensation (Salary, Wages, & Benefits)",{"$f":"'App.2-K_Employee Costs'!F$12","v":"2013 Actuals"},{"$f":"'App.2-K_Employee Costs'!F$26","v":0}]
[{"$f":"'LDC Info'!$E$14","v":0},0,2021,2020,2014,"Non-Management (union and non-union)","Total Compensation (Salary, Wages, & Benefits)",{"$f":"'App.2-K_Employee Costs'!F$12","v":"2013 Actuals"},{"$f":"'App.2-K_Employee Costs'!F$27","v":0}]
[{"$f":"'LDC Info'!$E$14","v":0},0,2021,2020,2014,"Management (including executive)","Number of Employees (FTEs including Part-Time)",{"$f":"'App.2-K_Employee Costs'!G$12","v":"Last Rebasing Year (2014 OEB Approved)"},{"$f":"'App.2-K_Employee Costs'!G$14","v":0}]
[{"$f":"'LDC Info'!$E$14","v":0},0,2021,2020,2014,"Non-Management (union and non-union)","Number of Employees (FTEs including Part-Time)",{"$f":"'App.2-K_Employee Costs'!G$12","v":"Last Rebasing Year (2014 OEB Approved)"},{"$f":"'App.2-K_Employee Costs'!G$15","v":0}]
[{"$f":"'LDC Info'!$E$14","v":0},0,2021,2020,2014,"Management (including executive)","Total Salary and Wages including ovetime and incentive pay",{"$f":"'App.2-K_Employee Costs'!G$12","v":"Last Rebasing Year (2014 OEB Approved)"},{"$f":"'App.2-K_Employee Costs'!G$18","v":0}]
[{"$f":"'LDC Info'!$E$14","v":0},0,2021,2020,2014,"Non-Management (union and non-union)","Total Salary and Wages including ovetime and incentive pay",{"$f":"'App.2-K_Employee Costs'!G$12","v":"Last Rebasing Year (2014 OEB Approved)"},{"$f":"'App.2-K_Employee Costs'!G$19","v":0}]
[{"$f":"'LDC Info'!$E$14","v":0},0,2021,2020,2014,"Management (including executive)","Total Benefits (Current + Accrued)",{"$f":"'App.2-K_Employee Costs'!G$12","v":"Last Rebasing Year (2014 OEB Approved)"},{"$f":"'App.2-K_Employee Costs'!G$22","v":0}]
[{"$f":"'LDC Info'!$E$14","v":0},0,2021,2020,2014,"Non-Management (union and non-union)","Total Benefits (Current + Accrued)",{"$f":"'App.2-K_Employee Costs'!G$12","v":"Last Rebasing Year (2014 OEB Approved)"},{"$f":"'App.2-K_Employee Costs'!G$23","v":0}]
[{"$f":"'LDC Info'!$E$14","v":0},0,2021,2020,2014,"Management (including executive)","Total Compensation (Salary, Wages, & Benefits)",{"$f":"'App.2-K_Employee Costs'!G$12","v":"Last Rebasing Year (2014 OEB Approved)"},{"$f":"'App.2-K_Employee Costs'!G$26","v":0}]
[{"$f":"'LDC Info'!$E$14","v":0},0,2021,2020,2014,"Non-Management (union and non-union)","Total Compensation (Salary, Wages, & Benefits)",{"$f":"'App.2-K_Employee Costs'!G$12","v":"Last Rebasing Year (2014 OEB Approved)"},{"$f":"'App.2-K_Employee Costs'!G$27","v":0}]
[{"$f":"'LDC Info'!$E$14","v":0},0,2021,2020,2014,"Management (including executive)","Number of Employees (FTEs including Part-Time)",{"$f":"'App.2-K_Employee Costs'!H$12","v":"Last Rebasing Year (2014 Actuals)"},{"$f":"'App.2-K_Employee Costs'!H$14","v":0}]
[{"$f":"'LDC Info'!$E$14","v":0},0,2021,2020,2014,"Non-Management (union and non-union)","Number of Employees (FTEs including Part-Time)",{"$f":"'App.2-K_Employee Costs'!H$12","v":"Last Rebasing Year (2014 Actuals)"},{"$f":"'App.2-K_Employee Costs'!H$15","v":0}]
[{"$f":"'LDC Info'!$E$14","v":0},0,2021,2020,2014,"Management (including executive)","Total Salary and Wages including ovetime and incentive pay",{"$f":"'App.2-K_Employee Costs'!H$12","v":"Last Rebasing Year (2014 Actuals)"},{"$f":"'App.2-K_Employee Costs'!H$18","v":0}]
[{"$f":"'LDC Info'!$E$14","v":0},0,2021,2020,2014,"Non-Management (union and non-union)","Total Salary and Wages including ovetime and incentive pay",{"$f":"'App.2-K_Employee Costs'!H$12","v":"Last Rebasing Year (2014 Actuals)"},{"$f":"'App.2-K_Employee Costs'!H$19","v":0}]
[{"$f":"'LDC Info'!$E$14","v":0},0,2021,2020,2014,"Management (including executive)","Total Benefits (Current + Accrued)",{"$f":"'App.2-K_Employee Costs'!H$12","v":"Last Rebasing Year (2014 Actuals)"},{"$f":"'App.2-K_Employee Costs'!H$22","v":0}]
[{"$f":"'LDC Info'!$E$14","v":0},0,2021,2020,2014,"Non-Management (union and non-union)","Total Benefits (Current + Accrued)",{"$f":"'App.2-K_Employee Costs'!H$12","v":"Last Rebasing Year (2014 Actuals)"},{"$f":"'App.2-K_Employee Costs'!H$23","v":0}]
[{"$f":"'LDC Info'!$E$14","v":0},0,2021,2020,2014,"Management (including executive)","Total Compensation (Salary, Wages, & Benefits)",{"$f":"'App.2-K_Employee Costs'!H$12","v":"Last Rebasing Year (2014 Actuals)"},{"$f":"'App.2-K_Employee Costs'!H$26","v":0}]
[{"$f":"'LDC Info'!$E$14","v":0},0,2021,2020,2014,"Non-Management (union and non-union)","Total Compensation (Salary, Wages, & Benefits)",{"$f":"'App.2-K_Employee Costs'!H$12","v":"Last Rebasing Year (2014 Actuals)"},{"$f":"'App.2-K_Employee Costs'!H$27","v":0}]
[{"$f":"'LDC Info'!$E$14","v":0},0,2021,2020,2014,"Management (including executive)","Number of Employees (FTEs including Part-Time)",{"$f":"'App.2-K_Employee Costs'!I$12","v":"2014 Actuals"},{"$f":"'App.2-K_Employee Costs'!I$14","v":0}]
[{"$f":"'LDC Info'!$E$14","v":0},0,2021,2020,2014,"Non-Management (union and non-union)","Number of Employees (FTEs including Part-Time)",{"$f":"'App.2-K_Employee Costs'!I$12","v":"2014 Actuals"},{"$f":"'App.2-K_Employee Costs'!I$15","v":0}]
[{"$f":"'LDC Info'!$E$14","v":0},0,2021,2020,2014,"Management (including executive)","Total Salary and Wages including ovetime and incentive pay",{"$f":"'App.2-K_Employee Costs'!I$12","v":"2014 Actuals"},{"$f":"'App.2-K_Employee Costs'!I$18","v":0}]
[{"$f":"'LDC Info'!$E$14","v":0},0,2021,2020,2014,"Non-Management (union and non-union)","Total Salary and Wages including ovetime and incentive pay",{"$f":"'App.2-K_Employee Costs'!I$12","v":"2014 Actuals"},{"$f":"'App.2-K_Employee Costs'!I$19","v":0}]
[{"$f":"'LDC Info'!$E$14","v":0},0,2021,2020,2014,"Management (including executive)","Total Benefits (Current + Accrued)",{"$f":"'App.2-K_Employee Costs'!I$12","v":"2014 Actuals"},{"$f":"'App.2-K_Employee Costs'!I$22","v":0}]
[{"$f":"'LDC Info'!$E$14","v":0},0,2021,2020,2014,"Non-Management (union and non-union)","Total Benefits (Current + Accrued)",{"$f":"'App.2-K_Employee Costs'!I$12","v":"2014 Actuals"},{"$f":"'App.2-K_Employee Costs'!I$23","v":0}]
[{"$f":"'LDC Info'!$E$14","v":0},0,2021,2020,2014,"Management (including executive)","Total Compensation (Salary, Wages, & Benefits)",{"$f":"'App.2-K_Employee Costs'!I$12","v":"2014 Actuals"},{"$f":"'App.2-K_Employee Costs'!I$26","v":0}]
[{"$f":"'LDC Info'!$E$14","v":0},0,2021,2020,2014,"Non-Management (union and non-union)","Total Compensation (Salary, Wages, & Benefits)",{"$f":"'App.2-K_Employee Costs'!I$12","v":"2014 Actuals"},{"$f":"'App.2-K_Employee Costs'!I$27","v":0}]
[{"$f":"'LDC Info'!$E$14","v":0},{"$f":"EBNUMBER","v":0},{"$f":"TestYear","v":2021},{"$f":"BridgeYear","v":2020},{"$f":"RebaseYear","v":2014},"Management (including executive)","Number of Employees (FTEs including Part-Time)",{"$f":"'App.2-K_Employee Costs'!J$12","v":"Last Rebasing Year (2015 OEB Approved)"},{"$f":"'App.2-K_Employee Costs'!J$14","v":0}]
[{"$f":"'LDC Info'!$E$14","v":0},0,2021,2020,2014,"Non-Management (union and non-union)","Number of Employees (FTEs including Part-Time)",{"$f":"'App.2-K_Employee Costs'!J$12","v":"Last Rebasing Year (2015 OEB Approved)"},{"$f":"'App.2-K_Employee Costs'!J$15","v":0}]
[{"$f":"'LDC Info'!$E$14","v":0},0,2021,2020,2014,"Management (including executive)","Total Salary and Wages including ovetime and incentive pay",{"$f":"'App.2-K_Employee Costs'!J$12","v":"Last Rebasing Year (2015 OEB Approved)"},{"$f":"'App.2-K_Employee Costs'!J$18","v":0}]
[{"$f":"'LDC Info'!$E$14","v":0},0,2021,2020,2014,"Non-Management (union and non-union)","Total Salary and Wages including ovetime and incentive pay",{"$f":"'App.2-K_Employee Costs'!J$12","v":"Last Rebasing Year (2015 OEB Approved)"},{"$f":"'App.2-K_Employee Costs'!J$19","v":0}]
[{"$f":"'LDC Info'!$E$14","v":0},0,2021,2020,2014,"Management (including executive)","Total Benefits (Current + Accrued)",{"$f":"'App.2-K_Employee Costs'!J$12","v":"Last Rebasing Year (2015 OEB Approved)"},{"$f":"'App.2-K_Employee Costs'!J$22","v":0}]
[{"$f":"'LDC Info'!$E$14","v":0},0,2021,2020,2014,"Non-Management (union and non-union)","Total Benefits (Current + Accrued)",{"$f":"'App.2-K_Employee Costs'!J$12","v":"Last Rebasing Year (2015 OEB Approved)"},{"$f":"'App.2-K_Employee Costs'!J$23","v":0}]
[{"$f":"'LDC Info'!$E$14","v":0},0,2021,2020,2014,"Management (including executive)","Total Compensation (Salary, Wages, & Benefits)",{"$f":"'App.2-K_Employee Costs'!J$12","v":"Last Rebasing Year (2015 OEB Approved)"},{"$f":"'App.2-K_Employee Costs'!J$26","v":0}]
[{"$f":"'LDC Info'!$E$14","v":0},0,2021,2020,2014,"Non-Management (union and non-union)","Total Compensation (Salary, Wages, & Benefits)",{"$f":"'App.2-K_Employee Costs'!J$12","v":"Last Rebasing Year (2015 OEB Approved)"},{"$f":"'App.2-K_Employee Costs'!J$27","v":0}]
[{"$f":"'LDC Info'!$E$14","v":0},0,2021,2020,2014,"Management (including executive)","Number of Employees (FTEs including Part-Time)",{"$f":"'App.2-K_Employee Costs'!K$12","v":"Last Rebasing Year (2015 Actuals)"},{"$f":"'App.2-K_Employee Costs'!K$14","v":0}]
[{"$f":"'LDC Info'!$E$14","v":0},0,2021,2020,2014,"Non-Management (union and non-union)","Number of Employees (FTEs including Part-Time)",{"$f":"'App.2-K_Employee Costs'!K$12","v":"Last Rebasing Year (2015 Actuals)"},{"$f":"'App.2-K_Employee Costs'!K$15","v":0}]
[{"$f":"'LDC Info'!$E$14","v":0},0,2021,2020,2014,"Management (including executive)","Total Salary and Wages including ovetime and incentive pay",{"$f":"'App.2-K_Employee Costs'!K$12","v":"Last Rebasing Year (2015 Actuals)"},{"$f":"'App.2-K_Employee Costs'!K$18","v":0}]
[{"$f":"'LDC Info'!$E$14","v":0},0,2021,2020,2014,"Non-Management (union and non-union)","Total Salary and Wages including ovetime and incentive pay",{"$f":"'App.2-K_Employee Costs'!K$12","v":"Last Rebasing Year (2015 Actuals)"},{"$f":"'App.2-K_Employee Costs'!K$19","v":0}]
[{"$f":"'LDC Info'!$E$14","v":0},0,2021,2020,2014,"Management (including executive)","Total Benefits (Current + Accrued)",{"$f":"'App.2-K_Employee Costs'!K$12","v":"Last Rebasing Year (2015 Actuals)"},{"$f":"'App.2-K_Employee Costs'!K$22","v":0}]
[{"$f":"'LDC Info'!$E$14","v":0},0,2021,2020,2014,"Non-Management (union and non-union)","Total Benefits (Current + Accrued)",{"$f":"'App.2-K_Employee Costs'!K$12","v":"Last Rebasing Year (2015 Actuals)"},{"$f":"'App.2-K_Employee Costs'!K$23","v":0}]
[{"$f":"'LDC Info'!$E$14","v":0},0,2021,2020,2014,"Management (including executive)","Total Compensation (Salary, Wages, & Benefits)",{"$f":"'App.2-K_Employee Costs'!K$12","v":"Last Rebasing Year (2015 Actuals)"},{"$f":"'App.2-K_Employee Costs'!K$26","v":0}]
[{"$f":"'LDC Info'!$E$14","v":0},0,2021,2020,2014,"Non-Management (union and non-union)","Total Compensation (Salary, Wages, & Benefits)",{"$f":"'App.2-K_Employee Costs'!K$12","v":"Last Rebasing Year (2015 Actuals)"},{"$f":"'App.2-K_Employee Costs'!K$27","v":0}]
[{"$f":"'LDC Info'!$E$14","v":0},0,2021,2020,2014,"Management (including executive)","Number of Employees (FTEs including Part-Time)",{"$f":"'App.2-K_Employee Costs'!L$12","v":"2015 Actuals"},{"$f":"'App.2-K_Employee Costs'!L$14","v":0}]
[{"$f":"'LDC Info'!$E$14","v":0},0,2021,2020,2014,"Non-Management (union and non-union)","Number of Employees (FTEs including Part-Time)",{"$f":"'App.2-K_Employee Costs'!L$12","v":"2015 Actuals"},{"$f":"'App.2-K_Employee Costs'!L$15","v":0}]
[{"$f":"'LDC Info'!$E$14","v":0},0,2021,2020,2014,"Management (including executive)","Total Salary and Wages including ovetime and incentive pay",{"$f":"'App.2-K_Employee Costs'!L$12","v":"2015 Actuals"},{"$f":"'App.2-K_Employee Costs'!L$18","v":0}]
[{"$f":"'LDC Info'!$E$14","v":0},0,2021,2020,2014,"Non-Management (union and non-union)","Total Salary and Wages including ovetime and incentive pay",{"$f":"'App.2-K_Employee Costs'!L$12","v":"2015 Actuals"},{"$f":"'App.2-K_Employee Costs'!L$19","v":0}]
[{"$f":"'LDC Info'!$E$14","v":0},0,2021,2020,2014,"Management (including executive)","Total Benefits (Current + Accrued)",{"$f":"'App.2-K_Employee Costs'!L$12","v":"2015 Actuals"},{"$f":"'App.2-K_Employee Costs'!L$22","v":0}]
[{"$f":"'LDC Info'!$E$14","v":0},0,2021,2020,2014,"Non-Management (union and non-union)","Total Benefits (Current + Accrued)",{"$f":"'App.2-K_Employee Costs'!L$12","v":"2015 Actuals"},{"$f":"'App.2-K_Employee Costs'!L$23","v":0}]
[{"$f":"'LDC Info'!$E$14","v":0},0,2021,2020,2014,"Management (including executive)","Total Compensation (Salary, Wages, & Benefits)",{"$f":"'App.2-K_Employee Costs'!L$12","v":"2015 Actuals"},{"$f":"'App.2-K_Employee Costs'!L$26","v":0}]
[{"$f":"'LDC Info'!$E$14","v":0},0,2021,2020,2014,"Non-Management (union and non-union)","Total Compensation (Salary, Wages, & Benefits)",{"$f":"'App.2-K_Employee Costs'!L$12","v":"2015 Actuals"},{"$f":"'App.2-K_Employee Costs'!L$27","v":0}]
[{"$f":"'LDC Info'!$E$14","v":0},0,2021,2020,2014,"Management (including executive)","Number of Employees (FTEs including Part-Time)",{"$f":"'App.2-K_Employee Costs'!M$12","v":"Last Rebasing Year (2016 OEB Approved)"},{"$f":"'App.2-K_Employee Costs'!M$14","v":0}]
[{"$f":"'LDC Info'!$E$14","v":0},0,2021,2020,2014,"Non-Management (union and non-union)","Number of Employees (FTEs including Part-Time)",{"$f":"'App.2-K_Employee Costs'!M$12","v":"Last Rebasing Year (2016 OEB Approved)"},{"$f":"'App.2-K_Employee Costs'!M$15","v":0}]
[{"$f":"'LDC Info'!$E$14","v":0},0,2021,2020,2014,"Management (including executive)","Total Salary and Wages including ovetime and incentive pay",{"$f":"'App.2-K_Employee Costs'!M$12","v":"Last Rebasing Year (2016 OEB Approved)"},{"$f":"'App.2-K_Employee Costs'!M$18","v":0}]
[{"$f":"'LDC Info'!$E$14","v":0},0,2021,2020,2014,"Non-Management (union and non-union)","Total Salary and Wages including ovetime and incentive pay",{"$f":"'App.2-K_Employee Costs'!M$12","v":"Last Rebasing Year (2016 OEB Approved)"},{"$f":"'App.2-K_Employee Costs'!M$19","v":0}]
[{"$f":"'LDC Info'!$E$14","v":0},0,2021,2020,2014,"Management (including executive)","Total Benefits (Current + Accrued)",{"$f":"'App.2-K_Employee Costs'!M$12","v":"Last Rebasing Year (2016 OEB Approved)"},{"$f":"'App.2-K_Employee Costs'!M$22","v":0}]
[{"$f":"'LDC Info'!$E$14","v":0},0,2021,2020,2014,"Non-Management (union and non-union)","Total Benefits (Current + Accrued)",{"$f":"'App.2-K_Employee Costs'!M$12","v":"Last Rebasing Year (2016 OEB Approved)"},{"$f":"'App.2-K_Employee Costs'!M$23","v":0}]
[{"$f":"'LDC Info'!$E$14","v":0},0,2021,2020,2014,"Management (including executive)","Total Compensation (Salary, Wages, & Benefits)",{"$f":"'App.2-K_Employee Costs'!M$12","v":"Last Rebasing Year (2016 OEB Approved)"},{"$f":"'App.2-K_Employee Costs'!M$26","v":0}]
[{"$f":"'LDC Info'!$E$14","v":0},0,2021,2020,2014,"Non-Management (union and non-union)","Total Compensation (Salary, Wages, & Benefits)",{"$f":"'App.2-K_Employee Costs'!M$12","v":"Last Rebasing Year (2016 OEB Approved)"},{"$f":"'App.2-K_Employee Costs'!M$27","v":0}]
[{"$f":"'LDC Info'!$E$14","v":0},{"$f":"EBNUMBER","v":0},{"$f":"TestYear","v":2021},{"$f":"BridgeYear","v":2020},{"$f":"RebaseYear","v":2014},"Management (including executive)","Number of Employees (FTEs including Part-Time)",{"$f":"'App.2-K_Employee Costs'!N$12","v":"Last Rebasing Year (2016 Actuals)"},{"$f":"'App.2-K_Employee Costs'!N$14","v":0}]
[{"$f":"'LDC Info'!$E$14","v":0},0,2021,2020,2014,"Non-Management (union and non-union)","Number of Employees (FTEs including Part-Time)",{"$f":"'App.2-K_Employee Costs'!N$12","v":"Last Rebasing Year (2016 Actuals)"},{"$f":"'App.2-K_Employee Costs'!N$15","v":0}]
[{"$f":"'LDC Info'!$E$14","v":0},0,2021,2020,2014,"Management (including executive)","Total Salary and Wages including ovetime and incentive pay",{"$f":"'App.2-K_Employee Costs'!N$12","v":"Last Rebasing Year (2016 Actuals)"},{"$f":"'App.2-K_Employee Costs'!N$18","v":0}]
[{"$f":"'LDC Info'!$E$14","v":0},0,2021,2020,2014,"Non-Management (union and non-union)","Total Salary and Wages including ovetime and incentive pay",{"$f":"'App.2-K_Employee Costs'!N$12","v":"Last Rebasing Year (2016 Actuals)"},{"$f":"'App.2-K_Employee Costs'!N$19","v":0}]
[{"$f":"'LDC Info'!$E$14","v":0},0,2021,2020,2014,"Management (including executive)","Total Benefits (Current + Accrued)",{"$f":"'App.2-K_Employee Costs'!N$12","v":"Last Rebasing Year (2016 Actuals)"},{"$f":"'App.2-K_Employee Costs'!N$22","v":0}]
[{"$f":"'LDC Info'!$E$14","v":0},0,2021,2020,2014,"Non-Management (union and non-union)","Total Benefits (Current + Accrued)",{"$f":"'App.2-K_Employee Costs'!N$12","v":"Last Rebasing Year (2016 Actuals)"},{"$f":"'App.2-K_Employee Costs'!N$23","v":0}]
[{"$f":"'LDC Info'!$E$14","v":0},0,2021,2020,2014,"Management (including executive)","Total Compensation (Salary, Wages, & Benefits)",{"$f":"'App.2-K_Employee Costs'!N$12","v":"Last Rebasing Year (2016 Actuals)"},{"$f":"'App.2-K_Employee Costs'!N$26","v":0}]
[{"$f":"'LDC Info'!$E$14","v":0},0,2021,2020,2014,"Non-Management (union and non-union)","Total Compensation (Salary, Wages, & Benefits)",{"$f":"'App.2-K_Employee Costs'!N$12","v":"Last Rebasing Year (2016 Actuals)"},{"$f":"'App.2-K_Employee Costs'!N$27","v":0}]
[{"$f":"'LDC Info'!$E$14","v":0},0,2021,2020,2014,"Management (including executive)","Number of Employees (FTEs including Part-Time)",{"$f":"'App.2-K_Employee Costs'!O$12","v":"2016 Actuals"},{"$f":"'App.2-K_Employee Costs'!O$14","v":0}]
[{"$f":"'LDC Info'!$E$14","v":0},0,2021,2020,2014,"Non-Management (union and non-union)","Number of Employees (FTEs including Part-Time)",{"$f":"'App.2-K_Employee Costs'!O$12","v":"2016 Actuals"},{"$f":"'App.2-K_Employee Costs'!O$15","v":0}]
[{"$f":"'LDC Info'!$E$14","v":0},0,2021,2020,2014,"Management (including executive)","Total Salary and Wages including ovetime and incentive pay",{"$f":"'App.2-K_Employee Costs'!O$12","v":"2016 Actuals"},{"$f":"'App.2-K_Employee Costs'!O$18","v":0}]
[{"$f":"'LDC Info'!$E$14","v":0},0,2021,2020,2014,"Non-Management (union and non-union)","Total Salary and Wages including ovetime and incentive pay",{"$f":"'App.2-K_Employee Costs'!O$12","v":"2016 Actuals"},{"$f":"'App.2-K_Employee Costs'!O$19","v":0}]
[{"$f":"'LDC Info'!$E$14","v":0},0,2021,2020,2014,"Management (including executive)","Total Benefits (Current + Accrued)",{"$f":"'App.2-K_Employee Costs'!O$12","v":"2016 Actuals"},{"$f":"'App.2-K_Employee Costs'!O$22","v":0}]
[{"$f":"'LDC Info'!$E$14","v":0},0,2021,2020,2014,"Non-Management (union and non-union)","Total Benefits (Current + Accrued)",{"$f":"'App.2-K_Employee Costs'!O$12","v":"2016 Actuals"},{"$f":"'App.2-K_Employee Costs'!O$23","v":0}]
[{"$f":"'LDC Info'!$E$14","v":0},0,2021,2020,2014,"Management (including executive)","Total Compensation (Salary, Wages, & Benefits)",{"$f":"'App.2-K_Employee Costs'!O$12","v":"2016 Actuals"},{"$f":"'App.2-K_Employee Costs'!O$26","v":0}]
[{"$f":"'LDC Info'!$E$14","v":0},0,2021,2020,2014,"Non-Management (union and non-union)","Total Compensation (Salary, Wages, & Benefits)",{"$f":"'App.2-K_Employee Costs'!O$12","v":"2016 Actuals"},{"$f":"'App.2-K_Employee Costs'!O$27","v":0}]
[{"$f":"'LDC Info'!$E$14","v":0},0,2021,2020,2014,"Management (including executive)","Number of Employees (FTEs including Part-Time)",{"$f":"'App.2-K_Employee Costs'!P$12","v":"Last Rebasing Year (2017 OEB Approved)"},{"$f":"'App.2-K_Employee Costs'!P$14","v":0}]
[{"$f":"'LDC Info'!$E$14","v":0},0,2021,2020,2014,"Non-Management (union and non-union)","Number of Employees (FTEs including Part-Time)",{"$f":"'App.2-K_Employee Costs'!P$12","v":"Last Rebasing Year (2017 OEB Approved)"},{"$f":"'App.2-K_Employee Costs'!P$15","v":0}]
[{"$f":"'LDC Info'!$E$14","v":0},0,2021,2020,2014,"Management (including executive)","Total Salary and Wages including ovetime and incentive pay",{"$f":"'App.2-K_Employee Costs'!P$12","v":"Last Rebasing Year (2017 OEB Approved)"},{"$f":"'App.2-K_Employee Costs'!P$18","v":0}]
[{"$f":"'LDC Info'!$E$14","v":0},0,2021,2020,2014,"Non-Management (union and non-union)","Total Salary and Wages including ovetime and incentive pay",{"$f":"'App.2-K_Employee Costs'!P$12","v":"Last Rebasing Year (2017 OEB Approved)"},{"$f":"'App.2-K_Employee Costs'!P$19","v":0}]
[{"$f":"'LDC Info'!$E$14","v":0},0,2021,2020,2014,"Management (including executive)","Total Benefits (Current + Accrued)",{"$f":"'App.2-K_Employee Costs'!P$12","v":"Last Rebasing Year (2017 OEB Approved)"},{"$f":"'App.2-K_Employee Costs'!P$22","v":0}]
[{"$f":"'LDC Info'!$E$14","v":0},0,2021,2020,2014,"Non-Management (union and non-union)","Total Benefits (Current + Accrued)",{"$f":"'App.2-K_Employee Costs'!P$12","v":"Last Rebasing Year (2017 OEB Approved)"},{"$f":"'App.2-K_Employee Costs'!P$23","v":0}]
[{"$f":"'LDC Info'!$E$14","v":0},0,2021,2020,2014,"Management (including executive)","Total Compensation (Salary, Wages, & Benefits)",{"$f":"'App.2-K_Employee Costs'!P$12","v":"Last Rebasing Year (2017 OEB Approved)"},{"$f":"'App.2-K_Employee Costs'!P$26","v":0}]
[{"$f":"'LDC Info'!$E$14","v":0},0,2021,2020,2014,"Non-Management (union and non-union)","Total Compensation (Salary, Wages, & Benefits)",{"$f":"'App.2-K_Employee Costs'!P$12","v":"Last Rebasing Year (2017 OEB Approved)"},{"$f":"'App.2-K_Employee Costs'!P$27","v":0}]
[{"$f":"'LDC Info'!$E$14","v":0},0,2021,2020,2014,"Management (including executive)","Number of Employees (FTEs including Part-Time)",{"$f":"'App.2-K_Employee Costs'!Q$12","v":"Last Rebasing Year (2017 Actuals)"},{"$f":"'App.2-K_Employee Costs'!Q$14","v":0}]
[{"$f":"'LDC Info'!$E$14","v":0},0,2021,2020,2014,"Non-Management (union and non-union)","Number of Employees (FTEs including Part-Time)",{"$f":"'App.2-K_Employee Costs'!Q$12","v":"Last Rebasing Year (2017 Actuals)"},{"$f":"'App.2-K_Employee Costs'!Q$15","v":0}]
[{"$f":"'LDC Info'!$E$14","v":0},0,2021,2020,2014,"Management (including executive)","Total Salary and Wages including ovetime and incentive pay",{"$f":"'App.2-K_Employee Costs'!Q$12","v":"Last Rebasing Year (2017 Actuals)"},{"$f":"'App.2-K_Employee Costs'!Q$18","v":0}]
[{"$f":"'LDC Info'!$E$14","v":0},0,2021,2020,2014,"Non-Management (union and non-union)","Total Salary and Wages including ovetime and incentive pay",{"$f":"'App.2-K_Employee Costs'!Q$12","v":"Last Rebasing Year (2017 Actuals)"},{"$f":"'App.2-K_Employee Costs'!Q$19","v":0}]
[{"$f":"'LDC Info'!$E$14","v":0},0,2021,2020,2014,"Management (including executive)","Total Benefits (Current + Accrued)",{"$f":"'App.2-K_Employee Costs'!Q$12","v":"Last Rebasing Year (2017 Actuals)"},{"$f":"'App.2-K_Employee Costs'!Q$22","v":0}]
[{"$f":"'LDC Info'!$E$14","v":0},0,2021,2020,2014,"Non-Management (union and non-union)","Total Benefits (Current + Accrued)",{"$f":"'App.2-K_Employee Costs'!Q$12","v":"Last Rebasing Year (2017 Actuals)"},{"$f":"'App.2-K_Employee Costs'!Q$23","v":0}]
[{"$f":"'LDC Info'!$E$14","v":0},0,2021,2020,2014,"Management (including executive)","Total Compensation (Salary, Wages, & Benefits)",{"$f":"'App.2-K_Employee Costs'!Q$12","v":"Last Rebasing Year (2017 Actuals)"},{"$f":"'App.2-K_Employee Costs'!Q$26","v":0}]
[{"$f":"'LDC Info'!$E$14","v":0},0,2021,2020,2014,"Non-Management (union and non-union)","Total Compensation (Salary, Wages, & Benefits)",{"$f":"'App.2-K_Employee Costs'!Q$12","v":"Last Rebasing Year (2017 Actuals)"},{"$f":"'App.2-K_Employee Costs'!Q$27","v":0}]
[{"$f":"'LDC Info'!$E$14","v":0},{"$f":"EBNUMBER","v":0},{"$f":"TestYear","v":2021},{"$f":"BridgeYear","v":2020},{"$f":"RebaseYear","v":2014},"Management (including executive)","Number of Employees (FTEs including Part-Time)",{"$f":"'App.2-K_Employee Costs'!R$12","v":"2017 Actuals"},{"$f":"'App.2-K_Employee Costs'!R$14","v":0}]
[{"$f":"'LDC Info'!$E$14","v":0},0,2021,2020,2014,"Non-Management (union and non-union)","Number of Employees (FTEs including Part-Time)",{"$f":"'App.2-K_Employee Costs'!R$12","v":"2017 Actuals"},{"$f":"'App.2-K_Employee Costs'!R$15","v":0}]
[{"$f":"'LDC Info'!$E$14","v":0},0,2021,2020,2014,"Management (including executive)","Total Salary and Wages including ovetime and incentive pay",{"$f":"'App.2-K_Employee Costs'!R$12","v":"2017 Actuals"},{"$f":"'App.2-K_Employee Costs'!R$18","v":0}]
[{"$f":"'LDC Info'!$E$14","v":0},0,2021,2020,2014,"Non-Management (union and non-union)","Total Salary and Wages including ovetime and incentive pay",{"$f":"'App.2-K_Employee Costs'!R$12","v":"2017 Actuals"},{"$f":"'App.2-K_Employee Costs'!R$19","v":0}]
[{"$f":"'LDC Info'!$E$14","v":0},0,2021,2020,2014,"Management (including executive)","Total Benefits (Current + Accrued)",{"$f":"'App.2-K_Employee Costs'!R$12","v":"2017 Actuals"},{"$f":"'App.2-K_Employee Costs'!R$22","v":0}]
[{"$f":"'LDC Info'!$E$14","v":0},0,2021,2020,2014,"Non-Management (union and non-union)","Total Benefits (Current + Accrued)",{"$f":"'App.2-K_Employee Costs'!R$12","v":"2017 Actuals"},{"$f":"'App.2-K_Employee Costs'!R$23","v":0}]
[{"$f":"'LDC Info'!$E$14","v":0},0,2021,2020,2014,"Management (including executive)","Total Compensation (Salary, Wages, & Benefits)",{"$f":"'App.2-K_Employee Costs'!R$12","v":"2017 Actuals"},{"$f":"'App.2-K_Employee Costs'!R$26","v":0}]
[{"$f":"'LDC Info'!$E$14","v":0},0,2021,2020,2014,"Non-Management (union and non-union)","Total Compensation (Salary, Wages, & Benefits)",{"$f":"'App.2-K_Employee Costs'!R$12","v":"2017 Actuals"},{"$f":"'App.2-K_Employee Costs'!R$27","v":0}]
[{"$f":"'LDC Info'!$E$14","v":0},0,2021,2020,2014,"Management (including executive)","Number of Employees (FTEs including Part-Time)",{"$f":"'App.2-K_Employee Costs'!S$12","v":"Last Rebasing Year (2018 OEB Approved)"},{"$f":"'App.2-K_Employee Costs'!S$14","v":0}]
[{"$f":"'LDC Info'!$E$14","v":0},0,2021,2020,2014,"Non-Management (union and non-union)","Number of Employees (FTEs including Part-Time)",{"$f":"'App.2-K_Employee Costs'!S$12","v":"Last Rebasing Year (2018 OEB Approved)"},{"$f":"'App.2-K_Employee Costs'!S$15","v":0}]
[{"$f":"'LDC Info'!$E$14","v":0},0,2021,2020,2014,"Management (including executive)","Total Salary and Wages including ovetime and incentive pay",{"$f":"'App.2-K_Employee Costs'!S$12","v":"Last Rebasing Year (2018 OEB Approved)"},{"$f":"'App.2-K_Employee Costs'!S$18","v":0}]
[{"$f":"'LDC Info'!$E$14","v":0},0,2021,2020,2014,"Non-Management (union and non-union)","Total Salary and Wages including ovetime and incentive pay",{"$f":"'App.2-K_Employee Costs'!S$12","v":"Last Rebasing Year (2018 OEB Approved)"},{"$f":"'App.2-K_Employee Costs'!S$19","v":0}]
[{"$f":"'LDC Info'!$E$14","v":0},0,2021,2020,2014,"Management (including executive)","Total Benefits (Current + Accrued)",{"$f":"'App.2-K_Employee Costs'!S$12","v":"Last Rebasing Year (2018 OEB Approved)"},{"$f":"'App.2-K_Employee Costs'!S$22","v":0}]
[{"$f":"'LDC Info'!$E$14","v":0},0,2021,2020,2014,"Non-Management (union and non-union)","Total Benefits (Current + Accrued)",{"$f":"'App.2-K_Employee Costs'!S$12","v":"Last Rebasing Year (2018 OEB Approved)"},{"$f":"'App.2-K_Employee Costs'!S$23","v":0}]
[{"$f":"'LDC Info'!$E$14","v":0},0,2021,2020,2014,"Management (including executive)","Total Compensation (Salary, Wages, & Benefits)",{"$f":"'App.2-K_Employee Costs'!S$12","v":"Last Rebasing Year (2018 OEB Approved)"},{"$f":"'App.2-K_Employee Costs'!S$26","v":0}]
[{"$f":"'LDC Info'!$E$14","v":0},0,2021,2020,2014,"Non-Management (union and non-union)","Total Compensation (Salary, Wages, & Benefits)",{"$f":"'App.2-K_Employee Costs'!S$12","v":"Last Rebasing Year (2018 OEB Approved)"},{"$f":"'App.2-K_Employee Costs'!S$27","v":0}]
[{"$f":"'LDC Info'!$E$14","v":0},0,2021,2020,2014,"Management (including executive)","Number of Employees (FTEs including Part-Time)",{"$f":"'App.2-K_Employee Costs'!T$12","v":"Last Rebasing Year (2018 Actuals)"},{"$f":"'App.2-K_Employee Costs'!T$14","v":0}]
[{"$f":"'LDC Info'!$E$14","v":0},0,2021,2020,2014,"Non-Management (union and non-union)","Number of Employees (FTEs including Part-Time)",{"$f":"'App.2-K_Employee Costs'!T$12","v":"Last Rebasing Year (2018 Actuals)"},{"$f":"'App.2-K_Employee Costs'!T$15","v":0}]
[{"$f":"'LDC Info'!$E$14","v":0},0,2021,2020,2014,"Management (including executive)","Total Salary and Wages including ovetime and incentive pay",{"$f":"'App.2-K_Employee Costs'!T$12","v":"Last Rebasing Year (2018 Actuals)"},{"$f":"'App.2-K_Employee Costs'!T$18","v":0}]
[{"$f":"'LDC Info'!$E$14","v":0},0,2021,2020,2014,"Non-Management (union and non-union)","Total Salary and Wages including ovetime and incentive pay",{"$f":"'App.2-K_Employee Costs'!T$12","v":"Last Rebasing Year (2018 Actuals)"},{"$f":"'App.2-K_Employee Costs'!T$19","v":0}]
[{"$f":"'LDC Info'!$E$14","v":0},0,2021,2020,2014,"Management (including executive)","Total Benefits (Current + Accrued)",{"$f":"'App.2-K_Employee Costs'!T$12","v":"Last Rebasing Year (2018 Actuals)"},{"$f":"'App.2-K_Employee Costs'!T$22","v":0}]
[{"$f":"'LDC Info'!$E$14","v":0},0,2021,2020,2014,"Non-Management (union and non-union)","Total Benefits (Current + Accrued)",{"$f":"'App.2-K_Employee Costs'!T$12","v":"Last Rebasing Year (2018 Actuals)"},{"$f":"'App.2-K_Employee Costs'!T$23","v":0}]
[{"$f":"'LDC Info'!$E$14","v":0},0,2021,2020,2014,"Management (including executive)","Total Compensation (Salary, Wages, & Benefits)",{"$f":"'App.2-K_Employee Costs'!T$12","v":"Last Rebasing Year (2018 Actuals)"},{"$f":"'App.2-K_Employee Costs'!T$26","v":0}]
[{"$f":"'LDC Info'!$E$14","v":0},0,2021,2020,2014,"Non-Management (union and non-union)","Total Compensation (Salary, Wages, & Benefits)",{"$f":"'App.2-K_Employee Costs'!T$12","v":"Last Rebasing Year (2018 Actuals)"},{"$f":"'App.2-K_Employee Costs'!T$27","v":0}]
[{"$f":"'LDC Info'!$E$14","v":0},0,2021,2020,2014,"Management (including executive)","Number of Employees (FTEs including Part-Time)",{"$f":"'App.2-K_Employee Costs'!U$12","v":"2018 Actuals"},{"$f":"'App.2-K_Employee Costs'!U$14","v":0}]
[{"$f":"'LDC Info'!$E$14","v":0},0,2021,2020,2014,"Non-Management (union and non-union)","Number of Employees (FTEs including Part-Time)",{"$f":"'App.2-K_Employee Costs'!U$12","v":"2018 Actuals"},{"$f":"'App.2-K_Employee Costs'!U$15","v":0}]
[{"$f":"'LDC Info'!$E$14","v":0},0,2021,2020,2014,"Management (including executive)","Total Salary and Wages including ovetime and incentive pay",{"$f":"'App.2-K_Employee Costs'!U$12","v":"2018 Actuals"},{"$f":"'App.2-K_Employee Costs'!U$18","v":0}]
[{"$f":"'LDC Info'!$E$14","v":0},0,2021,2020,2014,"Non-Management (union and non-union)","Total Salary and Wages including ovetime and incentive pay",{"$f":"'App.2-K_Employee Costs'!U$12","v":"2018 Actuals"},{"$f":"'App.2-K_Employee Costs'!U$19","v":0}]
[{"$f":"'LDC Info'!$E$14","v":0},0,2021,2020,2014,"Management (including executive)","Total Benefits (Current + Accrued)",{"$f":"'App.2-K_Employee Costs'!U$12","v":"2018 Actuals"},{"$f":"'App.2-K_Employee Costs'!U$22","v":0}]
[{"$f":"'LDC Info'!$E$14","v":0},0,2021,2020,2014,"Non-Management (union and non-union)","Total Benefits (Current + Accrued)",{"$f":"'App.2-K_Employee Costs'!U$12","v":"2018 Actuals"},{"$f":"'App.2-K_Employee Costs'!U$23","v":0}]
[{"$f":"'LDC Info'!$E$14","v":0},0,2021,2020,2014,"Management (including executive)","Total Compensation (Salary, Wages, & Benefits)",{"$f":"'App.2-K_Employee Costs'!U$12","v":"2018 Actuals"},{"$f":"'App.2-K_Employee Costs'!U$26","v":0}]
[{"$f":"'LDC Info'!$E$14","v":0},0,2021,2020,2014,"Non-Management (union and non-union)","Total Compensation (Salary, Wages, & Benefits)",{"$f":"'App.2-K_Employee Costs'!U$12","v":"2018 Actuals"},{"$f":"'App.2-K_Employee Costs'!U$27","v":0}]
[{"$f":"'LDC Info'!$E$14","v":0},{"$f":"EBNUMBER","v":0},{"$f":"TestYear","v":2021},{"$f":"BridgeYear","v":2020},{"$f":"RebaseYear","v":2014},"Management (including executive)","Number of Employees (FTEs including Part-Time)",{"$f":"'App.2-K_Employee Costs'!V$12","v":"Last Rebasing Year (2019 OEB Approved)"},{"$f":"'App.2-K_Employee Costs'!V$14","v":0}]
[{"$f":"'LDC Info'!$E$14","v":0},0,2021,2020,2014,"Non-Management (union and non-union)","Number of Employees (FTEs including Part-Time)",{"$f":"'App.2-K_Employee Costs'!V$12","v":"Last Rebasing Year (2019 OEB Approved)"},{"$f":"'App.2-K_Employee Costs'!V$15","v":0}]
[{"$f":"'LDC Info'!$E$14","v":0},0,2021,2020,2014,"Management (including executive)","Total Salary and Wages including ovetime and incentive pay",{"$f":"'App.2-K_Employee Costs'!V$12","v":"Last Rebasing Year (2019 OEB Approved)"},{"$f":"'App.2-K_Employee Costs'!V$18","v":0}]
[{"$f":"'LDC Info'!$E$14","v":0},0,2021,2020,2014,"Non-Management (union and non-union)","Total Salary and Wages including ovetime and incentive pay",{"$f":"'App.2-K_Employee Costs'!V$12","v":"Last Rebasing Year (2019 OEB Approved)"},{"$f":"'App.2-K_Employee Costs'!V$19","v":0}]
[{"$f":"'LDC Info'!$E$14","v":0},0,2021,2020,2014,"Management (including executive)","Total Benefits (Current + Accrued)",{"$f":"'App.2-K_Employee Costs'!V$12","v":"Last Rebasing Year (2019 OEB Approved)"},{"$f":"'App.2-K_Employee Costs'!V$22","v":0}]
[{"$f":"'LDC Info'!$E$14","v":0},0,2021,2020,2014,"Non-Management (union and non-union)","Total Benefits (Current + Accrued)",{"$f":"'App.2-K_Employee Costs'!V$12","v":"Last Rebasing Year (2019 OEB Approved)"},{"$f":"'App.2-K_Employee Costs'!V$23","v":0}]
[{"$f":"'LDC Info'!$E$14","v":0},0,2021,2020,2014,"Management (including executive)","Total Compensation (Salary, Wages, & Benefits)",{"$f":"'App.2-K_Employee Costs'!V$12","v":"Last Rebasing Year (2019 OEB Approved)"},{"$f":"'App.2-K_Employee Costs'!V$26","v":0}]
[{"$f":"'LDC Info'!$E$14","v":0},0,2021,2020,2014,"Non-Management (union and non-union)","Total Compensation (Salary, Wages, & Benefits)",{"$f":"'App.2-K_Employee Costs'!V$12","v":"Last Rebasing Year (2019 OEB Approved)"},{"$f":"'App.2-K_Employee Costs'!V$27","v":0}]
[{"$f":"'LDC Info'!$E$14","v":0},0,2021,2020,2014,"Management (including executive)","Number of Employees (FTEs including Part-Time)",{"$f":"'App.2-K_Employee Costs'!W$12","v":"Last Rebasing Year (2019 Actuals)"},{"$f":"'App.2-K_Employee Costs'!W$14","v":0}]
[{"$f":"'LDC Info'!$E$14","v":0},0,2021,2020,2014,"Non-Management (union and non-union)","Number of Employees (FTEs including Part-Time)",{"$f":"'App.2-K_Employee Costs'!W$12","v":"Last Rebasing Year (2019 Actuals)"},{"$f":"'App.2-K_Employee Costs'!W$15","v":0}]
[{"$f":"'LDC Info'!$E$14","v":0},0,2021,2020,2014,"Management (including executive)","Total Salary and Wages including ovetime and incentive pay",{"$f":"'App.2-K_Employee Costs'!W$12","v":"Last Rebasing Year (2019 Actuals)"},{"$f":"'App.2-K_Employee Costs'!W$18","v":0}]
[{"$f":"'LDC Info'!$E$14","v":0},0,2021,2020,2014,"Non-Management (union and non-union)","Total Salary and Wages including ovetime and incentive pay",{"$f":"'App.2-K_Employee Costs'!W$12","v":"Last Rebasing Year (2019 Actuals)"},{"$f":"'App.2-K_Employee Costs'!W$19","v":0}]
[{"$f":"'LDC Info'!$E$14","v":0},0,2021,2020,2014,"Management (including executive)","Total Benefits (Current + Accrued)",{"$f":"'App.2-K_Employee Costs'!W$12","v":"Last Rebasing Year (2019 Actuals)"},{"$f":"'App.2-K_Employee Costs'!W$22","v":0}]
[{"$f":"'LDC Info'!$E$14","v":0},0,2021,2020,2014,"Non-Management (union and non-union)","Total Benefits (Current + Accrued)",{"$f":"'App.2-K_Employee Costs'!W$12","v":"Last Rebasing Year (2019 Actuals)"},{"$f":"'App.2-K_Employee Costs'!W$23","v":0}]
[{"$f":"'LDC Info'!$E$14","v":0},0,2021,2020,2014,"Management (including executive)","Total Compensation (Salary, Wages, & Benefits)",{"$f":"'App.2-K_Employee Costs'!W$12","v":"Last Rebasing Year (2019 Actuals)"},{"$f":"'App.2-K_Employee Costs'!W$26","v":0}]
[{"$f":"'LDC Info'!$E$14","v":0},0,2021,2020,2014,"Non-Management (union and non-union)","Total Compensation (Salary, Wages, & Benefits)",{"$f":"'App.2-K_Employee Costs'!W$12","v":"Last Rebasing Year (2019 Actuals)"},{"$f":"'App.2-K_Employee Costs'!W$27","v":0}]
[{"$f":"'LDC Info'!$E$14","v":0},0,2021,2020,2014,"Management (including executive)","Number of Employees (FTEs including Part-Time)",{"$f":"'App.2-K_Employee Costs'!X$12","v":"2019 Actuals"},{"$f":"'App.2-K_Employee Costs'!X$14","v":0}]
[{"$f":"'LDC Info'!$E$14","v":0},0,2021,2020,2014,"Non-Management (union and non-union)","Number of Employees (FTEs including Part-Time)",{"$f":"'App.2-K_Employee Costs'!X$12","v":"2019 Actuals"},{"$f":"'App.2-K_Employee Costs'!X$15","v":0}]
[{"$f":"'LDC Info'!$E$14","v":0},0,2021,2020,2014,"Management (including executive)","Total Salary and Wages including ovetime and incentive pay",{"$f":"'App.2-K_Employee Costs'!X$12","v":"2019 Actuals"},{"$f":"'App.2-K_Employee Costs'!X$18","v":0}]
[{"$f":"'LDC Info'!$E$14","v":0},0,2021,2020,2014,"Non-Management (union and non-union)","Total Salary and Wages including ovetime and incentive pay",{"$f":"'App.2-K_Employee Costs'!X$12","v":"2019 Actuals"},{"$f":"'App.2-K_Employee Costs'!X$19","v":0}]
[{"$f":"'LDC Info'!$E$14","v":0},0,2021,2020,2014,"Management (including executive)","Total Benefits (Current + Accrued)",{"$f":"'App.2-K_Employee Costs'!X$12","v":"2019 Actuals"},{"$f":"'App.2-K_Employee Costs'!X$22","v":0}]
[{"$f":"'LDC Info'!$E$14","v":0},0,2021,2020,2014,"Non-Management (union and non-union)","Total Benefits (Current + Accrued)",{"$f":"'App.2-K_Employee Costs'!X$12","v":"2019 Actuals"},{"$f":"'App.2-K_Employee Costs'!X$23","v":0}]
[{"$f":"'LDC Info'!$E$14","v":0},0,2021,2020,2014,"Management (including executive)","Total Compensation (Salary, Wages, & Benefits)",{"$f":"'App.2-K_Employee Costs'!X$12","v":"2019 Actuals"},{"$f":"'App.2-K_Employee Costs'!X$26","v":0}]
[{"$f":"'LDC Info'!$E$14","v":0},0,2021,2020,2014,"Non-Management (union and non-union)","Total Compensation (Salary, Wages, & Benefits)",{"$f":"'App.2-K_Employee Costs'!X$12","v":"2019 Actuals"},{"$f":"'App.2-K_Employee Costs'!X$27","v":0}]
[{"$f":"'LDC Info'!$E$14","v":0},0,2021,2020,2014,"Management (including executive)","Number of Employees (FTEs including Part-Time)",{"$f":"'App.2-K_Employee Costs'!Y$12","v":"2020 Bridge Year"},{"$f":"'App.2-K_Employee Costs'!Y$14","v":0}]
[{"$f":"'LDC Info'!$E$14","v":0},0,2021,2020,2014,"Non-Management (union and non-union)","Number of Employees (FTEs including Part-Time)",{"$f":"'App.2-K_Employee Costs'!Y$12","v":"2020 Bridge Year"},{"$f":"'App.2-K_Employee Costs'!Y$15","v":0}]
[{"$f":"'LDC Info'!$E$14","v":0},0,2021,2020,2014,"Management (including executive)","Total Salary and Wages including ovetime and incentive pay",{"$f":"'App.2-K_Employee Costs'!Y$12","v":"2020 Bridge Year"},{"$f":"'App.2-K_Employee Costs'!Y$18","v":0}]
[{"$f":"'LDC Info'!$E$14","v":0},0,2021,2020,2014,"Non-Management (union and non-union)","Total Salary and Wages including ovetime and incentive pay",{"$f":"'App.2-K_Employee Costs'!Y$12","v":"2020 Bridge Year"},{"$f":"'App.2-K_Employee Costs'!Y$19","v":0}]
[{"$f":"'LDC Info'!$E$14","v":0},0,2021,2020,2014,"Management (including executive)","Total Benefits (Current + Accrued)",{"$f":"'App.2-K_Employee Costs'!Y$12","v":"2020 Bridge Year"},{"$f":"'App.2-K_Employee Costs'!Y$22","v":0}]
[{"$f":"'LDC Info'!$E$14","v":0},0,2021,2020,2014,"Non-Management (union and non-union)","Total Benefits (Current + Accrued)",{"$f":"'App.2-K_Employee Costs'!Y$12","v":"2020 Bridge Year"},{"$f":"'App.2-K_Employee Costs'!Y$23","v":0}]
[{"$f":"'LDC Info'!$E$14","v":0},0,2021,2020,2014,"Management (including executive)","Total Compensation (Salary, Wages, & Benefits)",{"$f":"'App.2-K_Employee Costs'!Y$12","v":"2020 Bridge Year"},{"$f":"'App.2-K_Employee Costs'!Y$26","v":0}]
[{"$f":"'LDC Info'!$E$14","v":0},0,2021,2020,2014,"Non-Management (union and non-union)","Total Compensation (Salary, Wages, & Benefits)",{"$f":"'App.2-K_Employee Costs'!Y$12","v":"2020 Bridge Year"},{"$f":"'App.2-K_Employee Costs'!Y$27","v":0}]
[{"$f":"'LDC Info'!$E$14","v":0},{"$f":"EBNUMBER","v":0},{"$f":"TestYear","v":2021},{"$f":"BridgeYear","v":2020},{"$f":"RebaseYear","v":2014},"Management (including executive)","Number of Employees (FTEs including Part-Time)",{"$f":"'App.2-K_Employee Costs'!Z$12","v":"2021 Test Year"},{"$f":"'App.2-K_Employee Costs'!Z$14","v":0}]
[{"$f":"'LDC Info'!$E$14","v":0},0,2021,2020,2014,"Non-Management (union and non-union)","Number of Employees (FTEs including Part-Time)",{"$f":"'App.2-K_Employee Costs'!Z$12","v":"2021 Test Year"},{"$f":"'App.2-K_Employee Costs'!Z$15","v":0}]
[{"$f":"'LDC Info'!$E$14","v":0},0,2021,2020,2014,"Management (including executive)","Total Salary and Wages including ovetime and incentive pay",{"$f":"'App.2-K_Employee Costs'!Z$12","v":"2021 Test Year"},{"$f":"'App.2-K_Employee Costs'!Z$18","v":0}]
[{"$f":"'LDC Info'!$E$14","v":0},0,2021,2020,2014,"Non-Management (union and non-union)","Total Salary and Wages including ovetime and incentive pay",{"$f":"'App.2-K_Employee Costs'!Z$12","v":"2021 Test Year"},{"$f":"'App.2-K_Employee Costs'!Z$19","v":0}]
[{"$f":"'LDC Info'!$E$14","v":0},0,2021,2020,2014,"Management (including executive)","Total Benefits (Current + Accrued)",{"$f":"'App.2-K_Employee Costs'!Z$12","v":"2021 Test Year"},{"$f":"'App.2-K_Employee Costs'!Z$22","v":0}]
[{"$f":"'LDC Info'!$E$14","v":0},0,2021,2020,2014,"Non-Management (union and non-union)","Total Benefits (Current + Accrued)",{"$f":"'App.2-K_Employee Costs'!Z$12","v":"2021 Test Year"},{"$f":"'App.2-K_Employee Costs'!Z$23","v":0}]
[{"$f":"'LDC Info'!$E$14","v":0},0,2021,2020,2014,"Management (including executive)","Total Compensation (Salary, Wages, & Benefits)",{"$f":"'App.2-K_Employee Costs'!Z$12","v":"2021 Test Year"},{"$f":"'App.2-K_Employee Costs'!Z$26","v":0}]
[{"$f":"'LDC Info'!$E$14","v":0},0,2021,2020,2014,"Non-Management (union and non-union)","Total Compensation (Salary, Wages, & Benefits)",{"$f":"'App.2-K_Employee Costs'!Z$12","v":"2021 Test Year"},{"$f":"'App.2-K_Employee Costs'!Z$27","v":0}]

{"sheet":"App.2-L_OM&A_per_Cust_FTE","index":36,"n_rows":38,"n_cols":14,"rows_kept":38,"cut":false,"hidden":false,"merged":[[37,2,37,13],[34,2,34,13],[35,2,35,13],[36,2,36,13],[32,2,33,13],[22,1,22,2],[25,1,25,2],[26,1,26,2],[16,1,16,2],[17,1,17,2],[18,1,18,2],[19,1,19,2],[20,1,20,2],[21,1,21,2],[13,1,13,2],[14,1,14,2],[15,1,15,2],[8,1,8,13],[9,1,9,13]]}
[null,null,null,null,null,null,null,null,null,null,null,null,"File Number:",{"$f":"EBNUMBER","v":0}]
[null,null,null,null,null,null,null,null,null,null,null,null,"Exhibit:"]
[null,null,null,null,null,null,null,null,null,null,null,null,"Tab:"]
[null,null,null,null,null,null,null,null,null,null,null,null,"Schedule:"]
[null,null,null,null,null,null,null,null,null,null,null,null,"Page:"]
[]
[null,null,null,null,null,null,null,null,null,null,null,null,"Date:"]
[]
[null,"Appendix 2-L"]
[null,"Recoverable OM&A Cost per Customer and per FTE 1"]
[]
[]
[null,null,null,{"$f":"\"Last Rebasing Year \"&RebaseYear&\" - OEB Approved\"","v":"Last Rebasing Year 2014 - OEB Approved"},{"$f":"\"Last Rebasing Year \"&RebaseYear&\" -  Actual\"","v":"Last Rebasing Year 2014 -  Actual"},{"$f":"BridgeYear -7 & \" Actuals\"","v":"2013 Actuals"},{"$f":"BridgeYear -6 & \" Actuals\"","v":"2014 Actuals"},{"$f":"BridgeYear -5 & \" Actuals\"","v":"2015 Actuals"},{"$f":"BridgeYear -4 & \" Actuals\"","v":"2016 Actuals"},{"$f":"BridgeYear -3 & \" Actuals\"","v":"2017 Actuals"},{"$f":"BridgeYear -2 & \" Actuals\"","v":"2018 Actuals"},{"$f":"BridgeYear -1 & \" Actuals\"","v":"2019 Actuals"},{"$f":"BridgeYear & \" Bridge Year\"","v":"2020 Bridge Year"},{"$f":"TestYear & \" Test Year\"","v":"2021 Test Year"}]
[null,"Reporting Basis"]
[null,"OM&A Costs"]
[null,"     O&M",null,1500236.4863350596,1463792.3199999998,null,null,null,null,1602025.23,1687455.7199999997,1665918.9899999998,1762869.7429201035,1805752.6329856422]
[null,"     Admin Expenses",null,655025.86807409697,744410.69,null,null,null,null,721093.65999999992,844735.11,929201.6399999999,1141995.0965386515,865614.53562187287]
[null,"Total Recoverable OM&A from Appendix 2-JB 5",null,{"$f":"SUM(D16:D17)","v":2155262.3544091564},{"$f":"SUM(E16:E17)","v":2208203.0099999998},0,0,0,0,2323118.8899999997,2532190.8299999996,2595120.63,2904864.8394587552,2671367.1686075153]
[null,"Number of Customers 2,4",null,8522,8574.0416666666661,null,null,null,null,8859.9583333333339,9133.7083333333339,9321.25,9470.5492188784738,9653.0416666666661]
[null,"Number of FTEs 3,4",null,19.100000000000001,16.027598566308242,null,null,null,null,17.447580645161288,17.481003584229391,17.598476702508961,18.083333333333332,18]
[null,"Customers/FTEs",null,{"$f":"IF(D20=0,\"\",D19/D20)","v":446.17801047120417},{"$f":"IF(E20=0,\"\",E19/E20)","v":534.95485497685445},"","","","",507.80440644018188,522.49336196998274,529.66232007291273,523.71700749558386,536.28009259259261]
[null,"OM&A cost per customer"]
[null,"     O&M per customer",null,{"$f":"IF(D19=0,\"\",D16/D19)","v":176.04277004635762},{"$f":"IF(E19=0,\"\",E16/E19)","v":170.72372364258396},"","","","",180.81633905351322,184.75033999516438,{"$f":"IF(L19=0,\"\",L16/L19)","v":178.72270242724954},186.14229250886751,187.06566234155648]
[null,"     Admin per customer",null,{"$f":"IF(D19=0,\"\",D17/D19)","v":76.862927490506564},{"$f":"IF(E19=0,\"\",E17/E19)","v":86.821445351035351},"","","","",81.387929025249349,92.485448316446849,{"$f":"IF(L19=0,\"\",L17/L19)","v":99.686376827142269},120.58382994960976,89.672723428819722]
[null,"     Total OM&A per customer",null,{"$f":"IF(D19=0,\"\",D18/D19)","v":252.90569753686415},{"$f":"IF(E19=0,\"\",E18/E19)","v":257.54516899361931},"","","","",262.20426807876254,277.23578831161126,{"$f":"IF(L19=0,\"\",L18/L19)","v":278.40907925439183},306.72612245847728,276.73838577037623]
[null,"OM&A cost per FTE"]
[null,"     O&M per FTE",null,{"$f":"IF(D20=0,\"\",D16/D20)","v":78546.412897123533},{"$f":"IF(E20=0,\"\",E16/E20)","v":91329.484822327082},"","","","",91819.333727755962,96530.826269170822,94662.68121731779,97485.884401111718,{"$f":"IF(N20=0,\"\",N16/N20)","v":100319.59072142457}]
[null,"     Admin per FTE",null,{"$f":"IF(D20=0,\"\",D17/D20)","v":34294.548066706644},{"$f":"IF(E20=0,\"\",E17/E20)","v":46445.553706644008},"","","","",41329.1489900624,48323.032824161404,52800.117629926826,63151.802573565983,{"$f":"IF(N20=0,\"\",N17/N20)","v":48089.696423437381}]
[null,"     Total OM&A per FTE",null,{"$f":"IF(D20=0,\"\",D18/D20)","v":112840.96096383016},{"$f":"IF(E20=0,\"\",E18/E20)","v":137775.03852897108},"","","","",133148.48271781835,144853.8590933322,147462.79884724462,160637.68697467772,{"$f":"IF(N20=0,\"\",N18/N20)","v":148409.28714486197}]
[]
[null,"Notes:"]
[]
[null,1,"If it has been more than four years since the applicant last filed a cost of service application, additional years of historical actuals should be incorporated into the table, as necessary, to go back to the last cost of service application. If the applicant last filed a cost of service application less than four years ago, a minimum of three years of actual information is required."]
[]
[null,2,"The method of calculating the number of customers must be identified. Should correspond with data provided in Appendix 2-IB."]
[null,3,"The method of calculating the number of FTEs must be identified. See also Appendix 2-K."]
[null,4,"The number of customers and the number of FTEs should correspond to mid-year or average of January 1 and December 31 figures."]
[null,5,"For the test year, the applicant should take into account the system O&M (line 22 of Appendix 2-AB) in developing its forecasted OM&A."]

{"sheet":"App.2-L_OM&A_per_Cust_FTEE_exp","index":37,"n_rows":38,"n_cols":12,"rows_kept":38,"cut":false,"hidden":true,"merged":[[8,0,8,11],[9,0,9,11],[34,1,34,6],[35,1,35,6],[21,0,21,1],[22,0,22,1],[25,0,25,1],[14,0,14,1],[13,0,13,1],[11,7,11,11],[15,0,15,1],[16,0,16,1],[17,0,17,1],[37,1,38,11],[36,1,36,11],[32,1,33,11],[19,0,19,1],[18,0,18,1],[20,0,20,1],[26,0,26,1]]}
[null,null,null,null,null,null,null,null,null,null,"File Number:",{"$f":"EBNUMBER","v":0}]
[null,null,null,null,null,null,null,null,null,null,"Exhibit:"]
[null,null,null,null,null,null,null,null,null,null,"Tab:"]
[null,null,null,null,null,null,null,null,null,null,"Schedule:"]
[null,null,null,null,null,null,null,null,null,null,"Page:"]
[]
[null,null,null,null,null,null,null,null,null,null,"Date:"]
[]
["Appendix 2-L"]
["Recoverable OM&A Cost per Customer and per FTE 1"]
[]
[null,null,null,null,null,null,null,"5-year Distribution System Plan Period"]
[null,null,{"$f":"\"Last Rebasing Year - \"&RebaseYear&\"- Board Approved\"","v":"Last Rebasing Year - 2014- Board Approved"},{"$f":"\"Last Rebasing Year - \"&RebaseYear&\"-  Actual\"","v":"Last Rebasing Year - 2014-  Actual"},{"$f":"BridgeYear -2 & \" Actuals\"","v":"2018 Actuals"},{"$f":"BridgeYear -1 & \" Actuals\"","v":"2019 Actuals"},{"$f":"BridgeYear & \" Bridge Year\"","v":"2020 Bridge Year"},{"$f":"TestYear & \" Test Year\"","v":"2021 Test Year"},{"$f":"TestYear+1 & \" Year\"","v":"2022 Year"},{"$f":"TestYear+2 & \" Year\"","v":"2023 Year"},{"$f":"TestYear+3 & \" Year\"","v":"2024 Year"},{"$f":"TestYear+4 & \" Year\"","v":"2025 Year"}]
["Reporting Basis"]
["OM&A Costs"]
["     O&M"]
["     Admin Expenses"]
["Total Recoverable OM&A from Appendix 2-JB 5",null,{"$f":"SUM(C16:C17)","v":0},{"$f":"SUM(D16:D17)","v":0},0,0,0,0,0,0,0,0]
["Number of Customers 2,4"]
["Number of FTEs 3,4"]
["Customers/FTEs",null,{"$f":"IF(C20=0,\"\",C19/C20)","v":""},{"$f":"IF(D20=0,\"\",D19/D20)","v":""},"","","","","","","",""]
["OM&A cost per customer"]
["     O&M per customer",null,{"$f":"IF(C19=0,\"\",C16/C19)","v":""},{"$f":"IF(D19=0,\"\",D16/D19)","v":""},"","","","","","","",""]
["     Admin per customer",null,{"$f":"IF(C19=0,\"\",C17/C19)","v":""},{"$f":"IF(D19=0,\"\",D17/D19)","v":""},"","","","","","","",""]
["     Total OM&A per customer",null,{"$f":"IF(C19=0,\"\",C18/C19)","v":""},{"$f":"IF(D19=0,\"\",D18/D19)","v":""},"","","","","","","",""]
["OM&A cost per FTE"]
["     O&M per FTE",null,{"$f":"IF(C20=0,\"\",C16/C20)","v":""},{"$f":"IF(D20=0,\"\",D16/D20)","v":""},"","","","","","","",""]
["     Admin per FTE",null,{"$f":"IF(C20=0,\"\",C17/C20)","v":""},{"$f":"IF(D20=0,\"\",D17/D20)","v":""},"","","","","","","",""]
["     Total OM&A per FTE",null,{"$f":"IF(C20=0,\"\",C18/C20)","v":""},{"$f":"IF(D20=0,\"\",D18/D20)","v":""},"","","","","","","",""]
[]
["Notes:"]
[]
[1,"If it has been more than three years since the applicant last filed a cost of service application, additional years of historical actuals should be incorporated into the table, as necessary, to go back to the last cost of service application.  If the applicant last filed a cost of service application less than three years ago, a minimum of three years of actual information is required."]
[]
[2,"The method of calculating the number of customers must be identified. Should be linked back to Appendix 2-IA"]
[3,"The method of calculating the number of FTEs must be identified.  See also Appendix 2-K"]
[4,"The number of customers and the number of FTEs should correspond to mid-year or average of January 1 and December 31 figures."]
[5,"For the test year and in the subsequent four years of the DSP period, the applicant should take into account the system O&M (line X of Appendix 2-AB) in developing its forecasted OM&A. Admin expenses beyond the test year also need to be forecasted (separately)."]

{"sheet":"App.2-M_Regulatory_Costs","index":38,"n_rows":96,"n_cols":11,"rows_kept":96,"cut":false,"hidden":false,"merged":[[45,0,45,1],[12,0,12,1],[13,0,13,1],[8,0,8,10],[9,0,9,10],[14,0,14,1]]}
[null,null,null,null,null,null,null,null,null,"File Number:",{"$f":"EBNUMBER","v":0}]
[null,null,null,null,null,null,null,null,null,"Exhibit:"]
[null,null,null,null,null,null,null,null,null,"Tab:"]
["TO BE UPDATED AT THE DRAFT RATE ORDER STAGE",null,null,null,null,null,null,null,null,"Schedule:"]
[null,null,null,null,null,null,null,null,null,"Page:"]
[]
[null,null,null,null,null,null,null,null,null,"Date:"]
[]
["Appendix 2-M"]
["Regulatory Cost Schedule"]
[]
[]
["Regulatory Cost Category",null,"USoA Account","USoA Account Balance",{"$f":"\"Last Rebasing Year (\" & RebaseYear & \" OEB Approved)\"","v":"Last Rebasing Year (2014 OEB Approved)"},{"$f":"\"Last Rebasing Year (\" & RebaseYear & \" Actual)\"","v":"Last Rebasing Year (2014 Actual)"},{"$f":"\"Most Current Actuals Year \" & TestYear - 2","v":"Most Current Actuals Year 2019"},{"$f":"TestYear -1 & \" Bridge Year\"","v":"2020 Bridge Year"},"Annual % Change",{"$f":"TestYear & \" Test Year\"","v":"2021 Test Year"},"Annual % Change"]
["(A)",null,"(B)","(C )","(D)","(E)","(F)","(G)","(H)=[(G)-(F)]/(F)","(I)","(J) = [(I)-(G)]/(G)"]
["Regulatory Costs (Ongoing)"]
[1,"OEB Annual Assessment",null,null,null,null,null,null,{"$f":"IF(G16=0,\"\",(H16-G16)/G16)","v":""},null,{"$f":"IF(H16=0,\"\",(J16-H16)/H16)","v":""}]
[2,"OEB Section 30 Costs (OEB-initiated)",null,null,null,null,null,null,{"$f":"IF(G17=0,\"\",(H17-G17)/G17)","v":""},null,{"$f":"IF(H17=0,\"\",(J17-H17)/H17)","v":""}]
[3,"Expert Witness costs for regulatory matters",null,null,null,null,null,null,"",null,""]
[4,"Legal costs for regulatory matters",null,null,null,null,null,null,"",null,""]
[5,"Consultants' costs for regulatory matters",null,null,null,null,null,null,"",null,""]
[6,"Operating expenses associated with staff resources allocated to regulatory matters",null,null,null,null,null,null,"",null,""]
[7,"Operating expenses associated with other resources allocated to regulatory matters 1",null,null,null,null,null,null,"",null,""]
[8,"Other regulatory agency fees or assessments",null,null,null,null,null,null,"",null,""]
[9,"Any other costs for regulatory matters (please define)",null,null,null,null,null,null,"",null,""]
[10,"Intervenor costs",null,null,null,null,null,null,"",null,""]
[11,"Include other items in green cells, as applicable",null,null,null,null,null,null,"",null,""]
[12,null,null,null,null,null,null,null,"",null,""]
[13,null,null,null,null,null,null,null,"",null,""]
[14,null,null,null,null,null,null,null,"",null,""]
[15,null,null,null,null,null,null,null,"",null,""]
[16,null,null,null,null,null,null,null,"",null,""]
[17,null,null,null,null,null,null,null,"",null,""]
[18,null,null,null,null,null,null,null,"",null,""]
[19,null,null,null,null,null,null,null,"",null,""]
[20,null,null,null,null,null,null,null,"",null,""]
[21,null,null,null,null,null,null,null,"",null,""]
[22,null,null,null,null,null,null,null,"",null,""]
[23,null,null,null,null,null,null,null,"",null,""]
[24,null,null,null,null,null,null,null,"",null,""]
[25,null,null,null,null,null,null,null,"",null,""]
[26,null,null,null,null,null,null,null,"",null,""]
[27,null,null,null,null,null,null,null,"",null,""]
[28,null,null,null,null,null,null,null,"",null,""]
[29,null,null,null,null,null,null,null,"",null,""]
[30,null,null,null,null,null,null,null,"",null,""]
["Regulatory Costs (One-Time)"]
[1,"Expert Witness costs",null,null,null,null,null,null,{"$f":"IF(G47=0,\"\",(H47-G47)/G47)","v":""},null,{"$f":"IF(H47=0,\"\",(J47-H47)/H47)","v":""}]
[2,"Legal costs",null,null,null,null,null,null,"",null,""]
[3,"Consultants' costs",null,null,null,null,null,null,"",null,""]
[4,"Incremental operating expenses associated with staff resources allocated to this application.",null,null,null,null,null,null,"",null,""]
[5,"Incremental operating expenses associated with other resources allocated to this application. 1",null,null,null,null,null,null,"",null,""]
[6,"Intervenor costs",null,null,null,null,null,null,"",null,""]
[7,"OEB Section 30 Costs (application-related)",null,null,null,null,null,null,"",null,""]
[8,"Include other items in green cells, as applicable",null,null,null,null,null,null,"",null,""]
[9,null,null,null,null,null,null,null,"",null,""]
[10,null,null,null,null,null,null,null,"",null,""]
[11,null,null,null,null,null,null,null,"",null,""]
[12,null,null,null,null,null,null,null,"",null,""]
[13,null,null,null,null,null,null,null,"",null,""]
[14,null,null,null,null,null,null,null,"",null,""]
[15,null,null,null,null,null,null,null,"",null,""]
[16,null,null,null,null,null,null,null,"",null,""]
[17,null,null,null,null,null,null,null,"",null,""]
[18,null,null,null,null,null,null,null,"",null,""]
[19,null,null,null,null,null,null,null,"",null,""]
[20,null,null,null,null,null,null,null,"",null,""]
[21,null,null,null,null,null,null,null,"",null,""]
[22,null,null,null,null,null,null,null,"",null,""]
[23,null,null,null,null,null,null,null,"",null,""]
[24,null,null,null,null,null,null,null,"",null,""]
[25,null,null,null,null,null,null,null,"",null,""]
[26,null,null,null,null,null,null,null,"",null,""]
[27,null,null,null,null,null,null,null,"",null,""]
[28,null,null,null,null,null,null,null,"",null,""]
[29,null,null,null,null,null,null,null,"",null,""]
[30,null,null,null,null,null,null,null,{"$f":"IF(G76=0,\"\",(H76-G76)/G76)","v":""},null,""]
[1,"Sub-total - Ongoing Costs 2",null,{"$f":"SUM(D16:D45)","v":0},{"$f":"SUM(E16:E45)","v":0},{"$f":"SUM(F16:F45)","v":0},{"$f":"SUM(G16:G45)","v":0},{"$f":"SUM(H16:H45)","v":0},{"$f":"IF(G77=0,\"\",(H77-G77)/G77)","v":""},{"$f":"SUM(J16:J45)","v":0},""]
[2,"Sub-total - One-time Costs 3",null,{"$f":"SUM(D47:D76)","v":0},{"$f":"SUM(E47:E76)","v":0},{"$f":"SUM(F47:F76)","v":0},{"$f":"SUM(G47:G76)","v":0},{"$f":"SUM(H47:H76)","v":0},{"$f":"IF(G78=0,\"\",(H78-G78)/G78)","v":""},{"$f":"SUM(J47:J76)","v":0},""]
[3,"Total",null,{"$f":"D77+D78","v":0},{"$f":"E77+E78","v":0},0,0,0,"",{"$f":"J77+C83","v":0},""]
[]
[null,"Application-Related One-Time Costs","Total"]
[null,"Total One-Time Costs Related to Application to be Amortized over IRM Period",{"$f":"J78","v":0}]
[null,"1/5 of Total One-Time Costs",{"$f":"C82/5","v":0}]
[]
[]
[]
[]
[]
[]
[]
[]
["Notes:"]
[]
["1","Please identify the resources involved."]
["2","Sum of all ongoing costs."]
["3","Sum of all one-time costs related to this application."]

{"sheet":"Hidden_RegulatoryCosts1","index":39,"n_rows":65,"n_cols":16,"rows_kept":65,"cut":false,"hidden":true,"merged":[]}
["Utility Name","EB Number","Test Year","Bridge Year","Last Rebasing Year","Regulatory Cost Category","Type of Cost","USoA","USoA Account Balance",{"$f":"'App.2-M_Regulatory_Costs'!E13","v":"Last Rebasing Year (2014 OEB Approved)"},{"$f":"'App.2-M_Regulatory_Costs'!F13","v":"Last Rebasing Year (2014 Actual)"},{"$f":"'App.2-M_Regulatory_Costs'!G13","v":"Most Current Actuals Year 2019"},{"$f":"'App.2-M_Regulatory_Costs'!H13","v":"2020 Bridge Year"},{"$f":"'App.2-M_Regulatory_Costs'!I13","v":"Annual % Change"},{"$f":"'App.2-M_Regulatory_Costs'!J13","v":"2021 Test Year"},{"$f":"'App.2-M_Regulatory_Costs'!K13","v":"Annual % Change"}]
[{"$f":"'LDC Info'!$E$14","v":0},{"$f":"EBNUMBER","v":0},{"$f":"TestYear","v":2021},{"$f":"BridgeYear","v":2020},{"$f":"RebaseYear","v":2014},{"$f":"'App.2-M_Regulatory_Costs'!B16","v":"OEB Annual Assessment"},"Ongoing",{"$f":"INDIRECT(\"'App.2-M_Regulatory_Costs'!C\" & MATCH(F2,'App.2-M_Regulatory_Costs'!$B:$B,0))","v":0},{"$f":"INDIRECT(\"'App.2-M_Regulatory_Costs'!D\" & MATCH($F2,'App.2-M_Regulatory_Costs'!$B:$B,0))","v":0},{"$f":"INDIRECT(\"'App.2-M_Regulatory_Costs'!E\" & MATCH($F2,'App.2-M_Regulatory_Costs'!$B:$B,0))","v":0},{"$f":"INDIRECT(\"'App.2-M_Regulatory_Costs'!F\" & MATCH($F2,'App.2-M_Regulatory_Costs'!$B:$B,0))","v":0},{"$f":"INDIRECT(\"'App.2-M_Regulatory_Costs'!G\" & MATCH($F2,'App.2-M_Regulatory_Costs'!$B:$B,0))","v":0},{"$f":"INDIRECT(\"'App.2-M_Regulatory_Costs'!H\" & MATCH($F2,'App.2-M_Regulatory_Costs'!$B:$B,0))","v":0},{"$f":"INDIRECT(\"'App.2-M_Regulatory_Costs'!I\" & MATCH($F2,'App.2-M_Regulatory_Costs'!$B:$B,0))","v":""},{"$f":"INDIRECT(\"'App.2-M_Regulatory_Costs'!J\" & MATCH($F2,'App.2-M_Regulatory_Costs'!$B:$B,0))","v":0},{"$f":"INDIRECT(\"'App.2-M_Regulatory_Costs'!K\" & MATCH($F2,'App.2-M_Regulatory_Costs'!$B:$B,0))","v":""}]
[{"$f":"'LDC Info'!$E$14","v":0},0,2021,2020,2014,{"$f":"'App.2-M_Regulatory_Costs'!B17","v":"OEB Section 30 Costs (OEB-initiated)"},"Ongoing",{"$f":"INDIRECT(\"'App.2-M_Regulatory_Costs'!C\" & MATCH(F3,'App.2-M_Regulatory_Costs'!$B:$B,0))","v":0},{"$f":"INDIRECT(\"'App.2-M_Regulatory_Costs'!D\" & MATCH($F3,'App.2-M_Regulatory_Costs'!$B:$B,0))","v":0},{"$f":"INDIRECT(\"'App.2-M_Regulatory_Costs'!E\" & MATCH($F3,'App.2-M_Regulatory_Costs'!$B:$B,0))","v":0},{"$f":"INDIRECT(\"'App.2-M_Regulatory_Costs'!F\" & MATCH($F3,'App.2-M_Regulatory_Costs'!$B:$B,0))","v":0},{"$f":"INDIRECT(\"'App.2-M_Regulatory_Costs'!G\" & MATCH($F3,'App.2-M_Regulatory_Costs'!$B:$B,0))","v":0},{"$f":"INDIRECT(\"'App.2-M_Regulatory_Costs'!H\" & MATCH($F3,'App.2-M_Regulatory_Costs'!$B:$B,0))","v":0},{"$f":"INDIRECT(\"'App.2-M_Regulatory_Costs'!I\" & MATCH($F3,'App.2-M_Regulatory_Costs'!$B:$B,0))","v":""},{"$f":"INDIRECT(\"'App.2-M_Regulatory_Costs'!J\" & MATCH($F3,'App.2-M_Regulatory_Costs'!$B:$B,0))","v":0},{"$f":"INDIRECT(\"'App.2-M_Regulatory_Costs'!K\" & MATCH($F3,'App.2-M_Regulatory_Costs'!$B:$B,0))","v":""}]
[{"$f":"'LDC Info'!$E$14","v":0},0,2021,2020,2014,{"$f":"'App.2-M_Regulatory_Costs'!B18","v":"Expert Witness costs for regulatory matters"},"Ongoing",{"$f":"INDIRECT(\"'App.2-M_Regulatory_Costs'!C\" & MATCH(F4,'App.2-M_Regulatory_Costs'!$B:$B,0))","v":0},{"$f":"INDIRECT(\"'App.2-M_Regulatory_Costs'!D\" & MATCH($F4,'App.2-M_Regulatory_Costs'!$B:$B,0))","v":0},{"$f":"INDIRECT(\"'App.2-M_Regulatory_Costs'!E\" & MATCH($F4,'App.2-M_Regulatory_Costs'!$B:$B,0))","v":0},{"$f":"INDIRECT(\"'App.2-M_Regulatory_Costs'!F\" & MATCH($F4,'App.2-M_Regulatory_Costs'!$B:$B,0))","v":0},{"$f":"INDIRECT(\"'App.2-M_Regulatory_Costs'!G\" & MATCH($F4,'App.2-M_Regulatory_Costs'!$B:$B,0))","v":0},{"$f":"INDIRECT(\"'App.2-M_Regulatory_Costs'!H\" & MATCH($F4,'App.2-M_Regulatory_Costs'!$B:$B,0))","v":0},{"$f":"INDIRECT(\"'App.2-M_Regulatory_Costs'!I\" & MATCH($F4,'App.2-M_Regulatory_Costs'!$B:$B,0))","v":""},{"$f":"INDIRECT(\"'App.2-M_Regulatory_Costs'!J\" & MATCH($F4,'App.2-M_Regulatory_Costs'!$B:$B,0))","v":0},{"$f":"INDIRECT(\"'App.2-M_Regulatory_Costs'!K\" & MATCH($F4,'App.2-M_Regulatory_Costs'!$B:$B,0))","v":""}]
[{"$f":"'LDC Info'!$E$14","v":0},0,2021,2020,2014,{"$f":"'App.2-M_Regulatory_Costs'!B19","v":"Legal costs for regulatory matters"},"Ongoing",{"$f":"INDIRECT(\"'App.2-M_Regulatory_Costs'!C\" & MATCH(F5,'App.2-M_Regulatory_Costs'!$B:$B,0))","v":0},{"$f":"INDIRECT(\"'App.2-M_Regulatory_Costs'!D\" & MATCH($F5,'App.2-M_Regulatory_Costs'!$B:$B,0))","v":0},{"$f":"INDIRECT(\"'App.2-M_Regulatory_Costs'!E\" & MATCH($F5,'App.2-M_Regulatory_Costs'!$B:$B,0))","v":0},{"$f":"INDIRECT(\"'App.2-M_Regulatory_Costs'!F\" & MATCH($F5,'App.2-M_Regulatory_Costs'!$B:$B,0))","v":0},{"$f":"INDIRECT(\"'App.2-M_Regulatory_Costs'!G\" & MATCH($F5,'App.2-M_Regulatory_Costs'!$B:$B,0))","v":0},{"$f":"INDIRECT(\"'App.2-M_Regulatory_Costs'!H\" & MATCH($F5,'App.2-M_Regulatory_Costs'!$B:$B,0))","v":0},{"$f":"INDIRECT(\"'App.2-M_Regulatory_Costs'!I\" & MATCH($F5,'App.2-M_Regulatory_Costs'!$B:$B,0))","v":""},{"$f":"INDIRECT(\"'App.2-M_Regulatory_Costs'!J\" & MATCH($F5,'App.2-M_Regulatory_Costs'!$B:$B,0))","v":0},{"$f":"INDIRECT(\"'App.2-M_Regulatory_Costs'!K\" & MATCH($F5,'App.2-M_Regulatory_Costs'!$B:$B,0))","v":""}]
[{"$f":"'LDC Info'!$E$14","v":0},0,2021,2020,2014,{"$f":"'App.2-M_Regulatory_Costs'!B20","v":"Consultants' costs for regulatory matters"},"Ongoing",{"$f":"INDIRECT(\"'App.2-M_Regulatory_Costs'!C\" & MATCH(F6,'App.2-M_Regulatory_Costs'!$B:$B,0))","v":0},{"$f":"INDIRECT(\"'App.2-M_Regulatory_Costs'!D\" & MATCH($F6,'App.2-M_Regulatory_Costs'!$B:$B,0))","v":0},{"$f":"INDIRECT(\"'App.2-M_Regulatory_Costs'!E\" & MATCH($F6,'App.2-M_Regulatory_Costs'!$B:$B,0))","v":0},{"$f":"INDIRECT(\"'App.2-M_Regulatory_Costs'!F\" & MATCH($F6,'App.2-M_Regulatory_Costs'!$B:$B,0))","v":0},{"$f":"INDIRECT(\"'App.2-M_Regulatory_Costs'!G\" & MATCH($F6,'App.2-M_Regulatory_Costs'!$B:$B,0))","v":0},{"$f":"INDIRECT(\"'App.2-M_Regulatory_Costs'!H\" & MATCH($F6,'App.2-M_Regulatory_Costs'!$B:$B,0))","v":0},{"$f":"INDIRECT(\"'App.2-M_Regulatory_Costs'!I\" & MATCH($F6,'App.2-M_Regulatory_Costs'!$B:$B,0))","v":""},{"$f":"INDIRECT(\"'App.2-M_Regulatory_Costs'!J\" & MATCH($F6,'App.2-M_Regulatory_Costs'!$B:$B,0))","v":0},{"$f":"INDIRECT(\"'App.2-M_Regulatory_Costs'!K\" & MATCH($F6,'App.2-M_Regulatory_Costs'!$B:$B,0))","v":""}]
[{"$f":"'LDC Info'!$E$14","v":0},0,2021,2020,2014,{"$f":"'App.2-M_Regulatory_Costs'!B21","v":"Operating expenses associated with staff resources allocated to regulatory matters"},"Ongoing",{"$f":"INDIRECT(\"'App.2-M_Regulatory_Costs'!C\" & MATCH(F7,'App.2-M_Regulatory_Costs'!$B:$B,0))","v":0},{"$f":"INDIRECT(\"'App.2-M_Regulatory_Costs'!D\" & MATCH($F7,'App.2-M_Regulatory_Costs'!$B:$B,0))","v":0},{"$f":"INDIRECT(\"'App.2-M_Regulatory_Costs'!E\" & MATCH($F7,'App.2-M_Regulatory_Costs'!$B:$B,0))","v":0},{"$f":"INDIRECT(\"'App.2-M_Regulatory_Costs'!F\" & MATCH($F7,'App.2-M_Regulatory_Costs'!$B:$B,0))","v":0},{"$f":"INDIRECT(\"'App.2-M_Regulatory_Costs'!G\" & MATCH($F7,'App.2-M_Regulatory_Costs'!$B:$B,0))","v":0},{"$f":"INDIRECT(\"'App.2-M_Regulatory_Costs'!H\" & MATCH($F7,'App.2-M_Regulatory_Costs'!$B:$B,0))","v":0},{"$f":"INDIRECT(\"'App.2-M_Regulatory_Costs'!I\" & MATCH($F7,'App.2-M_Regulatory_Costs'!$B:$B,0))","v":""},{"$f":"INDIRECT(\"'App.2-M_Regulatory_Costs'!J\" & MATCH($F7,'App.2-M_Regulatory_Costs'!$B:$B,0))","v":0},{"$f":"INDIRECT(\"'App.2-M_Regulatory_Costs'!K\" & MATCH($F7,'App.2-M_Regulatory_Costs'!$B:$B,0))","v":""}]
[{"$f":"'LDC Info'!$E$14","v":0},0,2021,2020,2014,{"$f":"'App.2-M_Regulatory_Costs'!B22","v":"Operating expenses associated with other resources allocated to regulatory matters 1"},"Ongoing",{"$f":"INDIRECT(\"'App.2-M_Regulatory_Costs'!C\" & MATCH(F8,'App.2-M_Regulatory_Costs'!$B:$B,0))","v":0},{"$f":"INDIRECT(\"'App.2-M_Regulatory_Costs'!D\" & MATCH($F8,'App.2-M_Regulatory_Costs'!$B:$B,0))","v":0},{"$f":"INDIRECT(\"'App.2-M_Regulatory_Costs'!E\" & MATCH($F8,'App.2-M_Regulatory_Costs'!$B:$B,0))","v":0},{"$f":"INDIRECT(\"'App.2-M_Regulatory_Costs'!F\" & MATCH($F8,'App.2-M_Regulatory_Costs'!$B:$B,0))","v":0},{"$f":"INDIRECT(\"'App.2-M_Regulatory_Costs'!G\" & MATCH($F8,'App.2-M_Regulatory_Costs'!$B:$B,0))","v":0},{"$f":"INDIRECT(\"'App.2-M_Regulatory_Costs'!H\" & MATCH($F8,'App.2-M_Regulatory_Costs'!$B:$B,0))","v":0},{"$f":"INDIRECT(\"'App.2-M_Regulatory_Costs'!I\" & MATCH($F8,'App.2-M_Regulatory_Costs'!$B:$B,0))","v":""},{"$f":"INDIRECT(\"'App.2-M_Regulatory_Costs'!J\" & MATCH($F8,'App.2-M_Regulatory_Costs'!$B:$B,0))","v":0},{"$f":"INDIRECT(\"'App.2-M_Regulatory_Costs'!K\" & MATCH($F8,'App.2-M_Regulatory_Costs'!$B:$B,0))","v":""}]
[{"$f":"'LDC Info'!$E$14","v":0},0,2021,2020,2014,{"$f":"'App.2-M_Regulatory_Costs'!B23","v":"Other regulatory agency fees or assessments"},"Ongoing",{"$f":"INDIRECT(\"'App.2-M_Regulatory_Costs'!C\" & MATCH(F9,'App.2-M_Regulatory_Costs'!$B:$B,0))","v":0},{"$f":"INDIRECT(\"'App.2-M_Regulatory_Costs'!D\" & MATCH($F9,'App.2-M_Regulatory_Costs'!$B:$B,0))","v":0},{"$f":"INDIRECT(\"'App.2-M_Regulatory_Costs'!E\" & MATCH($F9,'App.2-M_Regulatory_Costs'!$B:$B,0))","v":0},{"$f":"INDIRECT(\"'App.2-M_Regulatory_Costs'!F\" & MATCH($F9,'App.2-M_Regulatory_Costs'!$B:$B,0))","v":0},{"$f":"INDIRECT(\"'App.2-M_Regulatory_Costs'!G\" & MATCH($F9,'App.2-M_Regulatory_Costs'!$B:$B,0))","v":0},{"$f":"INDIRECT(\"'App.2-M_Regulatory_Costs'!H\" & MATCH($F9,'App.2-M_Regulatory_Costs'!$B:$B,0))","v":0},{"$f":"INDIRECT(\"'App.2-M_Regulatory_Costs'!I\" & MATCH($F9,'App.2-M_Regulatory_Costs'!$B:$B,0))","v":""},{"$f":"INDIRECT(\"'App.2-M_Regulatory_Costs'!J\" & MATCH($F9,'App.2-M_Regulatory_Costs'!$B:$B,0))","v":0},{"$f":"INDIRECT(\"'App.2-M_Regulatory_Costs'!K\" & MATCH($F9,'App.2-M_Regulatory_Costs'!$B:$B,0))","v":""}]
[{"$f":"'LDC Info'!$E$14","v":0},0,2021,2020,2014,{"$f":"'App.2-M_Regulatory_Costs'!B24","v":"Any other costs for regulatory matters (please define)"},"Ongoing",{"$f":"INDIRECT(\"'App.2-M_Regulatory_Costs'!C\" & MATCH(F10,'App.2-M_Regulatory_Costs'!$B:$B,0))","v":0},{"$f":"INDIRECT(\"'App.2-M_Regulatory_Costs'!D\" & MATCH($F10,'App.2-M_Regulatory_Costs'!$B:$B,0))","v":0},{"$f":"INDIRECT(\"'App.2-M_Regulatory_Costs'!E\" & MATCH($F10,'App.2-M_Regulatory_Costs'!$B:$B,0))","v":0},{"$f":"INDIRECT(\"'App.2-M_Regulatory_Costs'!F\" & MATCH($F10,'App.2-M_Regulatory_Costs'!$B:$B,0))","v":0},{"$f":"INDIRECT(\"'App.2-M_Regulatory_Costs'!G\" & MATCH($F10,'App.2-M_Regulatory_Costs'!$B:$B,0))","v":0},{"$f":"INDIRECT(\"'App.2-M_Regulatory_Costs'!H\" & MATCH($F10,'App.2-M_Regulatory_Costs'!$B:$B,0))","v":0},{"$f":"INDIRECT(\"'App.2-M_Regulatory_Costs'!I\" & MATCH($F10,'App.2-M_Regulatory_Costs'!$B:$B,0))","v":""},{"$f":"INDIRECT(\"'App.2-M_Regulatory_Costs'!J\" & MATCH($F10,'App.2-M_Regulatory_Costs'!$B:$B,0))","v":0},{"$f":"INDIRECT(\"'App.2-M_Regulatory_Costs'!K\" & MATCH($F10,'App.2-M_Regulatory_Costs'!$B:$B,0))","v":""}]
[{"$f":"'LDC Info'!$E$14","v":0},0,2021,2020,2014,{"$f":"'App.2-M_Regulatory_Costs'!B25","v":"Intervenor costs"},"Ongoing",{"$f":"INDIRECT(\"'App.2-M_Regulatory_Costs'!C\" & MATCH(F11,'App.2-M_Regulatory_Costs'!$B:$B,0))","v":0},{"$f":"INDIRECT(\"'App.2-M_Regulatory_Costs'!D\" & MATCH($F11,'App.2-M_Regulatory_Costs'!$B:$B,0))","v":0},{"$f":"INDIRECT(\"'App.2-M_Regulatory_Costs'!E\" & MATCH($F11,'App.2-M_Regulatory_Costs'!$B:$B,0))","v":0},{"$f":"INDIRECT(\"'App.2-M_Regulatory_Costs'!F\" & MATCH($F11,'App.2-M_Regulatory_Costs'!$B:$B,0))","v":0},{"$f":"INDIRECT(\"'App.2-M_Regulatory_Costs'!G\" & MATCH($F11,'App.2-M_Regulatory_Costs'!$B:$B,0))","v":0},{"$f":"INDIRECT(\"'App.2-M_Regulatory_Costs'!H\" & MATCH($F11,'App.2-M_Regulatory_Costs'!$B:$B,0))","v":0},{"$f":"INDIRECT(\"'App.2-M_Regulatory_Costs'!I\" & MATCH($F11,'App.2-M_Regulatory_Costs'!$B:$B,0))","v":""},{"$f":"INDIRECT(\"'App.2-M_Regulatory_Costs'!J\" & MATCH($F11,'App.2-M_Regulatory_Costs'!$B:$B,0))","v":0},{"$f":"INDIRECT(\"'App.2-M_Regulatory_Costs'!K\" & MATCH($F11,'App.2-M_Regulatory_Costs'!$B:$B,0))","v":""}]
[{"$f":"'LDC Info'!$E$14","v":0},0,2021,2020,2014,{"$f":"'App.2-M_Regulatory_Costs'!B26","v":"Include other items in green cells, as applicable"},"Ongoing",{"$f":"INDIRECT(\"'App.2-M_Regulatory_Costs'!C\" & MATCH(F12,'App.2-M_Regulatory_Costs'!$B:$B,0))","v":0},{"$f":"INDIRECT(\"'App.2-M_Regulatory_Costs'!D\" & MATCH($F12,'App.2-M_Regulatory_Costs'!$B:$B,0))","v":0},{"$f":"INDIRECT(\"'App.2-M_Regulatory_Costs'!E\" & MATCH($F12,'App.2-M_Regulatory_Costs'!$B:$B,0))","v":0},{"$f":"INDIRECT(\"'App.2-M_Regulatory_Costs'!F\" & MATCH($F12,'App.2-M_Regulatory_Costs'!$B:$B,0))","v":0},{"$f":"INDIRECT(\"'App.2-M_Regulatory_Costs'!G\" & MATCH($F12,'App.2-M_Regulatory_Costs'!$B:$B,0))","v":0},{"$f":"INDIRECT(\"'App.2-M_Regulatory_Costs'!H\" & MATCH($F12,'App.2-M_Regulatory_Costs'!$B:$B,0))","v":0},{"$f":"INDIRECT(\"'App.2-M_Regulatory_Costs'!I\" & MATCH($F12,'App.2-M_Regulatory_Costs'!$B:$B,0))","v":""},{"$f":"INDIRECT(\"'App.2-M_Regulatory_Costs'!J\" & MATCH($F12,'App.2-M_Regulatory_Costs'!$B:$B,0))","v":0},{"$f":"INDIRECT(\"'App.2-M_Regulatory_Costs'!K\" & MATCH($F12,'App.2-M_Regulatory_Costs'!$B:$B,0))","v":""}]
[{"$f":"'LDC Info'!$E$14","v":0},0,2021,2020,2014,{"$f":"'App.2-M_Regulatory_Costs'!B27","v":0},"Ongoing",{"$f":"INDIRECT(\"'App.2-M_Regulatory_Costs'!C\" & MATCH(F13,'App.2-M_Regulatory_Costs'!$B:$B,0))","v":{"$error":"#N/A"}},{"$f":"INDIRECT(\"'App.2-M_Regulatory_Costs'!D\" & MATCH($F13,'App.2-M_Regulatory_Costs'!$B:$B,0))","v":{"$error":"#N/A"}},{"$f":"INDIRECT(\"'App.2-M_Regulatory_Costs'!E\" & MATCH($F13,'App.2-M_Regulatory_Costs'!$B:$B,0))","v":{"$error":"#N/A"}},{"$f":"INDIRECT(\"'App.2-M_Regulatory_Costs'!F\" & MATCH($F13,'App.2-M_Regulatory_Costs'!$B:$B,0))","v":{"$error":"#N/A"}},{"$f":"INDIRECT(\"'App.2-M_Regulatory_Costs'!G\" & MATCH($F13,'App.2-M_Regulatory_Costs'!$B:$B,0))","v":{"$error":"#N/A"}},{"$f":"INDIRECT(\"'App.2-M_Regulatory_Costs'!H\" & MATCH($F13,'App.2-M_Regulatory_Costs'!$B:$B,0))","v":{"$error":"#N/A"}},{"$f":"INDIRECT(\"'App.2-M_Regulatory_Costs'!I\" & MATCH($F13,'App.2-M_Regulatory_Costs'!$B:$B,0))","v":{"$error":"#N/A"}},{"$f":"INDIRECT(\"'App.2-M_Regulatory_Costs'!J\" & MATCH($F13,'App.2-M_Regulatory_Costs'!$B:$B,0))","v":{"$error":"#N/A"}},{"$f":"INDIRECT(\"'App.2-M_Regulatory_Costs'!K\" & MATCH($F13,'App.2-M_Regulatory_Costs'!$B:$B,0))","v":{"$error":"#N/A"}}]
[{"$f":"'LDC Info'!$E$14","v":0},0,2021,2020,2014,{"$f":"'App.2-M_Regulatory_Costs'!B28","v":0},"Ongoing",{"$f":"INDIRECT(\"'App.2-M_Regulatory_Costs'!C\" & MATCH(F14,'App.2-M_Regulatory_Costs'!$B:$B,0))","v":{"$error":"#N/A"}},{"$f":"INDIRECT(\"'App.2-M_Regulatory_Costs'!D\" & MATCH($F14,'App.2-M_Regulatory_Costs'!$B:$B,0))","v":{"$error":"#N/A"}},{"$f":"INDIRECT(\"'App.2-M_Regulatory_Costs'!E\" & MATCH($F14,'App.2-M_Regulatory_Costs'!$B:$B,0))","v":{"$error":"#N/A"}},{"$f":"INDIRECT(\"'App.2-M_Regulatory_Costs'!F\" & MATCH($F14,'App.2-M_Regulatory_Costs'!$B:$B,0))","v":{"$error":"#N/A"}},{"$f":"INDIRECT(\"'App.2-M_Regulatory_Costs'!G\" & MATCH($F14,'App.2-M_Regulatory_Costs'!$B:$B,0))","v":{"$error":"#N/A"}},{"$f":"INDIRECT(\"'App.2-M_Regulatory_Costs'!H\" & MATCH($F14,'App.2-M_Regulatory_Costs'!$B:$B,0))","v":{"$error":"#N/A"}},{"$f":"INDIRECT(\"'App.2-M_Regulatory_Costs'!I\" & MATCH($F14,'App.2-M_Regulatory_Costs'!$B:$B,0))","v":{"$error":"#N/A"}},{"$f":"INDIRECT(\"'App.2-M_Regulatory_Costs'!J\" & MATCH($F14,'App.2-M_Regulatory_Costs'!$B:$B,0))","v":{"$error":"#N/A"}},{"$f":"INDIRECT(\"'App.2-M_Regulatory_Costs'!K\" & MATCH($F14,'App.2-M_Regulatory_Costs'!$B:$B,0))","v":{"$error":"#N/A"}}]
[{"$f":"'LDC Info'!$E$14","v":0},0,2021,2020,2014,{"$f":"'App.2-M_Regulatory_Costs'!B29","v":0},"Ongoing",{"$f":"INDIRECT(\"'App.2-M_Regulatory_Costs'!C\" & MATCH(F15,'App.2-M_Regulatory_Costs'!$B:$B,0))","v":{"$error":"#N/A"}},{"$f":"INDIRECT(\"'App.2-M_Regulatory_Costs'!D\" & MATCH($F15,'App.2-M_Regulatory_Costs'!$B:$B,0))","v":{"$error":"#N/A"}},{"$f":"INDIRECT(\"'App.2-M_Regulatory_Costs'!E\" & MATCH($F15,'App.2-M_Regulatory_Costs'!$B:$B,0))","v":{"$error":"#N/A"}},{"$f":"INDIRECT(\"'App.2-M_Regulatory_Costs'!F\" & MATCH($F15,'App.2-M_Regulatory_Costs'!$B:$B,0))","v":{"$error":"#N/A"}},{"$f":"INDIRECT(\"'App.2-M_Regulatory_Costs'!G\" & MATCH($F15,'App.2-M_Regulatory_Costs'!$B:$B,0))","v":{"$error":"#N/A"}},{"$f":"INDIRECT(\"'App.2-M_Regulatory_Costs'!H\" & MATCH($F15,'App.2-M_Regulatory_Costs'!$B:$B,0))","v":{"$error":"#N/A"}},{"$f":"INDIRECT(\"'App.2-M_Regulatory_Costs'!I\" & MATCH($F15,'App.2-M_Regulatory_Costs'!$B:$B,0))","v":{"$error":"#N/A"}},{"$f":"INDIRECT(\"'App.2-M_Regulatory_Costs'!J\" & MATCH($F15,'App.2-M_Regulatory_Costs'!$B:$B,0))","v":{"$error":"#N/A"}},{"$f":"INDIRECT(\"'App.2-M_Regulatory_Costs'!K\" & MATCH($F15,'App.2-M_Regulatory_Costs'!$B:$B,0))","v":{"$error":"#N/A"}}]
[{"$f":"'LDC Info'!$E$14","v":0},0,2021,2020,2014,{"$f":"'App.2-M_Regulatory_Costs'!B30","v":0},"Ongoing",{"$f":"INDIRECT(\"'App.2-M_Regulatory_Costs'!C\" & MATCH(F16,'App.2-M_Regulatory_Costs'!$B:$B,0))","v":{"$error":"#N/A"}},{"$f":"INDIRECT(\"'App.2-M_Regulatory_Costs'!D\" & MATCH($F16,'App.2-M_Regulatory_Costs'!$B:$B,0))","v":{"$error":"#N/A"}},{"$f":"INDIRECT(\"'App.2-M_Regulatory_Costs'!E\" & MATCH($F16,'App.2-M_Regulatory_Costs'!$B:$B,0))","v":{"$error":"#N/A"}},{"$f":"INDIRECT(\"'App.2-M_Regulatory_Costs'!F\" & MATCH($F16,'App.2-M_Regulatory_Costs'!$B:$B,0))","v":{"$error":"#N/A"}},{"$f":"INDIRECT(\"'App.2-M_Regulatory_Costs'!G\" & MATCH($F16,'App.2-M_Regulatory_Costs'!$B:$B,0))","v":{"$error":"#N/A"}},{"$f":"INDIRECT(\"'App.2-M_Regulatory_Costs'!H\" & MATCH($F16,'App.2-M_Regulatory_Costs'!$B:$B,0))","v":{"$error":"#N/A"}},{"$f":"INDIRECT(\"'App.2-M_Regulatory_Costs'!I\" & MATCH($F16,'App.2-M_Regulatory_Costs'!$B:$B,0))","v":{"$error":"#N/A"}},{"$f":"INDIRECT(\"'App.2-M_Regulatory_Costs'!J\" & MATCH($F16,'App.2-M_Regulatory_Costs'!$B:$B,0))","v":{"$error":"#N/A"}},{"$f":"INDIRECT(\"'App.2-M_Regulatory_Costs'!K\" & MATCH($F16,'App.2-M_Regulatory_Costs'!$B:$B,0))","v":{"$error":"#N/A"}}]
[{"$f":"'LDC Info'!$E$14","v":0},0,2021,2020,2014,{"$f":"'App.2-M_Regulatory_Costs'!B31","v":0},"Ongoing",{"$f":"INDIRECT(\"'App.2-M_Regulatory_Costs'!C\" & MATCH(F17,'App.2-M_Regulatory_Costs'!$B:$B,0))","v":{"$error":"#N/A"}},{"$f":"INDIRECT(\"'App.2-M_Regulatory_Costs'!D\" & MATCH($F17,'App.2-M_Regulatory_Costs'!$B:$B,0))","v":{"$error":"#N/A"}},{"$f":"INDIRECT(\"'App.2-M_Regulatory_Costs'!E\" & MATCH($F17,'App.2-M_Regulatory_Costs'!$B:$B,0))","v":{"$error":"#N/A"}},{"$f":"INDIRECT(\"'App.2-M_Regulatory_Costs'!F\" & MATCH($F17,'App.2-M_Regulatory_Costs'!$B:$B,0))","v":{"$error":"#N/A"}},{"$f":"INDIRECT(\"'App.2-M_Regulatory_Costs'!G\" & MATCH($F17,'App.2-M_Regulatory_Costs'!$B:$B,0))","v":{"$error":"#N/A"}},{"$f":"INDIRECT(\"'App.2-M_Regulatory_Costs'!H\" & MATCH($F17,'App.2-M_Regulatory_Costs'!$B:$B,0))","v":{"$error":"#N/A"}},{"$f":"INDIRECT(\"'App.2-M_Regulatory_Costs'!I\" & MATCH($F17,'App.2-M_Regulatory_Costs'!$B:$B,0))","v":{"$error":"#N/A"}},{"$f":"INDIRECT(\"'App.2-M_Regulatory_Costs'!J\" & MATCH($F17,'App.2-M_Regulatory_Costs'!$B:$B,0))","v":{"$error":"#N/A"}},{"$f":"INDIRECT(\"'App.2-M_Regulatory_Costs'!K\" & MATCH($F17,'App.2-M_Regulatory_Costs'!$B:$B,0))","v":{"$error":"#N/A"}}]
[{"$f":"'LDC Info'!$E$14","v":0},0,2021,2020,2014,{"$f":"'App.2-M_Regulatory_Costs'!B32","v":0},"Ongoing",{"$f":"INDIRECT(\"'App.2-M_Regulatory_Costs'!C\" & MATCH(F18,'App.2-M_Regulatory_Costs'!$B:$B,0))","v":{"$error":"#N/A"}},{"$f":"INDIRECT(\"'App.2-M_Regulatory_Costs'!D\" & MATCH($F18,'App.2-M_Regulatory_Costs'!$B:$B,0))","v":{"$error":"#N/A"}},{"$f":"INDIRECT(\"'App.2-M_Regulatory_Costs'!E\" & MATCH($F18,'App.2-M_Regulatory_Costs'!$B:$B,0))","v":{"$error":"#N/A"}},{"$f":"INDIRECT(\"'App.2-M_Regulatory_Costs'!F\" & MATCH($F18,'App.2-M_Regulatory_Costs'!$B:$B,0))","v":{"$error":"#N/A"}},{"$f":"INDIRECT(\"'App.2-M_Regulatory_Costs'!G\" & MATCH($F18,'App.2-M_Regulatory_Costs'!$B:$B,0))","v":{"$error":"#N/A"}},{"$f":"INDIRECT(\"'App.2-M_Regulatory_Costs'!H\" & MATCH($F18,'App.2-M_Regulatory_Costs'!$B:$B,0))","v":{"$error":"#N/A"}},{"$f":"INDIRECT(\"'App.2-M_Regulatory_Costs'!I\" & MATCH($F18,'App.2-M_Regulatory_Costs'!$B:$B,0))","v":{"$error":"#N/A"}},{"$f":"INDIRECT(\"'App.2-M_Regulatory_Costs'!J\" & MATCH($F18,'App.2-M_Regulatory_Costs'!$B:$B,0))","v":{"$error":"#N/A"}},{"$f":"INDIRECT(\"'App.2-M_Regulatory_Costs'!K\" & MATCH($F18,'App.2-M_Regulatory_Costs'!$B:$B,0))","v":{"$error":"#N/A"}}]
[{"$f":"'LDC Info'!$E$14","v":0},0,2021,2020,2014,{"$f":"'App.2-M_Regulatory_Costs'!B33","v":0},"Ongoing",{"$f":"INDIRECT(\"'App.2-M_Regulatory_Costs'!C\" & MATCH(F19,'App.2-M_Regulatory_Costs'!$B:$B,0))","v":{"$error":"#N/A"}},{"$f":"INDIRECT(\"'App.2-M_Regulatory_Costs'!D\" & MATCH($F19,'App.2-M_Regulatory_Costs'!$B:$B,0))","v":{"$error":"#N/A"}},{"$f":"INDIRECT(\"'App.2-M_Regulatory_Costs'!E\" & MATCH($F19,'App.2-M_Regulatory_Costs'!$B:$B,0))","v":{"$error":"#N/A"}},{"$f":"INDIRECT(\"'App.2-M_Regulatory_Costs'!F\" & MATCH($F19,'App.2-M_Regulatory_Costs'!$B:$B,0))","v":{"$error":"#N/A"}},{"$f":"INDIRECT(\"'App.2-M_Regulatory_Costs'!G\" & MATCH($F19,'App.2-M_Regulatory_Costs'!$B:$B,0))","v":{"$error":"#N/A"}},{"$f":"INDIRECT(\"'App.2-M_Regulatory_Costs'!H\" & MATCH($F19,'App.2-M_Regulatory_Costs'!$B:$B,0))","v":{"$error":"#N/A"}},{"$f":"INDIRECT(\"'App.2-M_Regulatory_Costs'!I\" & MATCH($F19,'App.2-M_Regulatory_Costs'!$B:$B,0))","v":{"$error":"#N/A"}},{"$f":"INDIRECT(\"'App.2-M_Regulatory_Costs'!J\" & MATCH($F19,'App.2-M_Regulatory_Costs'!$B:$B,0))","v":{"$error":"#N/A"}},{"$f":"INDIRECT(\"'App.2-M_Regulatory_Costs'!K\" & MATCH($F19,'App.2-M_Regulatory_Costs'!$B:$B,0))","v":{"$error":"#N/A"}}]
[{"$f":"'LDC Info'!$E$14","v":0},0,2021,2020,2014,{"$f":"'App.2-M_Regulatory_Costs'!B34","v":0},"Ongoing",{"$f":"INDIRECT(\"'App.2-M_Regulatory_Costs'!C\" & MATCH(F20,'App.2-M_Regulatory_Costs'!$B:$B,0))","v":{"$error":"#N/A"}},{"$f":"INDIRECT(\"'App.2-M_Regulatory_Costs'!D\" & MATCH($F20,'App.2-M_Regulatory_Costs'!$B:$B,0))","v":{"$error":"#N/A"}},{"$f":"INDIRECT(\"'App.2-M_Regulatory_Costs'!E\" & MATCH($F20,'App.2-M_Regulatory_Costs'!$B:$B,0))","v":{"$error":"#N/A"}},{"$f":"INDIRECT(\"'App.2-M_Regulatory_Costs'!F\" & MATCH($F20,'App.2-M_Regulatory_Costs'!$B:$B,0))","v":{"$error":"#N/A"}},{"$f":"INDIRECT(\"'App.2-M_Regulatory_Costs'!G\" & MATCH($F20,'App.2-M_Regulatory_Costs'!$B:$B,0))","v":{"$error":"#N/A"}},{"$f":"INDIRECT(\"'App.2-M_Regulatory_Costs'!H\" & MATCH($F20,'App.2-M_Regulatory_Costs'!$B:$B,0))","v":{"$error":"#N/A"}},{"$f":"INDIRECT(\"'App.2-M_Regulatory_Costs'!I\" & MATCH($F20,'App.2-M_Regulatory_Costs'!$B:$B,0))","v":{"$error":"#N/A"}},{"$f":"INDIRECT(\"'App.2-M_Regulatory_Costs'!J\" & MATCH($F20,'App.2-M_Regulatory_Costs'!$B:$B,0))","v":{"$error":"#N/A"}},{"$f":"INDIRECT(\"'App.2-M_Regulatory_Costs'!K\" & MATCH($F20,'App.2-M_Regulatory_Costs'!$B:$B,0))","v":{"$error":"#N/A"}}]
[{"$f":"'LDC Info'!$E$14","v":0},0,2021,2020,2014,{"$f":"'App.2-M_Regulatory_Costs'!B35","v":0},"Ongoing",{"$f":"INDIRECT(\"'App.2-M_Regulatory_Costs'!C\" & MATCH(F21,'App.2-M_Regulatory_Costs'!$B:$B,0))","v":{"$error":"#N/A"}},{"$f":"INDIRECT(\"'App.2-M_Regulatory_Costs'!D\" & MATCH($F21,'App.2-M_Regulatory_Costs'!$B:$B,0))","v":{"$error":"#N/A"}},{"$f":"INDIRECT(\"'App.2-M_Regulatory_Costs'!E\" & MATCH($F21,'App.2-M_Regulatory_Costs'!$B:$B,0))","v":{"$error":"#N/A"}},{"$f":"INDIRECT(\"'App.2-M_Regulatory_Costs'!F\" & MATCH($F21,'App.2-M_Regulatory_Costs'!$B:$B,0))","v":{"$error":"#N/A"}},{"$f":"INDIRECT(\"'App.2-M_Regulatory_Costs'!G\" & MATCH($F21,'App.2-M_Regulatory_Costs'!$B:$B,0))","v":{"$error":"#N/A"}},{"$f":"INDIRECT(\"'App.2-M_Regulatory_Costs'!H\" & MATCH($F21,'App.2-M_Regulatory_Costs'!$B:$B,0))","v":{"$error":"#N/A"}},{"$f":"INDIRECT(\"'App.2-M_Regulatory_Costs'!I\" & MATCH($F21,'App.2-M_Regulatory_Costs'!$B:$B,0))","v":{"$error":"#N/A"}},{"$f":"INDIRECT(\"'App.2-M_Regulatory_Costs'!J\" & MATCH($F21,'App.2-M_Regulatory_Costs'!$B:$B,0))","v":{"$error":"#N/A"}},{"$f":"INDIRECT(\"'App.2-M_Regulatory_Costs'!K\" & MATCH($F21,'App.2-M_Regulatory_Costs'!$B:$B,0))","v":{"$error":"#N/A"}}]
[{"$f":"'LDC Info'!$E$14","v":0},0,2021,2020,2014,{"$f":"'App.2-M_Regulatory_Costs'!B36","v":0},"Ongoing",{"$f":"INDIRECT(\"'App.2-M_Regulatory_Costs'!C\" & MATCH(F22,'App.2-M_Regulatory_Costs'!$B:$B,0))","v":{"$error":"#N/A"}},{"$f":"INDIRECT(\"'App.2-M_Regulatory_Costs'!D\" & MATCH($F22,'App.2-M_Regulatory_Costs'!$B:$B,0))","v":{"$error":"#N/A"}},{"$f":"INDIRECT(\"'App.2-M_Regulatory_Costs'!E\" & MATCH($F22,'App.2-M_Regulatory_Costs'!$B:$B,0))","v":{"$error":"#N/A"}},{"$f":"INDIRECT(\"'App.2-M_Regulatory_Costs'!F\" & MATCH($F22,'App.2-M_Regulatory_Costs'!$B:$B,0))","v":{"$error":"#N/A"}},{"$f":"INDIRECT(\"'App.2-M_Regulatory_Costs'!G\" & MATCH($F22,'App.2-M_Regulatory_Costs'!$B:$B,0))","v":{"$error":"#N/A"}},{"$f":"INDIRECT(\"'App.2-M_Regulatory_Costs'!H\" & MATCH($F22,'App.2-M_Regulatory_Costs'!$B:$B,0))","v":{"$error":"#N/A"}},{"$f":"INDIRECT(\"'App.2-M_Regulatory_Costs'!I\" & MATCH($F22,'App.2-M_Regulatory_Costs'!$B:$B,0))","v":{"$error":"#N/A"}},{"$f":"INDIRECT(\"'App.2-M_Regulatory_Costs'!J\" & MATCH($F22,'App.2-M_Regulatory_Costs'!$B:$B,0))","v":{"$error":"#N/A"}},{"$f":"INDIRECT(\"'App.2-M_Regulatory_Costs'!K\" & MATCH($F22,'App.2-M_Regulatory_Costs'!$B:$B,0))","v":{"$error":"#N/A"}}]
[{"$f":"'LDC Info'!$E$14","v":0},0,2021,2020,2014,{"$f":"'App.2-M_Regulatory_Costs'!B37","v":0},"Ongoing",{"$f":"INDIRECT(\"'App.2-M_Regulatory_Costs'!C\" & MATCH(F23,'App.2-M_Regulatory_Costs'!$B:$B,0))","v":{"$error":"#N/A"}},{"$f":"INDIRECT(\"'App.2-M_Regulatory_Costs'!D\" & MATCH($F23,'App.2-M_Regulatory_Costs'!$B:$B,0))","v":{"$error":"#N/A"}},{"$f":"INDIRECT(\"'App.2-M_Regulatory_Costs'!E\" & MATCH($F23,'App.2-M_Regulatory_Costs'!$B:$B,0))","v":{"$error":"#N/A"}},{"$f":"INDIRECT(\"'App.2-M_Regulatory_Costs'!F\" & MATCH($F23,'App.2-M_Regulatory_Costs'!$B:$B,0))","v":{"$error":"#N/A"}},{"$f":"INDIRECT(\"'App.2-M_Regulatory_Costs'!G\" & MATCH($F23,'App.2-M_Regulatory_Costs'!$B:$B,0))","v":{"$error":"#N/A"}},{"$f":"INDIRECT(\"'App.2-M_Regulatory_Costs'!H\" & MATCH($F23,'App.2-M_Regulatory_Costs'!$B:$B,0))","v":{"$error":"#N/A"}},{"$f":"INDIRECT(\"'App.2-M_Regulatory_Costs'!I\" & MATCH($F23,'App.2-M_Regulatory_Costs'!$B:$B,0))","v":{"$error":"#N/A"}},{"$f":"INDIRECT(\"'App.2-M_Regulatory_Costs'!J\" & MATCH($F23,'App.2-M_Regulatory_Costs'!$B:$B,0))","v":{"$error":"#N/A"}},{"$f":"INDIRECT(\"'App.2-M_Regulatory_Costs'!K\" & MATCH($F23,'App.2-M_Regulatory_Costs'!$B:$B,0))","v":{"$error":"#N/A"}}]
[{"$f":"'LDC Info'!$E$14","v":0},0,2021,2020,2014,{"$f":"'App.2-M_Regulatory_Costs'!B38","v":0},"Ongoing",{"$f":"INDIRECT(\"'App.2-M_Regulatory_Costs'!C\" & MATCH(F24,'App.2-M_Regulatory_Costs'!$B:$B,0))","v":{"$error":"#N/A"}},{"$f":"INDIRECT(\"'App.2-M_Regulatory_Costs'!D\" & MATCH($F24,'App.2-M_Regulatory_Costs'!$B:$B,0))","v":{"$error":"#N/A"}},{"$f":"INDIRECT(\"'App.2-M_Regulatory_Costs'!E\" & MATCH($F24,'App.2-M_Regulatory_Costs'!$B:$B,0))","v":{"$error":"#N/A"}},{"$f":"INDIRECT(\"'App.2-M_Regulatory_Costs'!F\" & MATCH($F24,'App.2-M_Regulatory_Costs'!$B:$B,0))","v":{"$error":"#N/A"}},{"$f":"INDIRECT(\"'App.2-M_Regulatory_Costs'!G\" & MATCH($F24,'App.2-M_Regulatory_Costs'!$B:$B,0))","v":{"$error":"#N/A"}},{"$f":"INDIRECT(\"'App.2-M_Regulatory_Costs'!H\" & MATCH($F24,'App.2-M_Regulatory_Costs'!$B:$B,0))","v":{"$error":"#N/A"}},{"$f":"INDIRECT(\"'App.2-M_Regulatory_Costs'!I\" & MATCH($F24,'App.2-M_Regulatory_Costs'!$B:$B,0))","v":{"$error":"#N/A"}},{"$f":"INDIRECT(\"'App.2-M_Regulatory_Costs'!J\" & MATCH($F24,'App.2-M_Regulatory_Costs'!$B:$B,0))","v":{"$error":"#N/A"}},{"$f":"INDIRECT(\"'App.2-M_Regulatory_Costs'!K\" & MATCH($F24,'App.2-M_Regulatory_Costs'!$B:$B,0))","v":{"$error":"#N/A"}}]
[{"$f":"'LDC Info'!$E$14","v":0},0,2021,2020,2014,{"$f":"'App.2-M_Regulatory_Costs'!B39","v":0},"Ongoing",{"$f":"INDIRECT(\"'App.2-M_Regulatory_Costs'!C\" & MATCH(F25,'App.2-M_Regulatory_Costs'!$B:$B,0))","v":{"$error":"#N/A"}},{"$f":"INDIRECT(\"'App.2-M_Regulatory_Costs'!D\" & MATCH($F25,'App.2-M_Regulatory_Costs'!$B:$B,0))","v":{"$error":"#N/A"}},{"$f":"INDIRECT(\"'App.2-M_Regulatory_Costs'!E\" & MATCH($F25,'App.2-M_Regulatory_Costs'!$B:$B,0))","v":{"$error":"#N/A"}},{"$f":"INDIRECT(\"'App.2-M_Regulatory_Costs'!F\" & MATCH($F25,'App.2-M_Regulatory_Costs'!$B:$B,0))","v":{"$error":"#N/A"}},{"$f":"INDIRECT(\"'App.2-M_Regulatory_Costs'!G\" & MATCH($F25,'App.2-M_Regulatory_Costs'!$B:$B,0))","v":{"$error":"#N/A"}},{"$f":"INDIRECT(\"'App.2-M_Regulatory_Costs'!H\" & MATCH($F25,'App.2-M_Regulatory_Costs'!$B:$B,0))","v":{"$error":"#N/A"}},{"$f":"INDIRECT(\"'App.2-M_Regulatory_Costs'!I\" & MATCH($F25,'App.2-M_Regulatory_Costs'!$B:$B,0))","v":{"$error":"#N/A"}},{"$f":"INDIRECT(\"'App.2-M_Regulatory_Costs'!J\" & MATCH($F25,'App.2-M_Regulatory_Costs'!$B:$B,0))","v":{"$error":"#N/A"}},{"$f":"INDIRECT(\"'App.2-M_Regulatory_Costs'!K\" & MATCH($F25,'App.2-M_Regulatory_Costs'!$B:$B,0))","v":{"$error":"#N/A"}}]
[{"$f":"'LDC Info'!$E$14","v":0},0,2021,2020,2014,{"$f":"'App.2-M_Regulatory_Costs'!B40","v":0},"Ongoing",{"$f":"INDIRECT(\"'App.2-M_Regulatory_Costs'!C\" & MATCH(F26,'App.2-M_Regulatory_Costs'!$B:$B,0))","v":{"$error":"#N/A"}},{"$f":"INDIRECT(\"'App.2-M_Regulatory_Costs'!D\" & MATCH($F26,'App.2-M_Regulatory_Costs'!$B:$B,0))","v":{"$error":"#N/A"}},{"$f":"INDIRECT(\"'App.2-M_Regulatory_Costs'!E\" & MATCH($F26,'App.2-M_Regulatory_Costs'!$B:$B,0))","v":{"$error":"#N/A"}},{"$f":"INDIRECT(\"'App.2-M_Regulatory_Costs'!F\" & MATCH($F26,'App.2-M_Regulatory_Costs'!$B:$B,0))","v":{"$error":"#N/A"}},{"$f":"INDIRECT(\"'App.2-M_Regulatory_Costs'!G\" & MATCH($F26,'App.2-M_Regulatory_Costs'!$B:$B,0))","v":{"$error":"#N/A"}},{"$f":"INDIRECT(\"'App.2-M_Regulatory_Costs'!H\" & MATCH($F26,'App.2-M_Regulatory_Costs'!$B:$B,0))","v":{"$error":"#N/A"}},{"$f":"INDIRECT(\"'App.2-M_Regulatory_Costs'!I\" & MATCH($F26,'App.2-M_Regulatory_Costs'!$B:$B,0))","v":{"$error":"#N/A"}},{"$f":"INDIRECT(\"'App.2-M_Regulatory_Costs'!J\" & MATCH($F26,'App.2-M_Regulatory_Costs'!$B:$B,0))","v":{"$error":"#N/A"}},{"$f":"INDIRECT(\"'App.2-M_Regulatory_Costs'!K\" & MATCH($F26,'App.2-M_Regulatory_Costs'!$B:$B,0))","v":{"$error":"#N/A"}}]
[{"$f":"'LDC Info'!$E$14","v":0},0,2021,2020,2014,{"$f":"'App.2-M_Regulatory_Costs'!B41","v":0},"Ongoing",{"$f":"INDIRECT(\"'App.2-M_Regulatory_Costs'!C\" & MATCH(F27,'App.2-M_Regulatory_Costs'!$B:$B,0))","v":{"$error":"#N/A"}},{"$f":"INDIRECT(\"'App.2-M_Regulatory_Costs'!D\" & MATCH($F27,'App.2-M_Regulatory_Costs'!$B:$B,0))","v":{"$error":"#N/A"}},{"$f":"INDIRECT(\"'App.2-M_Regulatory_Costs'!E\" & MATCH($F27,'App.2-M_Regulatory_Costs'!$B:$B,0))","v":{"$error":"#N/A"}},{"$f":"INDIRECT(\"'App.2-M_Regulatory_Costs'!F\" & MATCH($F27,'App.2-M_Regulatory_Costs'!$B:$B,0))","v":{"$error":"#N/A"}},{"$f":"INDIRECT(\"'App.2-M_Regulatory_Costs'!G\" & MATCH($F27,'App.2-M_Regulatory_Costs'!$B:$B,0))","v":{"$error":"#N/A"}},{"$f":"INDIRECT(\"'App.2-M_Regulatory_Costs'!H\" & MATCH($F27,'App.2-M_Regulatory_Costs'!$B:$B,0))","v":{"$error":"#N/A"}},{"$f":"INDIRECT(\"'App.2-M_Regulatory_Costs'!I\" & MATCH($F27,'App.2-M_Regulatory_Costs'!$B:$B,0))","v":{"$error":"#N/A"}},{"$f":"INDIRECT(\"'App.2-M_Regulatory_Costs'!J\" & MATCH($F27,'App.2-M_Regulatory_Costs'!$B:$B,0))","v":{"$error":"#N/A"}},{"$f":"INDIRECT(\"'App.2-M_Regulatory_Costs'!K\" & MATCH($F27,'App.2-M_Regulatory_Costs'!$B:$B,0))","v":{"$error":"#N/A"}}]
[{"$f":"'LDC Info'!$E$14","v":0},0,2021,2020,2014,{"$f":"'App.2-M_Regulatory_Costs'!B42","v":0},"Ongoing",{"$f":"INDIRECT(\"'App.2-M_Regulatory_Costs'!C\" & MATCH(F28,'App.2-M_Regulatory_Costs'!$B:$B,0))","v":{"$error":"#N/A"}},{"$f":"INDIRECT(\"'App.2-M_Regulatory_Costs'!D\" & MATCH($F28,'App.2-M_Regulatory_Costs'!$B:$B,0))","v":{"$error":"#N/A"}},{"$f":"INDIRECT(\"'App.2-M_Regulatory_Costs'!E\" & MATCH($F28,'App.2-M_Regulatory_Costs'!$B:$B,0))","v":{"$error":"#N/A"}},{"$f":"INDIRECT(\"'App.2-M_Regulatory_Costs'!F\" & MATCH($F28,'App.2-M_Regulatory_Costs'!$B:$B,0))","v":{"$error":"#N/A"}},{"$f":"INDIRECT(\"'App.2-M_Regulatory_Costs'!G\" & MATCH($F28,'App.2-M_Regulatory_Costs'!$B:$B,0))","v":{"$error":"#N/A"}},{"$f":"INDIRECT(\"'App.2-M_Regulatory_Costs'!H\" & MATCH($F28,'App.2-M_Regulatory_Costs'!$B:$B,0))","v":{"$error":"#N/A"}},{"$f":"INDIRECT(\"'App.2-M_Regulatory_Costs'!I\" & MATCH($F28,'App.2-M_Regulatory_Costs'!$B:$B,0))","v":{"$error":"#N/A"}},{"$f":"INDIRECT(\"'App.2-M_Regulatory_Costs'!J\" & MATCH($F28,'App.2-M_Regulatory_Costs'!$B:$B,0))","v":{"$error":"#N/A"}},{"$f":"INDIRECT(\"'App.2-M_Regulatory_Costs'!K\" & MATCH($F28,'App.2-M_Regulatory_Costs'!$B:$B,0))","v":{"$error":"#N/A"}}]
[{"$f":"'LDC Info'!$E$14","v":0},0,2021,2020,2014,{"$f":"'App.2-M_Regulatory_Costs'!B43","v":0},"Ongoing",{"$f":"INDIRECT(\"'App.2-M_Regulatory_Costs'!C\" & MATCH(F29,'App.2-M_Regulatory_Costs'!$B:$B,0))","v":{"$error":"#N/A"}},{"$f":"INDIRECT(\"'App.2-M_Regulatory_Costs'!D\" & MATCH($F29,'App.2-M_Regulatory_Costs'!$B:$B,0))","v":{"$error":"#N/A"}},{"$f":"INDIRECT(\"'App.2-M_Regulatory_Costs'!E\" & MATCH($F29,'App.2-M_Regulatory_Costs'!$B:$B,0))","v":{"$error":"#N/A"}},{"$f":"INDIRECT(\"'App.2-M_Regulatory_Costs'!F\" & MATCH($F29,'App.2-M_Regulatory_Costs'!$B:$B,0))","v":{"$error":"#N/A"}},{"$f":"INDIRECT(\"'App.2-M_Regulatory_Costs'!G\" & MATCH($F29,'App.2-M_Regulatory_Costs'!$B:$B,0))","v":{"$error":"#N/A"}},{"$f":"INDIRECT(\"'App.2-M_Regulatory_Costs'!H\" & MATCH($F29,'App.2-M_Regulatory_Costs'!$B:$B,0))","v":{"$error":"#N/A"}},{"$f":"INDIRECT(\"'App.2-M_Regulatory_Costs'!I\" & MATCH($F29,'App.2-M_Regulatory_Costs'!$B:$B,0))","v":{"$error":"#N/A"}},{"$f":"INDIRECT(\"'App.2-M_Regulatory_Costs'!J\" & MATCH($F29,'App.2-M_Regulatory_Costs'!$B:$B,0))","v":{"$error":"#N/A"}},{"$f":"INDIRECT(\"'App.2-M_Regulatory_Costs'!K\" & MATCH($F29,'App.2-M_Regulatory_Costs'!$B:$B,0))","v":{"$error":"#N/A"}}]
[{"$f":"'LDC Info'!$E$14","v":0},0,2021,2020,2014,{"$f":"'App.2-M_Regulatory_Costs'!B44","v":0},"Ongoing",{"$f":"INDIRECT(\"'App.2-M_Regulatory_Costs'!C\" & MATCH(F30,'App.2-M_Regulatory_Costs'!$B:$B,0))","v":{"$error":"#N/A"}},{"$f":"INDIRECT(\"'App.2-M_Regulatory_Costs'!D\" & MATCH($F30,'App.2-M_Regulatory_Costs'!$B:$B,0))","v":{"$error":"#N/A"}},{"$f":"INDIRECT(\"'App.2-M_Regulatory_Costs'!E\" & MATCH($F30,'App.2-M_Regulatory_Costs'!$B:$B,0))","v":{"$error":"#N/A"}},{"$f":"INDIRECT(\"'App.2-M_Regulatory_Costs'!F\" & MATCH($F30,'App.2-M_Regulatory_Costs'!$B:$B,0))","v":{"$error":"#N/A"}},{"$f":"INDIRECT(\"'App.2-M_Regulatory_Costs'!G\" & MATCH($F30,'App.2-M_Regulatory_Costs'!$B:$B,0))","v":{"$error":"#N/A"}},{"$f":"INDIRECT(\"'App.2-M_Regulatory_Costs'!H\" & MATCH($F30,'App.2-M_Regulatory_Costs'!$B:$B,0))","v":{"$error":"#N/A"}},{"$f":"INDIRECT(\"'App.2-M_Regulatory_Costs'!I\" & MATCH($F30,'App.2-M_Regulatory_Costs'!$B:$B,0))","v":{"$error":"#N/A"}},{"$f":"INDIRECT(\"'App.2-M_Regulatory_Costs'!J\" & MATCH($F30,'App.2-M_Regulatory_Costs'!$B:$B,0))","v":{"$error":"#N/A"}},{"$f":"INDIRECT(\"'App.2-M_Regulatory_Costs'!K\" & MATCH($F30,'App.2-M_Regulatory_Costs'!$B:$B,0))","v":{"$error":"#N/A"}}]
[{"$f":"'LDC Info'!$E$14","v":0},0,2021,2020,2014,{"$f":"'App.2-M_Regulatory_Costs'!B45","v":0},"Ongoing",{"$f":"INDIRECT(\"'App.2-M_Regulatory_Costs'!C\" & MATCH(F31,'App.2-M_Regulatory_Costs'!$B:$B,0))","v":{"$error":"#N/A"}},{"$f":"INDIRECT(\"'App.2-M_Regulatory_Costs'!D\" & MATCH($F31,'App.2-M_Regulatory_Costs'!$B:$B,0))","v":{"$error":"#N/A"}},{"$f":"INDIRECT(\"'App.2-M_Regulatory_Costs'!E\" & MATCH($F31,'App.2-M_Regulatory_Costs'!$B:$B,0))","v":{"$error":"#N/A"}},{"$f":"INDIRECT(\"'App.2-M_Regulatory_Costs'!F\" & MATCH($F31,'App.2-M_Regulatory_Costs'!$B:$B,0))","v":{"$error":"#N/A"}},{"$f":"INDIRECT(\"'App.2-M_Regulatory_Costs'!G\" & MATCH($F31,'App.2-M_Regulatory_Costs'!$B:$B,0))","v":{"$error":"#N/A"}},{"$f":"INDIRECT(\"'App.2-M_Regulatory_Costs'!H\" & MATCH($F31,'App.2-M_Regulatory_Costs'!$B:$B,0))","v":{"$error":"#N/A"}},{"$f":"INDIRECT(\"'App.2-M_Regulatory_Costs'!I\" & MATCH($F31,'App.2-M_Regulatory_Costs'!$B:$B,0))","v":{"$error":"#N/A"}},{"$f":"INDIRECT(\"'App.2-M_Regulatory_Costs'!J\" & MATCH($F31,'App.2-M_Regulatory_Costs'!$B:$B,0))","v":{"$error":"#N/A"}},{"$f":"INDIRECT(\"'App.2-M_Regulatory_Costs'!K\" & MATCH($F31,'App.2-M_Regulatory_Costs'!$B:$B,0))","v":{"$error":"#N/A"}}]
[{"$f":"'LDC Info'!$E$14","v":0},0,2021,2020,2014]
[{"$f":"'LDC Info'!$E$14","v":0},0,2021,2020,2014,{"$f":"'App.2-M_Regulatory_Costs'!B47","v":"Expert Witness costs"},"One-Time",{"$f":"INDIRECT(\"'App.2-M_Regulatory_Costs'!C\" & MATCH(F33,'App.2-M_Regulatory_Costs'!$B:$B,0))","v":0},{"$f":"INDIRECT(\"'App.2-M_Regulatory_Costs'!D\" & MATCH($F33,'App.2-M_Regulatory_Costs'!$B:$B,0))","v":0},{"$f":"INDIRECT(\"'App.2-M_Regulatory_Costs'!E\" & MATCH($F33,'App.2-M_Regulatory_Costs'!$B:$B,0))","v":0},{"$f":"INDIRECT(\"'App.2-M_Regulatory_Costs'!F\" & MATCH($F33,'App.2-M_Regulatory_Costs'!$B:$B,0))","v":0},{"$f":"INDIRECT(\"'App.2-M_Regulatory_Costs'!G\" & MATCH($F33,'App.2-M_Regulatory_Costs'!$B:$B,0))","v":0},{"$f":"INDIRECT(\"'App.2-M_Regulatory_Costs'!H\" & MATCH($F33,'App.2-M_Regulatory_Costs'!$B:$B,0))","v":0},{"$f":"INDIRECT(\"'App.2-M_Regulatory_Costs'!I\" & MATCH($F33,'App.2-M_Regulatory_Costs'!$B:$B,0))","v":""},{"$f":"INDIRECT(\"'App.2-M_Regulatory_Costs'!J\" & MATCH($F33,'App.2-M_Regulatory_Costs'!$B:$B,0))","v":0},{"$f":"INDIRECT(\"'App.2-M_Regulatory_Costs'!K\" & MATCH($F33,'App.2-M_Regulatory_Costs'!$B:$B,0))","v":""}]
[{"$f":"'LDC Info'!$E$14","v":0},0,2021,2020,2014,{"$f":"'App.2-M_Regulatory_Costs'!B48","v":"Legal costs"},"One-Time",{"$f":"INDIRECT(\"'App.2-M_Regulatory_Costs'!C\" & MATCH(F34,'App.2-M_Regulatory_Costs'!$B:$B,0))","v":0},{"$f":"INDIRECT(\"'App.2-M_Regulatory_Costs'!D\" & MATCH($F34,'App.2-M_Regulatory_Costs'!$B:$B,0))","v":0},{"$f":"INDIRECT(\"'App.2-M_Regulatory_Costs'!E\" & MATCH($F34,'App.2-M_Regulatory_Costs'!$B:$B,0))","v":0},{"$f":"INDIRECT(\"'App.2-M_Regulatory_Costs'!F\" & MATCH($F34,'App.2-M_Regulatory_Costs'!$B:$B,0))","v":0},{"$f":"INDIRECT(\"'App.2-M_Regulatory_Costs'!G\" & MATCH($F34,'App.2-M_Regulatory_Costs'!$B:$B,0))","v":0},{"$f":"INDIRECT(\"'App.2-M_Regulatory_Costs'!H\" & MATCH($F34,'App.2-M_Regulatory_Costs'!$B:$B,0))","v":0},{"$f":"INDIRECT(\"'App.2-M_Regulatory_Costs'!I\" & MATCH($F34,'App.2-M_Regulatory_Costs'!$B:$B,0))","v":""},{"$f":"INDIRECT(\"'App.2-M_Regulatory_Costs'!J\" & MATCH($F34,'App.2-M_Regulatory_Costs'!$B:$B,0))","v":0},{"$f":"INDIRECT(\"'App.2-M_Regulatory_Costs'!K\" & MATCH($F34,'App.2-M_Regulatory_Costs'!$B:$B,0))","v":""}]
[{"$f":"'LDC Info'!$E$14","v":0},0,2021,2020,2014,{"$f":"'App.2-M_Regulatory_Costs'!B49","v":"Consultants' costs"},"One-Time",{"$f":"INDIRECT(\"'App.2-M_Regulatory_Costs'!C\" & MATCH(F35,'App.2-M_Regulatory_Costs'!$B:$B,0))","v":0},{"$f":"INDIRECT(\"'App.2-M_Regulatory_Costs'!D\" & MATCH($F35,'App.2-M_Regulatory_Costs'!$B:$B,0))","v":0},{"$f":"INDIRECT(\"'App.2-M_Regulatory_Costs'!E\" & MATCH($F35,'App.2-M_Regulatory_Costs'!$B:$B,0))","v":0},{"$f":"INDIRECT(\"'App.2-M_Regulatory_Costs'!F\" & MATCH($F35,'App.2-M_Regulatory_Costs'!$B:$B,0))","v":0},{"$f":"INDIRECT(\"'App.2-M_Regulatory_Costs'!G\" & MATCH($F35,'App.2-M_Regulatory_Costs'!$B:$B,0))","v":0},{"$f":"INDIRECT(\"'App.2-M_Regulatory_Costs'!H\" & MATCH($F35,'App.2-M_Regulatory_Costs'!$B:$B,0))","v":0},{"$f":"INDIRECT(\"'App.2-M_Regulatory_Costs'!I\" & MATCH($F35,'App.2-M_Regulatory_Costs'!$B:$B,0))","v":""},{"$f":"INDIRECT(\"'App.2-M_Regulatory_Costs'!J\" & MATCH($F35,'App.2-M_Regulatory_Costs'!$B:$B,0))","v":0},{"$f":"INDIRECT(\"'App.2-M_Regulatory_Costs'!K\" & MATCH($F35,'App.2-M_Regulatory_Costs'!$B:$B,0))","v":""}]
[{"$f":"'LDC Info'!$E$14","v":0},0,2021,2020,2014,{"$f":"'App.2-M_Regulatory_Costs'!B50","v":"Incremental operating expenses associated with staff resources allocated to this application."},"One-Time",{"$f":"INDIRECT(\"'App.2-M_Regulatory_Costs'!C\" & MATCH(F36,'App.2-M_Regulatory_Costs'!$B:$B,0))","v":0},{"$f":"INDIRECT(\"'App.2-M_Regulatory_Costs'!D\" & MATCH($F36,'App.2-M_Regulatory_Costs'!$B:$B,0))","v":0},{"$f":"INDIRECT(\"'App.2-M_Regulatory_Costs'!E\" & MATCH($F36,'App.2-M_Regulatory_Costs'!$B:$B,0))","v":0},{"$f":"INDIRECT(\"'App.2-M_Regulatory_Costs'!F\" & MATCH($F36,'App.2-M_Regulatory_Costs'!$B:$B,0))","v":0},{"$f":"INDIRECT(\"'App.2-M_Regulatory_Costs'!G\" & MATCH($F36,'App.2-M_Regulatory_Costs'!$B:$B,0))","v":0},{"$f":"INDIRECT(\"'App.2-M_Regulatory_Costs'!H\" & MATCH($F36,'App.2-M_Regulatory_Costs'!$B:$B,0))","v":0},{"$f":"INDIRECT(\"'App.2-M_Regulatory_Costs'!I\" & MATCH($F36,'App.2-M_Regulatory_Costs'!$B:$B,0))","v":""},{"$f":"INDIRECT(\"'App.2-M_Regulatory_Costs'!J\" & MATCH($F36,'App.2-M_Regulatory_Costs'!$B:$B,0))","v":0},{"$f":"INDIRECT(\"'App.2-M_Regulatory_Costs'!K\" & MATCH($F36,'App.2-M_Regulatory_Costs'!$B:$B,0))","v":""}]
[{"$f":"'LDC Info'!$E$14","v":0},0,2021,2020,2014,{"$f":"'App.2-M_Regulatory_Costs'!B51","v":"Incremental operating expenses associated with other resources allocated to this application. 1"},"One-Time",{"$f":"INDIRECT(\"'App.2-M_Regulatory_Costs'!C\" & MATCH(F37,'App.2-M_Regulatory_Costs'!$B:$B,0))","v":0},{"$f":"INDIRECT(\"'App.2-M_Regulatory_Costs'!D\" & MATCH($F37,'App.2-M_Regulatory_Costs'!$B:$B,0))","v":0},{"$f":"INDIRECT(\"'App.2-M_Regulatory_Costs'!E\" & MATCH($F37,'App.2-M_Regulatory_Costs'!$B:$B,0))","v":0},{"$f":"INDIRECT(\"'App.2-M_Regulatory_Costs'!F\" & MATCH($F37,'App.2-M_Regulatory_Costs'!$B:$B,0))","v":0},{"$f":"INDIRECT(\"'App.2-M_Regulatory_Costs'!G\" & MATCH($F37,'App.2-M_Regulatory_Costs'!$B:$B,0))","v":0},{"$f":"INDIRECT(\"'App.2-M_Regulatory_Costs'!H\" & MATCH($F37,'App.2-M_Regulatory_Costs'!$B:$B,0))","v":0},{"$f":"INDIRECT(\"'App.2-M_Regulatory_Costs'!I\" & MATCH($F37,'App.2-M_Regulatory_Costs'!$B:$B,0))","v":""},{"$f":"INDIRECT(\"'App.2-M_Regulatory_Costs'!J\" & MATCH($F37,'App.2-M_Regulatory_Costs'!$B:$B,0))","v":0},{"$f":"INDIRECT(\"'App.2-M_Regulatory_Costs'!K\" & MATCH($F37,'App.2-M_Regulatory_Costs'!$B:$B,0))","v":""}]
[{"$f":"'LDC Info'!$E$14","v":0},0,2021,2020,2014,{"$f":"'App.2-M_Regulatory_Costs'!B52","v":"Intervenor costs"},"One-Time",{"$f":"INDIRECT(\"'App.2-M_Regulatory_Costs'!C\" & MATCH(F38,'App.2-M_Regulatory_Costs'!$B:$B,0))","v":0},{"$f":"INDIRECT(\"'App.2-M_Regulatory_Costs'!D\" & MATCH($F38,'App.2-M_Regulatory_Costs'!$B:$B,0))","v":0},{"$f":"INDIRECT(\"'App.2-M_Regulatory_Costs'!E\" & MATCH($F38,'App.2-M_Regulatory_Costs'!$B:$B,0))","v":0},{"$f":"INDIRECT(\"'App.2-M_Regulatory_Costs'!F\" & MATCH($F38,'App.2-M_Regulatory_Costs'!$B:$B,0))","v":0},{"$f":"INDIRECT(\"'App.2-M_Regulatory_Costs'!G\" & MATCH($F38,'App.2-M_Regulatory_Costs'!$B:$B,0))","v":0},{"$f":"INDIRECT(\"'App.2-M_Regulatory_Costs'!H\" & MATCH($F38,'App.2-M_Regulatory_Costs'!$B:$B,0))","v":0},{"$f":"INDIRECT(\"'App.2-M_Regulatory_Costs'!I\" & MATCH($F38,'App.2-M_Regulatory_Costs'!$B:$B,0))","v":""},{"$f":"INDIRECT(\"'App.2-M_Regulatory_Costs'!J\" & MATCH($F38,'App.2-M_Regulatory_Costs'!$B:$B,0))","v":0},{"$f":"INDIRECT(\"'App.2-M_Regulatory_Costs'!K\" & MATCH($F38,'App.2-M_Regulatory_Costs'!$B:$B,0))","v":""}]
[{"$f":"'LDC Info'!$E$14","v":0},0,2021,2020,2014,{"$f":"'App.2-M_Regulatory_Costs'!B53","v":"OEB Section 30 Costs (application-related)"},"One-Time",{"$f":"INDIRECT(\"'App.2-M_Regulatory_Costs'!C\" & MATCH(F39,'App.2-M_Regulatory_Costs'!$B:$B,0))","v":0},{"$f":"INDIRECT(\"'App.2-M_Regulatory_Costs'!D\" & MATCH($F39,'App.2-M_Regulatory_Costs'!$B:$B,0))","v":0},{"$f":"INDIRECT(\"'App.2-M_Regulatory_Costs'!E\" & MATCH($F39,'App.2-M_Regulatory_Costs'!$B:$B,0))","v":0},{"$f":"INDIRECT(\"'App.2-M_Regulatory_Costs'!F\" & MATCH($F39,'App.2-M_Regulatory_Costs'!$B:$B,0))","v":0},{"$f":"INDIRECT(\"'App.2-M_Regulatory_Costs'!G\" & MATCH($F39,'App.2-M_Regulatory_Costs'!$B:$B,0))","v":0},{"$f":"INDIRECT(\"'App.2-M_Regulatory_Costs'!H\" & MATCH($F39,'App.2-M_Regulatory_Costs'!$B:$B,0))","v":0},{"$f":"INDIRECT(\"'App.2-M_Regulatory_Costs'!I\" & MATCH($F39,'App.2-M_Regulatory_Costs'!$B:$B,0))","v":""},{"$f":"INDIRECT(\"'App.2-M_Regulatory_Costs'!J\" & MATCH($F39,'App.2-M_Regulatory_Costs'!$B:$B,0))","v":0},{"$f":"INDIRECT(\"'App.2-M_Regulatory_Costs'!K\" & MATCH($F39,'App.2-M_Regulatory_Costs'!$B:$B,0))","v":""}]
[{"$f":"'LDC Info'!$E$14","v":0},0,2021,2020,2014,{"$f":"'App.2-M_Regulatory_Costs'!B54","v":"Include other items in green cells, as applicable"},"One-Time",{"$f":"INDIRECT(\"'App.2-M_Regulatory_Costs'!C\" & MATCH(F40,'App.2-M_Regulatory_Costs'!$B:$B,0))","v":0},{"$f":"INDIRECT(\"'App.2-M_Regulatory_Costs'!D\" & MATCH($F40,'App.2-M_Regulatory_Costs'!$B:$B,0))","v":0},{"$f":"INDIRECT(\"'App.2-M_Regulatory_Costs'!E\" & MATCH($F40,'App.2-M_Regulatory_Costs'!$B:$B,0))","v":0},{"$f":"INDIRECT(\"'App.2-M_Regulatory_Costs'!F\" & MATCH($F40,'App.2-M_Regulatory_Costs'!$B:$B,0))","v":0},{"$f":"INDIRECT(\"'App.2-M_Regulatory_Costs'!G\" & MATCH($F40,'App.2-M_Regulatory_Costs'!$B:$B,0))","v":0},{"$f":"INDIRECT(\"'App.2-M_Regulatory_Costs'!H\" & MATCH($F40,'App.2-M_Regulatory_Costs'!$B:$B,0))","v":0},{"$f":"INDIRECT(\"'App.2-M_Regulatory_Costs'!I\" & MATCH($F40,'App.2-M_Regulatory_Costs'!$B:$B,0))","v":""},{"$f":"INDIRECT(\"'App.2-M_Regulatory_Costs'!J\" & MATCH($F40,'App.2-M_Regulatory_Costs'!$B:$B,0))","v":0},{"$f":"INDIRECT(\"'App.2-M_Regulatory_Costs'!K\" & MATCH($F40,'App.2-M_Regulatory_Costs'!$B:$B,0))","v":""}]
[{"$f":"'LDC Info'!$E$14","v":0},0,2021,2020,2014,{"$f":"'App.2-M_Regulatory_Costs'!B55","v":0},"One-Time",{"$f":"INDIRECT(\"'App.2-M_Regulatory_Costs'!C\" & MATCH(F41,'App.2-M_Regulatory_Costs'!$B:$B,0))","v":{"$error":"#N/A"}},{"$f":"INDIRECT(\"'App.2-M_Regulatory_Costs'!D\" & MATCH($F41,'App.2-M_Regulatory_Costs'!$B:$B,0))","v":{"$error":"#N/A"}},{"$f":"INDIRECT(\"'App.2-M_Regulatory_Costs'!E\" & MATCH($F41,'App.2-M_Regulatory_Costs'!$B:$B,0))","v":{"$error":"#N/A"}},{"$f":"INDIRECT(\"'App.2-M_Regulatory_Costs'!F\" & MATCH($F41,'App.2-M_Regulatory_Costs'!$B:$B,0))","v":{"$error":"#N/A"}},{"$f":"INDIRECT(\"'App.2-M_Regulatory_Costs'!G\" & MATCH($F41,'App.2-M_Regulatory_Costs'!$B:$B,0))","v":{"$error":"#N/A"}},{"$f":"INDIRECT(\"'App.2-M_Regulatory_Costs'!H\" & MATCH($F41,'App.2-M_Regulatory_Costs'!$B:$B,0))","v":{"$error":"#N/A"}},{"$f":"INDIRECT(\"'App.2-M_Regulatory_Costs'!I\" & MATCH($F41,'App.2-M_Regulatory_Costs'!$B:$B,0))","v":{"$error":"#N/A"}},{"$f":"INDIRECT(\"'App.2-M_Regulatory_Costs'!J\" & MATCH($F41,'App.2-M_Regulatory_Costs'!$B:$B,0))","v":{"$error":"#N/A"}},{"$f":"INDIRECT(\"'App.2-M_Regulatory_Costs'!K\" & MATCH($F41,'App.2-M_Regulatory_Costs'!$B:$B,0))","v":{"$error":"#N/A"}}]
[{"$f":"'LDC Info'!$E$14","v":0},0,2021,2020,2014,{"$f":"'App.2-M_Regulatory_Costs'!B56","v":0},"One-Time",{"$f":"INDIRECT(\"'App.2-M_Regulatory_Costs'!C\" & MATCH(F42,'App.2-M_Regulatory_Costs'!$B:$B,0))","v":{"$error":"#N/A"}},{"$f":"INDIRECT(\"'App.2-M_Regulatory_Costs'!D\" & MATCH($F42,'App.2-M_Regulatory_Costs'!$B:$B,0))","v":{"$error":"#N/A"}},{"$f":"INDIRECT(\"'App.2-M_Regulatory_Costs'!E\" & MATCH($F42,'App.2-M_Regulatory_Costs'!$B:$B,0))","v":{"$error":"#N/A"}},{"$f":"INDIRECT(\"'App.2-M_Regulatory_Costs'!F\" & MATCH($F42,'App.2-M_Regulatory_Costs'!$B:$B,0))","v":{"$error":"#N/A"}},{"$f":"INDIRECT(\"'App.2-M_Regulatory_Costs'!G\" & MATCH($F42,'App.2-M_Regulatory_Costs'!$B:$B,0))","v":{"$error":"#N/A"}},{"$f":"INDIRECT(\"'App.2-M_Regulatory_Costs'!H\" & MATCH($F42,'App.2-M_Regulatory_Costs'!$B:$B,0))","v":{"$error":"#N/A"}},{"$f":"INDIRECT(\"'App.2-M_Regulatory_Costs'!I\" & MATCH($F42,'App.2-M_Regulatory_Costs'!$B:$B,0))","v":{"$error":"#N/A"}},{"$f":"INDIRECT(\"'App.2-M_Regulatory_Costs'!J\" & MATCH($F42,'App.2-M_Regulatory_Costs'!$B:$B,0))","v":{"$error":"#N/A"}},{"$f":"INDIRECT(\"'App.2-M_Regulatory_Costs'!K\" & MATCH($F42,'App.2-M_Regulatory_Costs'!$B:$B,0))","v":{"$error":"#N/A"}}]
[{"$f":"'LDC Info'!$E$14","v":0},0,2021,2020,2014,{"$f":"'App.2-M_Regulatory_Costs'!B57","v":0},"One-Time",{"$f":"INDIRECT(\"'App.2-M_Regulatory_Costs'!C\" & MATCH(F43,'App.2-M_Regulatory_Costs'!$B:$B,0))","v":{"$error":"#N/A"}},{"$f":"INDIRECT(\"'App.2-M_Regulatory_Costs'!D\" & MATCH($F43,'App.2-M_Regulatory_Costs'!$B:$B,0))","v":{"$error":"#N/A"}},{"$f":"INDIRECT(\"'App.2-M_Regulatory_Costs'!E\" & MATCH($F43,'App.2-M_Regulatory_Costs'!$B:$B,0))","v":{"$error":"#N/A"}},{"$f":"INDIRECT(\"'App.2-M_Regulatory_Costs'!F\" & MATCH($F43,'App.2-M_Regulatory_Costs'!$B:$B,0))","v":{"$error":"#N/A"}},{"$f":"INDIRECT(\"'App.2-M_Regulatory_Costs'!G\" & MATCH($F43,'App.2-M_Regulatory_Costs'!$B:$B,0))","v":{"$error":"#N/A"}},{"$f":"INDIRECT(\"'App.2-M_Regulatory_Costs'!H\" & MATCH($F43,'App.2-M_Regulatory_Costs'!$B:$B,0))","v":{"$error":"#N/A"}},{"$f":"INDIRECT(\"'App.2-M_Regulatory_Costs'!I\" & MATCH($F43,'App.2-M_Regulatory_Costs'!$B:$B,0))","v":{"$error":"#N/A"}},{"$f":"INDIRECT(\"'App.2-M_Regulatory_Costs'!J\" & MATCH($F43,'App.2-M_Regulatory_Costs'!$B:$B,0))","v":{"$error":"#N/A"}},{"$f":"INDIRECT(\"'App.2-M_Regulatory_Costs'!K\" & MATCH($F43,'App.2-M_Regulatory_Costs'!$B:$B,0))","v":{"$error":"#N/A"}}]
[{"$f":"'LDC Info'!$E$14","v":0},0,2021,2020,2014,{"$f":"'App.2-M_Regulatory_Costs'!B58","v":0},"One-Time",{"$f":"INDIRECT(\"'App.2-M_Regulatory_Costs'!C\" & MATCH(F44,'App.2-M_Regulatory_Costs'!$B:$B,0))","v":{"$error":"#N/A"}},{"$f":"INDIRECT(\"'App.2-M_Regulatory_Costs'!D\" & MATCH($F44,'App.2-M_Regulatory_Costs'!$B:$B,0))","v":{"$error":"#N/A"}},{"$f":"INDIRECT(\"'App.2-M_Regulatory_Costs'!E\" & MATCH($F44,'App.2-M_Regulatory_Costs'!$B:$B,0))","v":{"$error":"#N/A"}},{"$f":"INDIRECT(\"'App.2-M_Regulatory_Costs'!F\" & MATCH($F44,'App.2-M_Regulatory_Costs'!$B:$B,0))","v":{"$error":"#N/A"}},{"$f":"INDIRECT(\"'App.2-M_Regulatory_Costs'!G\" & MATCH($F44,'App.2-M_Regulatory_Costs'!$B:$B,0))","v":{"$error":"#N/A"}},{"$f":"INDIRECT(\"'App.2-M_Regulatory_Costs'!H\" & MATCH($F44,'App.2-M_Regulatory_Costs'!$B:$B,0))","v":{"$error":"#N/A"}},{"$f":"INDIRECT(\"'App.2-M_Regulatory_Costs'!I\" & MATCH($F44,'App.2-M_Regulatory_Costs'!$B:$B,0))","v":{"$error":"#N/A"}},{"$f":"INDIRECT(\"'App.2-M_Regulatory_Costs'!J\" & MATCH($F44,'App.2-M_Regulatory_Costs'!$B:$B,0))","v":{"$error":"#N/A"}},{"$f":"INDIRECT(\"'App.2-M_Regulatory_Costs'!K\" & MATCH($F44,'App.2-M_Regulatory_Costs'!$B:$B,0))","v":{"$error":"#N/A"}}]
[{"$f":"'LDC Info'!$E$14","v":0},0,2021,2020,2014,{"$f":"'App.2-M_Regulatory_Costs'!B59","v":0},"One-Time",{"$f":"INDIRECT(\"'App.2-M_Regulatory_Costs'!C\" & MATCH(F45,'App.2-M_Regulatory_Costs'!$B:$B,0))","v":{"$error":"#N/A"}},{"$f":"INDIRECT(\"'App.2-M_Regulatory_Costs'!D\" & MATCH($F45,'App.2-M_Regulatory_Costs'!$B:$B,0))","v":{"$error":"#N/A"}},{"$f":"INDIRECT(\"'App.2-M_Regulatory_Costs'!E\" & MATCH($F45,'App.2-M_Regulatory_Costs'!$B:$B,0))","v":{"$error":"#N/A"}},{"$f":"INDIRECT(\"'App.2-M_Regulatory_Costs'!F\" & MATCH($F45,'App.2-M_Regulatory_Costs'!$B:$B,0))","v":{"$error":"#N/A"}},{"$f":"INDIRECT(\"'App.2-M_Regulatory_Costs'!G\" & MATCH($F45,'App.2-M_Regulatory_Costs'!$B:$B,0))","v":{"$error":"#N/A"}},{"$f":"INDIRECT(\"'App.2-M_Regulatory_Costs'!H\" & MATCH($F45,'App.2-M_Regulatory_Costs'!$B:$B,0))","v":{"$error":"#N/A"}},{"$f":"INDIRECT(\"'App.2-M_Regulatory_Costs'!I\" & MATCH($F45,'App.2-M_Regulatory_Costs'!$B:$B,0))","v":{"$error":"#N/A"}},{"$f":"INDIRECT(\"'App.2-M_Regulatory_Costs'!J\" & MATCH($F45,'App.2-M_Regulatory_Costs'!$B:$B,0))","v":{"$error":"#N/A"}},{"$f":"INDIRECT(\"'App.2-M_Regulatory_Costs'!K\" & MATCH($F45,'App.2-M_Regulatory_Costs'!$B:$B,0))","v":{"$error":"#N/A"}}]
[{"$f":"'LDC Info'!$E$14","v":0},0,2021,2020,2014,{"$f":"'App.2-M_Regulatory_Costs'!B60","v":0},"One-Time",{"$f":"INDIRECT(\"'App.2-M_Regulatory_Costs'!C\" & MATCH(F46,'App.2-M_Regulatory_Costs'!$B:$B,0))","v":{"$error":"#N/A"}},{"$f":"INDIRECT(\"'App.2-M_Regulatory_Costs'!D\" & MATCH($F46,'App.2-M_Regulatory_Costs'!$B:$B,0))","v":{"$error":"#N/A"}},{"$f":"INDIRECT(\"'App.2-M_Regulatory_Costs'!E\" & MATCH($F46,'App.2-M_Regulatory_Costs'!$B:$B,0))","v":{"$error":"#N/A"}},{"$f":"INDIRECT(\"'App.2-M_Regulatory_Costs'!F\" & MATCH($F46,'App.2-M_Regulatory_Costs'!$B:$B,0))","v":{"$error":"#N/A"}},{"$f":"INDIRECT(\"'App.2-M_Regulatory_Costs'!G\" & MATCH($F46,'App.2-M_Regulatory_Costs'!$B:$B,0))","v":{"$error":"#N/A"}},{"$f":"INDIRECT(\"'App.2-M_Regulatory_Costs'!H\" & MATCH($F46,'App.2-M_Regulatory_Costs'!$B:$B,0))","v":{"$error":"#N/A"}},{"$f":"INDIRECT(\"'App.2-M_Regulatory_Costs'!I\" & MATCH($F46,'App.2-M_Regulatory_Costs'!$B:$B,0))","v":{"$error":"#N/A"}},{"$f":"INDIRECT(\"'App.2-M_Regulatory_Costs'!J\" & MATCH($F46,'App.2-M_Regulatory_Costs'!$B:$B,0))","v":{"$error":"#N/A"}},{"$f":"INDIRECT(\"'App.2-M_Regulatory_Costs'!K\" & MATCH($F46,'App.2-M_Regulatory_Costs'!$B:$B,0))","v":{"$error":"#N/A"}}]
[{"$f":"'LDC Info'!$E$14","v":0},0,2021,2020,2014,{"$f":"'App.2-M_Regulatory_Costs'!B61","v":0},"One-Time",{"$f":"INDIRECT(\"'App.2-M_Regulatory_Costs'!C\" & MATCH(F47,'App.2-M_Regulatory_Costs'!$B:$B,0))","v":{"$error":"#N/A"}},{"$f":"INDIRECT(\"'App.2-M_Regulatory_Costs'!D\" & MATCH($F47,'App.2-M_Regulatory_Costs'!$B:$B,0))","v":{"$error":"#N/A"}},{"$f":"INDIRECT(\"'App.2-M_Regulatory_Costs'!E\" & MATCH($F47,'App.2-M_Regulatory_Costs'!$B:$B,0))","v":{"$error":"#N/A"}},{"$f":"INDIRECT(\"'App.2-M_Regulatory_Costs'!F\" & MATCH($F47,'App.2-M_Regulatory_Costs'!$B:$B,0))","v":{"$error":"#N/A"}},{"$f":"INDIRECT(\"'App.2-M_Regulatory_Costs'!G\" & MATCH($F47,'App.2-M_Regulatory_Costs'!$B:$B,0))","v":{"$error":"#N/A"}},{"$f":"INDIRECT(\"'App.2-M_Regulatory_Costs'!H\" & MATCH($F47,'App.2-M_Regulatory_Costs'!$B:$B,0))","v":{"$error":"#N/A"}},{"$f":"INDIRECT(\"'App.2-M_Regulatory_Costs'!I\" & MATCH($F47,'App.2-M_Regulatory_Costs'!$B:$B,0))","v":{"$error":"#N/A"}},{"$f":"INDIRECT(\"'App.2-M_Regulatory_Costs'!J\" & MATCH($F47,'App.2-M_Regulatory_Costs'!$B:$B,0))","v":{"$error":"#N/A"}},{"$f":"INDIRECT(\"'App.2-M_Regulatory_Costs'!K\" & MATCH($F47,'App.2-M_Regulatory_Costs'!$B:$B,0))","v":{"$error":"#N/A"}}]
[{"$f":"'LDC Info'!$E$14","v":0},0,2021,2020,2014,{"$f":"'App.2-M_Regulatory_Costs'!B62","v":0},"One-Time",{"$f":"INDIRECT(\"'App.2-M_Regulatory_Costs'!C\" & MATCH(F48,'App.2-M_Regulatory_Costs'!$B:$B,0))","v":{"$error":"#N/A"}},{"$f":"INDIRECT(\"'App.2-M_Regulatory_Costs'!D\" & MATCH($F48,'App.2-M_Regulatory_Costs'!$B:$B,0))","v":{"$error":"#N/A"}},{"$f":"INDIRECT(\"'App.2-M_Regulatory_Costs'!E\" & MATCH($F48,'App.2-M_Regulatory_Costs'!$B:$B,0))","v":{"$error":"#N/A"}},{"$f":"INDIRECT(\"'App.2-M_Regulatory_Costs'!F\" & MATCH($F48,'App.2-M_Regulatory_Costs'!$B:$B,0))","v":{"$error":"#N/A"}},{"$f":"INDIRECT(\"'App.2-M_Regulatory_Costs'!G\" & MATCH($F48,'App.2-M_Regulatory_Costs'!$B:$B,0))","v":{"$error":"#N/A"}},{"$f":"INDIRECT(\"'App.2-M_Regulatory_Costs'!H\" & MATCH($F48,'App.2-M_Regulatory_Costs'!$B:$B,0))","v":{"$error":"#N/A"}},{"$f":"INDIRECT(\"'App.2-M_Regulatory_Costs'!I\" & MATCH($F48,'App.2-M_Regulatory_Costs'!$B:$B,0))","v":{"$error":"#N/A"}},{"$f":"INDIRECT(\"'App.2-M_Regulatory_Costs'!J\" & MATCH($F48,'App.2-M_Regulatory_Costs'!$B:$B,0))","v":{"$error":"#N/A"}},{"$f":"INDIRECT(\"'App.2-M_Regulatory_Costs'!K\" & MATCH($F48,'App.2-M_Regulatory_Costs'!$B:$B,0))","v":{"$error":"#N/A"}}]
[{"$f":"'LDC Info'!$E$14","v":0},0,2021,2020,2014,{"$f":"'App.2-M_Regulatory_Costs'!B63","v":0},"One-Time",{"$f":"INDIRECT(\"'App.2-M_Regulatory_Costs'!C\" & MATCH(F49,'App.2-M_Regulatory_Costs'!$B:$B,0))","v":{"$error":"#N/A"}},{"$f":"INDIRECT(\"'App.2-M_Regulatory_Costs'!D\" & MATCH($F49,'App.2-M_Regulatory_Costs'!$B:$B,0))","v":{"$error":"#N/A"}},{"$f":"INDIRECT(\"'App.2-M_Regulatory_Costs'!E\" & MATCH($F49,'App.2-M_Regulatory_Costs'!$B:$B,0))","v":{"$error":"#N/A"}},{"$f":"INDIRECT(\"'App.2-M_Regulatory_Costs'!F\" & MATCH($F49,'App.2-M_Regulatory_Costs'!$B:$B,0))","v":{"$error":"#N/A"}},{"$f":"INDIRECT(\"'App.2-M_Regulatory_Costs'!G\" & MATCH($F49,'App.2-M_Regulatory_Costs'!$B:$B,0))","v":{"$error":"#N/A"}},{"$f":"INDIRECT(\"'App.2-M_Regulatory_Costs'!H\" & MATCH($F49,'App.2-M_Regulatory_Costs'!$B:$B,0))","v":{"$error":"#N/A"}},{"$f":"INDIRECT(\"'App.2-M_Regulatory_Costs'!I\" & MATCH($F49,'App.2-M_Regulatory_Costs'!$B:$B,0))","v":{"$error":"#N/A"}},{"$f":"INDIRECT(\"'App.2-M_Regulatory_Costs'!J\" & MATCH($F49,'App.2-M_Regulatory_Costs'!$B:$B,0))","v":{"$error":"#N/A"}},{"$f":"INDIRECT(\"'App.2-M_Regulatory_Costs'!K\" & MATCH($F49,'App.2-M_Regulatory_Costs'!$B:$B,0))","v":{"$error":"#N/A"}}]
[{"$f":"'LDC Info'!$E$14","v":0},0,2021,2020,2014,{"$f":"'App.2-M_Regulatory_Costs'!B64","v":0},"One-Time",{"$f":"INDIRECT(\"'App.2-M_Regulatory_Costs'!C\" & MATCH(F50,'App.2-M_Regulatory_Costs'!$B:$B,0))","v":{"$error":"#N/A"}},{"$f":"INDIRECT(\"'App.2-M_Regulatory_Costs'!D\" & MATCH($F50,'App.2-M_Regulatory_Costs'!$B:$B,0))","v":{"$error":"#N/A"}},{"$f":"INDIRECT(\"'App.2-M_Regulatory_Costs'!E\" & MATCH($F50,'App.2-M_Regulatory_Costs'!$B:$B,0))","v":{"$error":"#N/A"}},{"$f":"INDIRECT(\"'App.2-M_Regulatory_Costs'!F\" & MATCH($F50,'App.2-M_Regulatory_Costs'!$B:$B,0))","v":{"$error":"#N/A"}},{"$f":"INDIRECT(\"'App.2-M_Regulatory_Costs'!G\" & MATCH($F50,'App.2-M_Regulatory_Costs'!$B:$B,0))","v":{"$error":"#N/A"}},{"$f":"INDIRECT(\"'App.2-M_Regulatory_Costs'!H\" & MATCH($F50,'App.2-M_Regulatory_Costs'!$B:$B,0))","v":{"$error":"#N/A"}},{"$f":"INDIRECT(\"'App.2-M_Regulatory_Costs'!I\" & MATCH($F50,'App.2-M_Regulatory_Costs'!$B:$B,0))","v":{"$error":"#N/A"}},{"$f":"INDIRECT(\"'App.2-M_Regulatory_Costs'!J\" & MATCH($F50,'App.2-M_Regulatory_Costs'!$B:$B,0))","v":{"$error":"#N/A"}},{"$f":"INDIRECT(\"'App.2-M_Regulatory_Costs'!K\" & MATCH($F50,'App.2-M_Regulatory_Costs'!$B:$B,0))","v":{"$error":"#N/A"}}]
[{"$f":"'LDC Info'!$E$14","v":0},0,2021,2020,2014,{"$f":"'App.2-M_Regulatory_Costs'!B65","v":0},"One-Time",{"$f":"INDIRECT(\"'App.2-M_Regulatory_Costs'!C\" & MATCH(F51,'App.2-M_Regulatory_Costs'!$B:$B,0))","v":{"$error":"#N/A"}},{"$f":"INDIRECT(\"'App.2-M_Regulatory_Costs'!D\" & MATCH($F51,'App.2-M_Regulatory_Costs'!$B:$B,0))","v":{"$error":"#N/A"}},{"$f":"INDIRECT(\"'App.2-M_Regulatory_Costs'!E\" & MATCH($F51,'App.2-M_Regulatory_Costs'!$B:$B,0))","v":{"$error":"#N/A"}},{"$f":"INDIRECT(\"'App.2-M_Regulatory_Costs'!F\" & MATCH($F51,'App.2-M_Regulatory_Costs'!$B:$B,0))","v":{"$error":"#N/A"}},{"$f":"INDIRECT(\"'App.2-M_Regulatory_Costs'!G\" & MATCH($F51,'App.2-M_Regulatory_Costs'!$B:$B,0))","v":{"$error":"#N/A"}},{"$f":"INDIRECT(\"'App.2-M_Regulatory_Costs'!H\" & MATCH($F51,'App.2-M_Regulatory_Costs'!$B:$B,0))","v":{"$error":"#N/A"}},{"$f":"INDIRECT(\"'App.2-M_Regulatory_Costs'!I\" & MATCH($F51,'App.2-M_Regulatory_Costs'!$B:$B,0))","v":{"$error":"#N/A"}},{"$f":"INDIRECT(\"'App.2-M_Regulatory_Costs'!J\" & MATCH($F51,'App.2-M_Regulatory_Costs'!$B:$B,0))","v":{"$error":"#N/A"}},{"$f":"INDIRECT(\"'App.2-M_Regulatory_Costs'!K\" & MATCH($F51,'App.2-M_Regulatory_Costs'!$B:$B,0))","v":{"$error":"#N/A"}}]
[{"$f":"'LDC Info'!$E$14","v":0},0,2021,2020,2014,{"$f":"'App.2-M_Regulatory_Costs'!B66","v":0},"One-Time",{"$f":"INDIRECT(\"'App.2-M_Regulatory_Costs'!C\" & MATCH(F52,'App.2-M_Regulatory_Costs'!$B:$B,0))","v":{"$error":"#N/A"}},{"$f":"INDIRECT(\"'App.2-M_Regulatory_Costs'!D\" & MATCH($F52,'App.2-M_Regulatory_Costs'!$B:$B,0))","v":{"$error":"#N/A"}},{"$f":"INDIRECT(\"'App.2-M_Regulatory_Costs'!E\" & MATCH($F52,'App.2-M_Regulatory_Costs'!$B:$B,0))","v":{"$error":"#N/A"}},{"$f":"INDIRECT(\"'App.2-M_Regulatory_Costs'!F\" & MATCH($F52,'App.2-M_Regulatory_Costs'!$B:$B,0))","v":{"$error":"#N/A"}},{"$f":"INDIRECT(\"'App.2-M_Regulatory_Costs'!G\" & MATCH($F52,'App.2-M_Regulatory_Costs'!$B:$B,0))","v":{"$error":"#N/A"}},{"$f":"INDIRECT(\"'App.2-M_Regulatory_Costs'!H\" & MATCH($F52,'App.2-M_Regulatory_Costs'!$B:$B,0))","v":{"$error":"#N/A"}},{"$f":"INDIRECT(\"'App.2-M_Regulatory_Costs'!I\" & MATCH($F52,'App.2-M_Regulatory_Costs'!$B:$B,0))","v":{"$error":"#N/A"}},{"$f":"INDIRECT(\"'App.2-M_Regulatory_Costs'!J\" & MATCH($F52,'App.2-M_Regulatory_Costs'!$B:$B,0))","v":{"$error":"#N/A"}},{"$f":"INDIRECT(\"'App.2-M_Regulatory_Costs'!K\" & MATCH($F52,'App.2-M_Regulatory_Costs'!$B:$B,0))","v":{"$error":"#N/A"}}]
[{"$f":"'LDC Info'!$E$14","v":0},0,2021,2020,2014,{"$f":"'App.2-M_Regulatory_Costs'!B67","v":0},"One-Time",{"$f":"INDIRECT(\"'App.2-M_Regulatory_Costs'!C\" & MATCH(F53,'App.2-M_Regulatory_Costs'!$B:$B,0))","v":{"$error":"#N/A"}},{"$f":"INDIRECT(\"'App.2-M_Regulatory_Costs'!D\" & MATCH($F53,'App.2-M_Regulatory_Costs'!$B:$B,0))","v":{"$error":"#N/A"}},{"$f":"INDIRECT(\"'App.2-M_Regulatory_Costs'!E\" & MATCH($F53,'App.2-M_Regulatory_Costs'!$B:$B,0))","v":{"$error":"#N/A"}},{"$f":"INDIRECT(\"'App.2-M_Regulatory_Costs'!F\" & MATCH($F53,'App.2-M_Regulatory_Costs'!$B:$B,0))","v":{"$error":"#N/A"}},{"$f":"INDIRECT(\"'App.2-M_Regulatory_Costs'!G\" & MATCH($F53,'App.2-M_Regulatory_Costs'!$B:$B,0))","v":{"$error":"#N/A"}},{"$f":"INDIRECT(\"'App.2-M_Regulatory_Costs'!H\" & MATCH($F53,'App.2-M_Regulatory_Costs'!$B:$B,0))","v":{"$error":"#N/A"}},{"$f":"INDIRECT(\"'App.2-M_Regulatory_Costs'!I\" & MATCH($F53,'App.2-M_Regulatory_Costs'!$B:$B,0))","v":{"$error":"#N/A"}},{"$f":"INDIRECT(\"'App.2-M_Regulatory_Costs'!J\" & MATCH($F53,'App.2-M_Regulatory_Costs'!$B:$B,0))","v":{"$error":"#N/A"}},{"$f":"INDIRECT(\"'App.2-M_Regulatory_Costs'!K\" & MATCH($F53,'App.2-M_Regulatory_Costs'!$B:$B,0))","v":{"$error":"#N/A"}}]
[{"$f":"'LDC Info'!$E$14","v":0},0,2021,2020,2014,{"$f":"'App.2-M_Regulatory_Costs'!B68","v":0},"One-Time",{"$f":"INDIRECT(\"'App.2-M_Regulatory_Costs'!C\" & MATCH(F54,'App.2-M_Regulatory_Costs'!$B:$B,0))","v":{"$error":"#N/A"}},{"$f":"INDIRECT(\"'App.2-M_Regulatory_Costs'!D\" & MATCH($F54,'App.2-M_Regulatory_Costs'!$B:$B,0))","v":{"$error":"#N/A"}},{"$f":"INDIRECT(\"'App.2-M_Regulatory_Costs'!E\" & MATCH($F54,'App.2-M_Regulatory_Costs'!$B:$B,0))","v":{"$error":"#N/A"}},{"$f":"INDIRECT(\"'App.2-M_Regulatory_Costs'!F\" & MATCH($F54,'App.2-M_Regulatory_Costs'!$B:$B,0))","v":{"$error":"#N/A"}},{"$f":"INDIRECT(\"'App.2-M_Regulatory_Costs'!G\" & MATCH($F54,'App.2-M_Regulatory_Costs'!$B:$B,0))","v":{"$error":"#N/A"}},{"$f":"INDIRECT(\"'App.2-M_Regulatory_Costs'!H\" & MATCH($F54,'App.2-M_Regulatory_Costs'!$B:$B,0))","v":{"$error":"#N/A"}},{"$f":"INDIRECT(\"'App.2-M_Regulatory_Costs'!I\" & MATCH($F54,'App.2-M_Regulatory_Costs'!$B:$B,0))","v":{"$error":"#N/A"}},{"$f":"INDIRECT(\"'App.2-M_Regulatory_Costs'!J\" & MATCH($F54,'App.2-M_Regulatory_Costs'!$B:$B,0))","v":{"$error":"#N/A"}},{"$f":"INDIRECT(\"'App.2-M_Regulatory_Costs'!K\" & MATCH($F54,'App.2-M_Regulatory_Costs'!$B:$B,0))","v":{"$error":"#N/A"}}]
[{"$f":"'LDC Info'!$E$14","v":0},0,2021,2020,2014,{"$f":"'App.2-M_Regulatory_Costs'!B69","v":0},"One-Time",{"$f":"INDIRECT(\"'App.2-M_Regulatory_Costs'!C\" & MATCH(F55,'App.2-M_Regulatory_Costs'!$B:$B,0))","v":{"$error":"#N/A"}},{"$f":"INDIRECT(\"'App.2-M_Regulatory_Costs'!D\" & MATCH($F55,'App.2-M_Regulatory_Costs'!$B:$B,0))","v":{"$error":"#N/A"}},{"$f":"INDIRECT(\"'App.2-M_Regulatory_Costs'!E\" & MATCH($F55,'App.2-M_Regulatory_Costs'!$B:$B,0))","v":{"$error":"#N/A"}},{"$f":"INDIRECT(\"'App.2-M_Regulatory_Costs'!F\" & MATCH($F55,'App.2-M_Regulatory_Costs'!$B:$B,0))","v":{"$error":"#N/A"}},{"$f":"INDIRECT(\"'App.2-M_Regulatory_Costs'!G\" & MATCH($F55,'App.2-M_Regulatory_Costs'!$B:$B,0))","v":{"$error":"#N/A"}},{"$f":"INDIRECT(\"'App.2-M_Regulatory_Costs'!H\" & MATCH($F55,'App.2-M_Regulatory_Costs'!$B:$B,0))","v":{"$error":"#N/A"}},{"$f":"INDIRECT(\"'App.2-M_Regulatory_Costs'!I\" & MATCH($F55,'App.2-M_Regulatory_Costs'!$B:$B,0))","v":{"$error":"#N/A"}},{"$f":"INDIRECT(\"'App.2-M_Regulatory_Costs'!J\" & MATCH($F55,'App.2-M_Regulatory_Costs'!$B:$B,0))","v":{"$error":"#N/A"}},{"$f":"INDIRECT(\"'App.2-M_Regulatory_Costs'!K\" & MATCH($F55,'App.2-M_Regulatory_Costs'!$B:$B,0))","v":{"$error":"#N/A"}}]
[{"$f":"'LDC Info'!$E$14","v":0},0,2021,2020,2014,{"$f":"'App.2-M_Regulatory_Costs'!B70","v":0},"One-Time",{"$f":"INDIRECT(\"'App.2-M_Regulatory_Costs'!C\" & MATCH(F56,'App.2-M_Regulatory_Costs'!$B:$B,0))","v":{"$error":"#N/A"}},{"$f":"INDIRECT(\"'App.2-M_Regulatory_Costs'!D\" & MATCH($F56,'App.2-M_Regulatory_Costs'!$B:$B,0))","v":{"$error":"#N/A"}},{"$f":"INDIRECT(\"'App.2-M_Regulatory_Costs'!E\" & MATCH($F56,'App.2-M_Regulatory_Costs'!$B:$B,0))","v":{"$error":"#N/A"}},{"$f":"INDIRECT(\"'App.2-M_Regulatory_Costs'!F\" & MATCH($F56,'App.2-M_Regulatory_Costs'!$B:$B,0))","v":{"$error":"#N/A"}},{"$f":"INDIRECT(\"'App.2-M_Regulatory_Costs'!G\" & MATCH($F56,'App.2-M_Regulatory_Costs'!$B:$B,0))","v":{"$error":"#N/A"}},{"$f":"INDIRECT(\"'App.2-M_Regulatory_Costs'!H\" & MATCH($F56,'App.2-M_Regulatory_Costs'!$B:$B,0))","v":{"$error":"#N/A"}},{"$f":"INDIRECT(\"'App.2-M_Regulatory_Costs'!I\" & MATCH($F56,'App.2-M_Regulatory_Costs'!$B:$B,0))","v":{"$error":"#N/A"}},{"$f":"INDIRECT(\"'App.2-M_Regulatory_Costs'!J\" & MATCH($F56,'App.2-M_Regulatory_Costs'!$B:$B,0))","v":{"$error":"#N/A"}},{"$f":"INDIRECT(\"'App.2-M_Regulatory_Costs'!K\" & MATCH($F56,'App.2-M_Regulatory_Costs'!$B:$B,0))","v":{"$error":"#N/A"}}]
[{"$f":"'LDC Info'!$E$14","v":0},0,2021,2020,2014,{"$f":"'App.2-M_Regulatory_Costs'!B71","v":0},"One-Time",{"$f":"INDIRECT(\"'App.2-M_Regulatory_Costs'!C\" & MATCH(F57,'App.2-M_Regulatory_Costs'!$B:$B,0))","v":{"$error":"#N/A"}},{"$f":"INDIRECT(\"'App.2-M_Regulatory_Costs'!D\" & MATCH($F57,'App.2-M_Regulatory_Costs'!$B:$B,0))","v":{"$error":"#N/A"}},{"$f":"INDIRECT(\"'App.2-M_Regulatory_Costs'!E\" & MATCH($F57,'App.2-M_Regulatory_Costs'!$B:$B,0))","v":{"$error":"#N/A"}},{"$f":"INDIRECT(\"'App.2-M_Regulatory_Costs'!F\" & MATCH($F57,'App.2-M_Regulatory_Costs'!$B:$B,0))","v":{"$error":"#N/A"}},{"$f":"INDIRECT(\"'App.2-M_Regulatory_Costs'!G\" & MATCH($F57,'App.2-M_Regulatory_Costs'!$B:$B,0))","v":{"$error":"#N/A"}},{"$f":"INDIRECT(\"'App.2-M_Regulatory_Costs'!H\" & MATCH($F57,'App.2-M_Regulatory_Costs'!$B:$B,0))","v":{"$error":"#N/A"}},{"$f":"INDIRECT(\"'App.2-M_Regulatory_Costs'!I\" & MATCH($F57,'App.2-M_Regulatory_Costs'!$B:$B,0))","v":{"$error":"#N/A"}},{"$f":"INDIRECT(\"'App.2-M_Regulatory_Costs'!J\" & MATCH($F57,'App.2-M_Regulatory_Costs'!$B:$B,0))","v":{"$error":"#N/A"}},{"$f":"INDIRECT(\"'App.2-M_Regulatory_Costs'!K\" & MATCH($F57,'App.2-M_Regulatory_Costs'!$B:$B,0))","v":{"$error":"#N/A"}}]
[{"$f":"'LDC Info'!$E$14","v":0},0,2021,2020,2014,{"$f":"'App.2-M_Regulatory_Costs'!B72","v":0},"One-Time",{"$f":"INDIRECT(\"'App.2-M_Regulatory_Costs'!C\" & MATCH(F58,'App.2-M_Regulatory_Costs'!$B:$B,0))","v":{"$error":"#N/A"}},{"$f":"INDIRECT(\"'App.2-M_Regulatory_Costs'!D\" & MATCH($F58,'App.2-M_Regulatory_Costs'!$B:$B,0))","v":{"$error":"#N/A"}},{"$f":"INDIRECT(\"'App.2-M_Regulatory_Costs'!E\" & MATCH($F58,'App.2-M_Regulatory_Costs'!$B:$B,0))","v":{"$error":"#N/A"}},{"$f":"INDIRECT(\"'App.2-M_Regulatory_Costs'!F\" & MATCH($F58,'App.2-M_Regulatory_Costs'!$B:$B,0))","v":{"$error":"#N/A"}},{"$f":"INDIRECT(\"'App.2-M_Regulatory_Costs'!G\" & MATCH($F58,'App.2-M_Regulatory_Costs'!$B:$B,0))","v":{"$error":"#N/A"}},{"$f":"INDIRECT(\"'App.2-M_Regulatory_Costs'!H\" & MATCH($F58,'App.2-M_Regulatory_Costs'!$B:$B,0))","v":{"$error":"#N/A"}},{"$f":"INDIRECT(\"'App.2-M_Regulatory_Costs'!I\" & MATCH($F58,'App.2-M_Regulatory_Costs'!$B:$B,0))","v":{"$error":"#N/A"}},{"$f":"INDIRECT(\"'App.2-M_Regulatory_Costs'!J\" & MATCH($F58,'App.2-M_Regulatory_Costs'!$B:$B,0))","v":{"$error":"#N/A"}},{"$f":"INDIRECT(\"'App.2-M_Regulatory_Costs'!K\" & MATCH($F58,'App.2-M_Regulatory_Costs'!$B:$B,0))","v":{"$error":"#N/A"}}]
[{"$f":"'LDC Info'!$E$14","v":0},0,2021,2020,2014,{"$f":"'App.2-M_Regulatory_Costs'!B73","v":0},"One-Time",{"$f":"INDIRECT(\"'App.2-M_Regulatory_Costs'!C\" & MATCH(F59,'App.2-M_Regulatory_Costs'!$B:$B,0))","v":{"$error":"#N/A"}},{"$f":"INDIRECT(\"'App.2-M_Regulatory_Costs'!D\" & MATCH($F59,'App.2-M_Regulatory_Costs'!$B:$B,0))","v":{"$error":"#N/A"}},{"$f":"INDIRECT(\"'App.2-M_Regulatory_Costs'!E\" & MATCH($F59,'App.2-M_Regulatory_Costs'!$B:$B,0))","v":{"$error":"#N/A"}},{"$f":"INDIRECT(\"'App.2-M_Regulatory_Costs'!F\" & MATCH($F59,'App.2-M_Regulatory_Costs'!$B:$B,0))","v":{"$error":"#N/A"}},{"$f":"INDIRECT(\"'App.2-M_Regulatory_Costs'!G\" & MATCH($F59,'App.2-M_Regulatory_Costs'!$B:$B,0))","v":{"$error":"#N/A"}},{"$f":"INDIRECT(\"'App.2-M_Regulatory_Costs'!H\" & MATCH($F59,'App.2-M_Regulatory_Costs'!$B:$B,0))","v":{"$error":"#N/A"}},{"$f":"INDIRECT(\"'App.2-M_Regulatory_Costs'!I\" & MATCH($F59,'App.2-M_Regulatory_Costs'!$B:$B,0))","v":{"$error":"#N/A"}},{"$f":"INDIRECT(\"'App.2-M_Regulatory_Costs'!J\" & MATCH($F59,'App.2-M_Regulatory_Costs'!$B:$B,0))","v":{"$error":"#N/A"}},{"$f":"INDIRECT(\"'App.2-M_Regulatory_Costs'!K\" & MATCH($F59,'App.2-M_Regulatory_Costs'!$B:$B,0))","v":{"$error":"#N/A"}}]
[{"$f":"'LDC Info'!$E$14","v":0},0,2021,2020,2014,{"$f":"'App.2-M_Regulatory_Costs'!B74","v":0},"One-Time",{"$f":"INDIRECT(\"'App.2-M_Regulatory_Costs'!C\" & MATCH(F60,'App.2-M_Regulatory_Costs'!$B:$B,0))","v":{"$error":"#N/A"}},{"$f":"INDIRECT(\"'App.2-M_Regulatory_Costs'!D\" & MATCH($F60,'App.2-M_Regulatory_Costs'!$B:$B,0))","v":{"$error":"#N/A"}},{"$f":"INDIRECT(\"'App.2-M_Regulatory_Costs'!E\" & MATCH($F60,'App.2-M_Regulatory_Costs'!$B:$B,0))","v":{"$error":"#N/A"}},{"$f":"INDIRECT(\"'App.2-M_Regulatory_Costs'!F\" & MATCH($F60,'App.2-M_Regulatory_Costs'!$B:$B,0))","v":{"$error":"#N/A"}},{"$f":"INDIRECT(\"'App.2-M_Regulatory_Costs'!G\" & MATCH($F60,'App.2-M_Regulatory_Costs'!$B:$B,0))","v":{"$error":"#N/A"}},{"$f":"INDIRECT(\"'App.2-M_Regulatory_Costs'!H\" & MATCH($F60,'App.2-M_Regulatory_Costs'!$B:$B,0))","v":{"$error":"#N/A"}},{"$f":"INDIRECT(\"'App.2-M_Regulatory_Costs'!I\" & MATCH($F60,'App.2-M_Regulatory_Costs'!$B:$B,0))","v":{"$error":"#N/A"}},{"$f":"INDIRECT(\"'App.2-M_Regulatory_Costs'!J\" & MATCH($F60,'App.2-M_Regulatory_Costs'!$B:$B,0))","v":{"$error":"#N/A"}},{"$f":"INDIRECT(\"'App.2-M_Regulatory_Costs'!K\" & MATCH($F60,'App.2-M_Regulatory_Costs'!$B:$B,0))","v":{"$error":"#N/A"}}]
[{"$f":"'LDC Info'!$E$14","v":0},0,2021,2020,2014,{"$f":"'App.2-M_Regulatory_Costs'!B75","v":0},"One-Time",{"$f":"INDIRECT(\"'App.2-M_Regulatory_Costs'!C\" & MATCH(F61,'App.2-M_Regulatory_Costs'!$B:$B,0))","v":{"$error":"#N/A"}},{"$f":"INDIRECT(\"'App.2-M_Regulatory_Costs'!D\" & MATCH($F61,'App.2-M_Regulatory_Costs'!$B:$B,0))","v":{"$error":"#N/A"}},{"$f":"INDIRECT(\"'App.2-M_Regulatory_Costs'!E\" & MATCH($F61,'App.2-M_Regulatory_Costs'!$B:$B,0))","v":{"$error":"#N/A"}},{"$f":"INDIRECT(\"'App.2-M_Regulatory_Costs'!F\" & MATCH($F61,'App.2-M_Regulatory_Costs'!$B:$B,0))","v":{"$error":"#N/A"}},{"$f":"INDIRECT(\"'App.2-M_Regulatory_Costs'!G\" & MATCH($F61,'App.2-M_Regulatory_Costs'!$B:$B,0))","v":{"$error":"#N/A"}},{"$f":"INDIRECT(\"'App.2-M_Regulatory_Costs'!H\" & MATCH($F61,'App.2-M_Regulatory_Costs'!$B:$B,0))","v":{"$error":"#N/A"}},{"$f":"INDIRECT(\"'App.2-M_Regulatory_Costs'!I\" & MATCH($F61,'App.2-M_Regulatory_Costs'!$B:$B,0))","v":{"$error":"#N/A"}},{"$f":"INDIRECT(\"'App.2-M_Regulatory_Costs'!J\" & MATCH($F61,'App.2-M_Regulatory_Costs'!$B:$B,0))","v":{"$error":"#N/A"}},{"$f":"INDIRECT(\"'App.2-M_Regulatory_Costs'!K\" & MATCH($F61,'App.2-M_Regulatory_Costs'!$B:$B,0))","v":{"$error":"#N/A"}}]
[{"$f":"'LDC Info'!$E$14","v":0},0,2021,2020,2014,{"$f":"'App.2-M_Regulatory_Costs'!B76","v":0},"One-Time",{"$f":"INDIRECT(\"'App.2-M_Regulatory_Costs'!C\" & MATCH(F62,'App.2-M_Regulatory_Costs'!$B:$B,0))","v":{"$error":"#N/A"}},{"$f":"INDIRECT(\"'App.2-M_Regulatory_Costs'!D\" & MATCH($F62,'App.2-M_Regulatory_Costs'!$B:$B,0))","v":{"$error":"#N/A"}},{"$f":"INDIRECT(\"'App.2-M_Regulatory_Costs'!E\" & MATCH($F62,'App.2-M_Regulatory_Costs'!$B:$B,0))","v":{"$error":"#N/A"}},{"$f":"INDIRECT(\"'App.2-M_Regulatory_Costs'!F\" & MATCH($F62,'App.2-M_Regulatory_Costs'!$B:$B,0))","v":{"$error":"#N/A"}},{"$f":"INDIRECT(\"'App.2-M_Regulatory_Costs'!G\" & MATCH($F62,'App.2-M_Regulatory_Costs'!$B:$B,0))","v":{"$error":"#N/A"}},{"$f":"INDIRECT(\"'App.2-M_Regulatory_Costs'!H\" & MATCH($F62,'App.2-M_Regulatory_Costs'!$B:$B,0))","v":{"$error":"#N/A"}},{"$f":"INDIRECT(\"'App.2-M_Regulatory_Costs'!I\" & MATCH($F62,'App.2-M_Regulatory_Costs'!$B:$B,0))","v":{"$error":"#N/A"}},{"$f":"INDIRECT(\"'App.2-M_Regulatory_Costs'!J\" & MATCH($F62,'App.2-M_Regulatory_Costs'!$B:$B,0))","v":{"$error":"#N/A"}},{"$f":"INDIRECT(\"'App.2-M_Regulatory_Costs'!K\" & MATCH($F62,'App.2-M_Regulatory_Costs'!$B:$B,0))","v":{"$error":"#N/A"}}]
[{"$f":"'LDC Info'!$E$14","v":0},0,2021,2020,2014,{"$f":"'App.2-M_Regulatory_Costs'!B77","v":"Sub-total - Ongoing Costs 2"},"One-Time",{"$f":"INDIRECT(\"'App.2-M_Regulatory_Costs'!C\" & MATCH(F63,'App.2-M_Regulatory_Costs'!$B:$B,0))","v":0},{"$f":"INDIRECT(\"'App.2-M_Regulatory_Costs'!D\" & MATCH($F63,'App.2-M_Regulatory_Costs'!$B:$B,0))","v":0},{"$f":"INDIRECT(\"'App.2-M_Regulatory_Costs'!E\" & MATCH($F63,'App.2-M_Regulatory_Costs'!$B:$B,0))","v":0},{"$f":"INDIRECT(\"'App.2-M_Regulatory_Costs'!F\" & MATCH($F63,'App.2-M_Regulatory_Costs'!$B:$B,0))","v":0},{"$f":"INDIRECT(\"'App.2-M_Regulatory_Costs'!G\" & MATCH($F63,'App.2-M_Regulatory_Costs'!$B:$B,0))","v":0},{"$f":"INDIRECT(\"'App.2-M_Regulatory_Costs'!H\" & MATCH($F63,'App.2-M_Regulatory_Costs'!$B:$B,0))","v":0},{"$f":"INDIRECT(\"'App.2-M_Regulatory_Costs'!I\" & MATCH($F63,'App.2-M_Regulatory_Costs'!$B:$B,0))","v":""},{"$f":"INDIRECT(\"'App.2-M_Regulatory_Costs'!J\" & MATCH($F63,'App.2-M_Regulatory_Costs'!$B:$B,0))","v":0},{"$f":"INDIRECT(\"'App.2-M_Regulatory_Costs'!K\" & MATCH($F63,'App.2-M_Regulatory_Costs'!$B:$B,0))","v":""}]
[{"$f":"'LDC Info'!$E$14","v":0},0,2021,2020,2014,{"$f":"'App.2-M_Regulatory_Costs'!B78","v":"Sub-total - One-time Costs 3"},"One-Time",{"$f":"INDIRECT(\"'App.2-M_Regulatory_Costs'!C\" & MATCH(F64,'App.2-M_Regulatory_Costs'!$B:$B,0))","v":0},{"$f":"INDIRECT(\"'App.2-M_Regulatory_Costs'!D\" & MATCH($F64,'App.2-M_Regulatory_Costs'!$B:$B,0))","v":0},{"$f":"INDIRECT(\"'App.2-M_Regulatory_Costs'!E\" & MATCH($F64,'App.2-M_Regulatory_Costs'!$B:$B,0))","v":0},{"$f":"INDIRECT(\"'App.2-M_Regulatory_Costs'!F\" & MATCH($F64,'App.2-M_Regulatory_Costs'!$B:$B,0))","v":0},{"$f":"INDIRECT(\"'App.2-M_Regulatory_Costs'!G\" & MATCH($F64,'App.2-M_Regulatory_Costs'!$B:$B,0))","v":0},{"$f":"INDIRECT(\"'App.2-M_Regulatory_Costs'!H\" & MATCH($F64,'App.2-M_Regulatory_Costs'!$B:$B,0))","v":0},{"$f":"INDIRECT(\"'App.2-M_Regulatory_Costs'!I\" & MATCH($F64,'App.2-M_Regulatory_Costs'!$B:$B,0))","v":""},{"$f":"INDIRECT(\"'App.2-M_Regulatory_Costs'!J\" & MATCH($F64,'App.2-M_Regulatory_Costs'!$B:$B,0))","v":0},{"$f":"INDIRECT(\"'App.2-M_Regulatory_Costs'!K\" & MATCH($F64,'App.2-M_Regulatory_Costs'!$B:$B,0))","v":""}]
[{"$f":"'LDC Info'!$E$14","v":0},0,2021,2020,2014,{"$f":"'App.2-M_Regulatory_Costs'!B79","v":"Total"},"One-Time",{"$f":"INDIRECT(\"'App.2-M_Regulatory_Costs'!C\" & MATCH(F65,'App.2-M_Regulatory_Costs'!$B:$B,0))","v":0},{"$f":"INDIRECT(\"'App.2-M_Regulatory_Costs'!D\" & MATCH($F65,'App.2-M_Regulatory_Costs'!$B:$B,0))","v":0},{"$f":"INDIRECT(\"'App.2-M_Regulatory_Costs'!E\" & MATCH($F65,'App.2-M_Regulatory_Costs'!$B:$B,0))","v":0},{"$f":"INDIRECT(\"'App.2-M_Regulatory_Costs'!F\" & MATCH($F65,'App.2-M_Regulatory_Costs'!$B:$B,0))","v":0},{"$f":"INDIRECT(\"'App.2-M_Regulatory_Costs'!G\" & MATCH($F65,'App.2-M_Regulatory_Costs'!$B:$B,0))","v":0},{"$f":"INDIRECT(\"'App.2-M_Regulatory_Costs'!H\" & MATCH($F65,'App.2-M_Regulatory_Costs'!$B:$B,0))","v":0},{"$f":"INDIRECT(\"'App.2-M_Regulatory_Costs'!I\" & MATCH($F65,'App.2-M_Regulatory_Costs'!$B:$B,0))","v":""},{"$f":"INDIRECT(\"'App.2-M_Regulatory_Costs'!J\" & MATCH($F65,'App.2-M_Regulatory_Costs'!$B:$B,0))","v":0},{"$f":"INDIRECT(\"'App.2-M_Regulatory_Costs'!K\" & MATCH($F65,'App.2-M_Regulatory_Costs'!$B:$B,0))","v":""}]

{"sheet":"Hidden_RegulatoryCosts2","index":40,"n_rows":2,"n_cols":6,"rows_kept":2,"cut":false,"hidden":true,"merged":[]}
["EB Number","Test Year","Bridge Year","Last Rebasing Year","One-Time COS Costs","Amortized Amount"]
[{"$f":"EBNUMBER","v":0},{"$f":"TestYear","v":2021},{"$f":"BridgeYear","v":2020},{"$f":"RebaseYear","v":2014},{"$f":"'App.2-M_Regulatory_Costs'!C82","v":0},{"$f":"'App.2-M_Regulatory_Costs'!C83","v":0}]

{"sheet":"App.2-N_Corp_Cost_Allocation","index":41,"n_rows":53,"n_cols":8,"rows_kept":53,"cut":false,"hidden":false,"merged":[[46,1,46,6],[49,1,49,6],[52,1,52,6],[13,1,13,6],[8,1,8,6],[9,1,9,6],[42,2,43,6],[16,1,17,1],[16,2,17,2],[15,3,17,3],[15,4,17,4],[15,1,15,2],[15,5,16,5],[15,6,16,6],[15,7,16,7],[29,1,29,2],[29,3,31,3],[29,4,31,4],[29,6,30,6],[29,5,30,5],[30,1,31,1],[30,2,31,2],[27,1,27,6]]}
[null,null,null,null,null,null,"File Number:",{"$f":"EBNUMBER","v":0}]
[null,null,null,null,null,null,"Exhibit:"]
[null,null,null,null,null,null,"Tab:"]
[null,null,null,null,null,null,"Schedule:"]
[null,null,null,null,null,null,"Page:"]
[]
[null,null,null,null,null,null,"Date:"]
[]
[null,"Appendix 2-N"]
[null,"Shared Services and Corporate Cost Allocation 1"]
[]
[null,null,"Year:"]
[]
[null,"Shared Services"]
[]
[null,"Name of Company",null,"Service Offered","Pricing Methodology","Price for the Service","Cost for the Service"]
[null,"From","To"]
[null,null,null,null,null,"$","$"]
[]
[]
[]
[]
[]
[]
[]
[]
[]
[null,"Corporate Cost Allocation"]
[]
[null,"Name of Company",null,"Service Offered","Pricing Methodology","% of Corporate Costs Allocated","Amount Allocated"]
[null,"From","To"]
[null,null,null,null,null,"%","$"]
[]
[]
[]
[]
[]
[]
[]
[]
[]
[null,"Note: "]
[null,1,"This appendix must be completed in relation to each service provided or received for the Historical (actuals), Bridge and Test years. The required information includes:"]
[]
[]
[null,"·         Type of Service:"]
[null,"Services such as billing, accounting, payroll, etc.  The applicant must identify any costs related to the Board of Directors of the parent company that are allocated to the applicant."]
[]
[null,"·         Pricing Methodology:"]
[null,"Pricing Methodology includes approaches such as cost-base, market-base, tendering, etc.  The applicant must provide evidence demonstrating the pricing methodology used.  The applicant must also provide a description of why that pricing methodology was chosen, whether or not it is in conformity with ARC, and why it is appropriate."]
[]
[null,"·         % Allocation:"]
[null,"The applicant must provide the percentage of the costs allocated to the entity for the service being offered.  The Applicant must also provide a description of the allocator and why it is an appropriate allocator."]

{"sheet":"App.2-OA Capital Structure","index":42,"n_rows":65,"n_cols":15,"rows_kept":65,"cut":false,"hidden":false,"merged":[[44,7,44,9],[9,2,9,14],[10,2,10,14],[16,0,17,0],[17,4,17,8],[14,7,14,9],[40,2,40,14],[12,0,12,14],[34,2,34,14],[35,2,35,14],[36,2,36,14],[37,2,37,14],[38,2,38,14],[39,2,39,14],[33,0,33,14],[46,0,47,0],[47,4,47,8],[63,0,63,14],[64,2,64,14],[70,2,70,14],[65,2,65,14],[66,2,66,14],[67,2,67,14],[68,2,68,14],[69,2,69,14]]}
[null,null,null,null,null,null,null,null,null,null,"File Number:",null,null,null,{"$f":"EBNUMBER","v":0}]
[null,null,null,null,null,null,null,null,null,null,"Exhibit:"]
[null,null,null,null,null,null,null,null,null,null,"Tab:"]
[null,null,null,null,null,null,null,null,null,null,"Schedule:"]
[null,null,null,null,null,null,null,null,null,null,"Page:"]
[]
[null,null,null,null,null,null,null,null,null,null,"Date:"]
[]
[]
[null,null,"Appendix 2-OA"]
[null,null,"Capital Structure and Cost of Capital"]
[]
["This table must be completed for the last OEB-approved year and the test year."]
[]
[null,null,null,null,null,null,"Test Year:"]
[]
["Line No."]
[null,null,"Particulars",null,"Capitalization Ratio",null,null,null,null,null,"Cost Rate",null,null,null,"Return"]
[]
[null,null,null,null,"(%)",null,null,null,"($)",null,"(%)",null,null,null,"($)"]
[null,null,"Debt"]
[1,null,"  Long-term Debt",null,null,null,null,null,{"$f":"$I$31*E22","v":0},null,null,null,null,null,{"$f":"K22*I22","v":0}]
[2,null,"  Short-term Debt",null,null,null,"(1)",null,{"$f":"$I$31*E23","v":0},null,null,null,null,null,{"$f":"K23*I23","v":0}]
[3,null,"Total Debt",null,{"$f":"SUM(E22:E23)","v":0},null,null,null,{"$f":"SUM(I22:I23)","v":0},null,{"$f":"IF(E24=0,0,SUMPRODUCT(E22:E23,K22:K23)/E24)","v":0},null,null,null,{"$f":"SUM(O22:O23)","v":0}]
[]
[null,null,"Equity"]
[4,null,"  Common Equity",null,null,null,null,null,{"$f":"$I$31*E27","v":0},null,null,null,null,null,{"$f":"K27*I27","v":0}]
[5,null,"  Preferred Shares",null,null,null,null,null,{"$f":"$I$31*E28","v":0},null,null,null,null,null,{"$f":"K28*I28","v":0}]
[6,null,"Total Equity",null,{"$f":"SUM(E27:E28)","v":0},null,null,null,{"$f":"SUM(I27:I28)","v":0},null,{"$f":"IF(E29=0,0,SUMPRODUCT(E27:E28,K27:K28)/E29)","v":0},null,null,null,{"$f":"SUM(O27:O28)","v":0}]
[]
[7,null,"Total",null,1,null,null,null,null,null,{"$f":"(K24*E24)+(K29*E29)","v":0},null,null,null,{"$f":"O24+O29","v":0}]
[]
[]
["Notes"]
["(1)",null,"4.0% unless an applicant has proposed or been approved for a different amount."]
[]
[]
[]
[]
[]
[]
[]
[]
[]
[null,null,null,null,null,null,"Last OEB-approved year:"]
[]
["Line No."]
[null,null,"Particulars",null,"Capitalization Ratio",null,null,null,null,null,"Cost Rate",null,null,null,"Return"]
[]
[null,null,null,null,"(%)",null,null,null,"($)",null,"(%)",null,null,null,"($)"]
[null,null,"Debt"]
[1,null,"  Long-term Debt",null,null,null,null,null,{"$f":"$I$31*E52","v":0},null,null,null,null,null,{"$f":"K52*I52","v":0}]
[2,null,"  Short-term Debt",null,null,null,"(1)",null,{"$f":"$I$31*E53","v":0},null,null,null,null,null,{"$f":"K53*I53","v":0}]
[3,null,"Total Debt",null,{"$f":"SUM(E52:E53)","v":0},null,null,null,{"$f":"SUM(I52:I53)","v":0},null,{"$f":"IF(E54=0,0,SUMPRODUCT(E52:E53,K52:K53)/E54)","v":0},null,null,null,{"$f":"SUM(O52:O53)","v":0}]
[]
[null,null,"Equity"]
[4,null,"  Common Equity",null,null,null,null,null,{"$f":"$I$31*E57","v":0},null,null,null,null,null,{"$f":"K57*I57","v":0}]
[5,null,"  Preferred Shares",null,null,null,null,null,{"$f":"$I$31*E58","v":0},null,null,null,null,null,{"$f":"K58*I58","v":0}]
[6,null,"Total Equity",null,{"$f":"SUM(E57:E58)","v":0},null,null,null,{"$f":"SUM(I57:I58)","v":0},null,{"$f":"IF(E59=0,0,SUMPRODUCT(E57:E58,K57:K58)/E59)","v":0},null,null,null,{"$f":"SUM(O57:O58)","v":0}]
[]
[7,null,"Total",null,1,null,null,null,null,null,{"$f":"(K54*E54)+(K59*E59)","v":0},null,null,null,{"$f":"O54+O59","v":0}]
[]
[]
["Notes"]
["(1)",null,"4.0% unless an applicant has proposed or been approved for a different amount."]

{"sheet":"App.2-OB_Debt Instruments","index":43,"n_rows":36,"n_cols":11,"rows_kept":36,"cut":false,"hidden":false,"merged":[[35,1,35,10],[9,0,9,10],[10,0,10,10],[10,11,10,14],[12,0,12,10],[34,1,34,10],[33,1,33,10]]}
[null,null,null,null,null,null,null,null,null,"File Number:",{"$f":"EBNUMBER","v":0}]
[null,null,null,null,null,null,null,null,null,"Exhibit:"]
[null,null,null,null,null,null,null,null,null,"Tab:"]
[null,null,null,null,null,null,null,null,null,"Schedule:"]
[null,null,null,null,null,null,null,null,null,"Page:"]
[]
[null,null,null,null,null,null,null,null,null,"Date:"]
[]
[]
["Appendix 2-OB"]
["Debt Instruments"]
[]
["This table must be completed for all required historical years, the bridge year and the test year."]
[null,null,null,"Year"]
[]
["Row","Description","Lender","Affiliated or Third-Party Debt?","Fixed or Variable-Rate?","Start Date","Term              (years)","Principal                         ($)","Rate (%) 2","Interest ($) 1","Additional Comments, if any"]
[1,null,null,null,null,null,null,null,null,{"$f":"H17*I17","v":0}]
[2,null,null,null,null,null,null,null,null,{"$f":"H18*I18","v":0}]
[3,null,null,null,null,null,null,null,null,0]
[4,null,null,null,null,null,null,null,null,0]
[5,null,null,null,null,null,null,null,null,0]
[6,null,null,null,null,null,null,null,null,{"$f":"H22*I22","v":0}]
[7,null,null,null,null,null,null,null,null,0]
[8,null,null,null,null,null,null,null,null,0]
[9,null,null,null,null,null,null,null,null,0]
[10,null,null,null,null,null,null,null,null,0]
[11,null,null,null,null,null,null,null,null,0]
[12,null,null,null,null,null,null,null,null,0]
[]
["Total",null,null,null,null,null,null,{"$f":"SUM(H17:H28)","v":0},{"$f":"IF(H30=0,\"\",J30/H30)","v":""},{"$f":"SUM(J17:J28)","v":0}]
[]
["Notes"]
[]
[1,"If financing is in place only part of the year, separately calculate the pro-rated interest in the year and input in the cell."]
[2,"Input actual or deemed long-term debt rate in accordance with the guidelines in The Report of the Board on the Cost of Capital for Ontario's Regulated Utilities, issued December 11, 2009, or with any subsequent update issued by the OEB."]
[3,"Add more lines above row 12 if necessary."]

{"sheet":"App.2-Q_Cost of Serv. Emb. Dx","index":44,"n_rows":60,"n_cols":7,"rows_kept":60,"cut":false,"hidden":false,"merged":[[8,0,8,6],[9,0,9,6],[15,0,15,1],[15,2,15,3],[53,3,54,3],[9,7,9,11],[12,0,12,6],[11,0,11,6],[58,3,59,3],[58,4,59,4],[53,4,54,4]]}
[null,null,null,null,null,"File Number:",{"$f":"EBNUMBER","v":0}]
[null,null,null,null,null,"Exhibit:"]
[null,null,null,null,null,"Tab:"]
[null,null,null,null,null,"Schedule:"]
[null,null,null,null,null,"Page:"]
[]
[null,null,null,null,null,"Date:"]
[]
["Appendix 2-Q"]
["Cost of Serving Embedded Distributor(s) "]
[]
["To be completed by Host Distributors ONLY"]
["(Not required if Host Distributor has an Embedded Distributor rate class, i.e. a separate row on Sheet 11 of the RRWF.)"]
[]
[]
["Proposed Rate Class for Billing Embedded Distributor(s)"]
[]
["Host's Distribution Facilities used by Embedded Distributor(s)"]
[]
["(1)","(2)","(3)","(4)","(5)","(6) = '(3) + (4)"]
["Asset Class","Total OM&A costs asociated with asset class ","Original cost of asset class ","Accumulated amortization of asset class","Annual amortization of asset class","Net Book Value of asset class"]
["Totals for Host Distributor:","($)","($)","($)","($)"]
["Distribution Stations",null,null,null,null,{"$f":"C23+D23","v":0}]
["Low Voltage Line",null,null,null,null,0]
["LV Line category # 2 (if applcable)",null,null,null,null,0]
["TS (owned by host)",null,null,null,null,0]
["add rows if necessary... ",null,null,null,null,0]
[null,null,null,null,null,0]
[null,null,null,null,null,0]
[]
["(1)","(7)","(8)","(9)","(10)","(11)"]
[{"$f":"A21","v":"Asset Class"},"Total line length or station capacity in asset class","Line length or capacity required to provide LV service to Embedded Distributor(s)","Annual total demand on station/line providing LV services (sum of 12 monthly peaks)","Annual billed Embedded Distributor demand on station/line providing LV services","Embedded Distributor(s)' Responsibility Share "]
["Embedded Distributor's share:","kW or kVa; km","kW or kVA; km","kW or kVA","kW or kVA","percent"]
["Distribution Stations",null,null,null,null,{"$f":"IF(D34=0,0,(C34/B34)*(E34/D34))","v":0}]
["Low Voltage Line",null,null,null,null,{"$f":"IF(D35=0,0,(C35/B35)*(E35/D35))","v":0}]
["LV Line # 2 (if applicable) ",null,null,null,null,{"$f":"IF(D36=0,0,(C36/B36)*(E36/D36))","v":0}]
["TS (owned by host)",null,null,null,null,{"$f":"IF(D37=0,0,(C37/B37)*(E37/D37))","v":0}]
["add rows if necessary ",null,null,null,null,{"$f":"IF(D38=0,0,(C38/B38)*(E38/D38))","v":0}]
[]
["(1)","(12)","(12a)","(13)","(14)","(15)","(16)"]
[{"$f":"A32","v":"Asset Class"},"Return on Assets used to Provide LV services","Taxes/PILs","Annual amortization on assets used to provide LV services","OM&A costs with burden associated with assets used to provide LV services","Total annual cost associated with assets used to provide LV services","Monthly cost associated with the delivery of LV services"]
[null,"($)","($)","($)","($)","($)","$/kW or $/kVA"]
["Distribution Stations",{"$f":"E$54*(F23+B23*E$59)*F34","v":0},{"$f":"(B43-(B$54*C$54*F34*(F23+B23*E57)+B$55*C$55*F34*(F23+B23*E$57)))*E$57/(1-E$57)","v":0},{"$f":"E23*F34","v":0},{"$f":"B23*F34","v":0},{"$f":"SUM(B43:E43)","v":0},{"$f":"IF(E34=0,0,(D43/E34))","v":0}]
["Low Voltage Line",{"$f":"E$54*(F24+B24*E$59)*F35","v":0},{"$f":"(B44-(B$54*C$54*F35*(F24+B24*E58)+B$55*C$55*F35*(F24+B24*E58)))*E$57/(1-E$57)","v":0},{"$f":"E24*F35","v":0},{"$f":"B24*F35","v":0},{"$f":"SUM(B44:E44)","v":0},{"$f":"IF(E35=0,0,(D44/E35))","v":0}]
["LV Line # 2 (if applicable) ",{"$f":"E$54*(F25+B25*E$59)*F36","v":0},{"$f":"(B45-(B$54*C$54*F36*(F25+B25*E59)+B$55*C$55*F36*(F25+B25*E$59)))*E$57/(1-E$57)","v":0},{"$f":"E25*F36","v":0},{"$f":"B25*F36","v":0},{"$f":"SUM(B45:E45)","v":0},{"$f":"IF(E36=0,0,(D45/E36))","v":0}]
["TS (owned by host)",{"$f":"E$54*(F26+B26*E$59)*F37","v":0},{"$f":"(B46-(B$54*C$54*F37*(F26+B26*E60)+B$55*C$55*F37*(F26+B26*E60)))*E$57/(1-E$57)","v":0},{"$f":"E26*F37","v":0},{"$f":"B26*F37","v":0},{"$f":"SUM(B46:E46)","v":0},{"$f":"IF(E37=0,0,(D46/E37))","v":0}]
["add rows if necessary ",{"$f":"E$54*(F27+B27*E$59)*F38","v":0},{"$f":"(B47-(B$54*C$54*F38*(F27+B27*I61)+B$55*C$55*F38*(F27+B27*I61)))*E$57/(1-E$57)","v":0},{"$f":"E27*F38","v":0},{"$f":"B27*F38","v":0},{"$f":"SUM(B47:E47)","v":0},{"$f":"IF(E38=0,0,(D47/E38))","v":0}]
[]
["Total",null,null,null,null,{"$f":"SUM(F43:F47)","v":0},{"$f":"SUM(G43:G47)","v":0}]
[]
["(17)","(18)","(19)","(20)","(21)"]
[null,"Capital Structure","Cost Rate"]
[null,"(%)","(%)",null,"(%)"]
["Long-Term Debt",null,null,"Weighted Average Cost of Capital",{"$f":"IF(B60=0%,0,SUMPRODUCT(B54:B58,C54:C58)/B60)","v":0}]
["Short-term Debt"]
[]
["Common Equity",null,null,"Tax/PILs Rate"]
["Preferred Shares"]
[null,null,null,"Working Capital Allowance Factor"]
["Total",{"$f":"SUM(B54:B58)","v":0}]

{"sheet":"App.2-R_Loss Factors","index":45,"n_rows":65,"n_cols":9,"rows_kept":65,"cut":false,"hidden":false,"merged":[[8,1,8,8],[9,1,9,8],[10,1,10,8],[12,1,13,2],[12,3,12,7],[12,8,13,8],[14,2,14,8],[23,2,23,8],[25,2,25,8],[52,2,53,8],[34,2,37,8],[41,2,43,8],[45,2,48,8],[55,2,56,8],[58,2,58,8],[30,2,32,8],[70,2,70,8],[62,2,62,8],[64,2,64,8],[50,2,50,8],[60,2,60,8]]}
[null,null,null,null,null,null,null,"File Number:",{"$f":"EBNUMBER","v":0}]
[null,null,null,null,null,null,null,"Exhibit:"]
[null,null,null,null,null,null,null,"Tab:"]
[null,null,null,null,null,null,null,"Schedule:"]
[null,null,null,null,null,null,null,"Page:"]
[]
[null,null,null,null,null,null,null,"Date:"]
[]
[null,"Appendix 2-R"]
[null,"Loss Factors"]
[]
[]
[null,null,null,"Historical Years",null,null,null,null,"5-Year Average"]
[null,null,null,{"$f":"IF(ISBLANK('LDC Info'!E26-5), \"Year 5\", 'LDC Info'!E26-5)","v":2015},{"$f":"IF(ISBLANK('LDC Info'!E26-4), \"Year 5\", 'LDC Info'!E26-4)","v":2016},{"$f":"IF(ISBLANK('LDC Info'!E26-3), \"Year 5\", 'LDC Info'!E26-3)","v":2017},{"$f":"IF(ISBLANK('LDC Info'!E26-2), \"Year 5\", 'LDC Info'!E26-2)","v":2018},{"$f":"IF(ISBLANK('LDC Info'!E26-1), \"Year 5\", 'LDC Info'!E26-1)","v":2019}]
[null,null,"Losses Within Distributor's System"]
[null,"A(1)","\"Wholesale\" kWh delivered to distributor (higher value)",null,null,null,null,null,{"$f":"IF(SUM(D16:H16)=0,0,AVERAGE(D16:H16))","v":0}]
[null,"A(2)","\"Wholesale\" kWh delivered to distributor (lower value)",null,null,null,null,null,{"$f":"IF(SUM(D17:H17)=0,0,AVERAGE(D17:H17))","v":0}]
[null,"B","Portion of \"Wholesale\" kWh delivered to distributor for its Large Use Customer(s)",null,null,null,null,null,{"$f":"IF(SUM(D18:H18)=0,0,AVERAGE(D18:H18))","v":0}]
[null,"C","Net \"Wholesale\" kWh delivered to distributor  = A(2) - B",{"$f":"D17-D18","v":0},0,0,0,0,0]
[null,"D","\"Retail\" kWh delivered by distributor",null,null,null,null,null,{"$f":"IF(SUM(D20:H20)=0,0,AVERAGE(D20:H20))","v":0}]
[null,"E","Portion of \"Retail\" kWh delivered by distributor to its Large Use Customer(s)",null,null,null,null,null,{"$f":"IF(SUM(D21:H21)=0,0,AVERAGE(D21:H21))","v":0}]
[null,"F","Net \"Retail\" kWh delivered by distributor = D - E",{"$f":"D20-D21","v":0},0,0,0,0,0]
[null,"G","Loss Factor in Distributor's system = C / F",{"$f":"IF(D22=0,\"\",D19/D22)","v":""},"","","","",""]
[null,null,"Losses Upstream of Distributor's System"]
[null,"H","Supply Facilities Loss Factor",null,null,null,null,null,{"$f":"IF(SUM(D25:H25)=0,0,AVERAGE(D25:H25))","v":0}]
[null,null,"Total Losses"]
[null,"I","Total Loss Factor = G x H",{"$f":"IF(D23=\"\",\"\",D23*D25)","v":""},"","","","",""]
[]
[null,"Notes:"]
[]
[null,"A(1)","If directly connected to the IESO-controlled grid, kWh pertains to the virtual meter on the primary or high voltage side of the transformer at the interface with the transmission grid.  This corresponds to the \"With Losses\" kWh value provided by the IESO's MV-WEB.  It is the higher of the two values provided by MV-WEB."]
[]
[]
[]
[null,null,"If fully embedded within a host distributor, kWh pertains to the virtual meter on the primary or high voltage side of the transformer, at the interface between the host distributor and the transmission grid.  For example, if the host distributor is Hydro One Networks Inc., kWh from the Hydro One Networks' invoice corresponding to \"Total kWh w Losses\" should be reported.  This corresponds to the higher of the two kWh values provided in Hydro One Networks' invoice."]
[]
[]
[]
[]
[null,null,"If partially embedded, kWh pertains to the sum of the above."]
[]
[null,"A(2)","If directly connected to the IESO-controlled grid, kWh pertains to a metering installation on the secondary or low voltage side of the transformer at the interface with the transmission grid.  This corresponds to the \"Without Losses\" kWh value provided by the IESO's MV-WEB.  It is the lower of the two kWh values provided by MV-WEB."]
[]
[]
[]
[null,null,"If fully embedded with the host distributor, kWh pertains to a metering installation on the secondary or low voltage side of the transformer at the interface between the embedded distributor and the host distributor.  For example, if the host distributor is Hydro One Networks Inc., kWh from the Hydro One Networks' invoice corresponding to \"Total kWh\" should be reported.  This corresponds to the lower of the two kWh values provided in Hydro One Networks' invoice."]
[]
[]
[]
[]
[null,null,"If partially embedded, kWh pertains to the sum of the above."]
[]
[null,null,"Additionally, kWh pertaining to distributed generation directly connected to the distributor's own distribution network should be included in A(2)."]
[]
[]
[null,"B","If a Large Use Customer is metered on the secondary or low voltage side of the transformer, the default loss is 1%                         (i.e., B = 1.01 X E). This value should not include supply facility losses. However, the total loss factor on the tariff of rate and charges and applied to customers consumption should include the supply facility loss factor."]
[]
[]
[null,"D","kWh corresponding to D should equal metered or estimated kWh at the customer’s delivery point."]
[]
[null,"E","Metered consumption of Large Use customers."]
[]
[null,"G and I","These loss factors pertain to secondary-metered customers with demand less than 5,000 kW."]
[]
[null,"H","Actual Supply Facility Loss Factor as calculated by dividing A(1) by A(2)."]

{"sheet":"App.2-ZA_Com. Exp. Forecast","index":46,"n_rows":65,"n_cols":12,"rows_kept":65,"cut":false,"hidden":false,"merged":[[40,6,40,11],[47,6,47,11],[3,1,5,8],[16,2,16,4],[17,2,17,4],[18,2,18,4],[19,2,19,4],[25,6,25,11]]}
[]
[null,null,null,null,null,null,null,null,null,null,"File Number:"]
[null,null,null,null,null,null,null,null,null,null,"Exhibit:"]
[null,"Commodity Expense ",null,null,null,null,null,null,null,null,"Tab:"]
[null,null,null,null,null,null,null,null,null,null,"Schedule:"]
[null,null,null,null,null,null,null,null,null,null,"Page:"]
[]
[null,null,null,null,null,null,null,null,null,null,"Date:"]
[]
[]
[]
["Step 1:","2021 Forecasted Commodity Prices"]
[]
[null," "]
[null,"Forecasted Commodity Prices"," Table 1: Average RPP Supply Cost Summary*",null,null,null,"non-RPP","RPP"]
[]
[null,"HOEP ($/MWh)","Load-Weighted Price for RPP Consumers",null,null,null,20.09,20.09]
[null,"Global Adjustment ($/MWh)","Impact of the Global Adjustment",null,null,null,106.94,106.94]
[null,"Adjustments ($/MWh)",null,null,null,null,null,1]
[null,"TOTAL ($/MWh)","Average Supply Cost for RPP Consumers",null,null,null,null,{"$f":"SUM(H17:H19)","v":128.03}]
[]
[]
["Step 2:","Commodity Expense"]
[null,"(volumes for the bridge and test year are loss adjusted)"]
[]
[null,"Commodity",null,null,null,null,"2021 Test Year"]
[null,"Customer",null,"Revenue","Expense"]
[null,"Class Name","UoM","USA #","USA #","Class A Non-RPP Volume**",null,"Class B Non-RPP Volume**","Class B RPP Volume**","Average HOEP","Average RPP Rate","Amount"]
[null,null,"kWh",4006,4705,null,null,null,null,{"$f":"+$G$17/1000","v":2.009E-2},{"$f":"+$H$20/1000","v":0.12803},{"$f":"(+F29+H29)*J29+(I29*K29)","v":0}]
[null,null,"kWh",4010,4705,null,null,null,null,2.009E-2,0.12803,0]
[null,null,"kWh",4035,4705,null,null,null,null,2.009E-2,0.12803,0]
[null,null,"kWh",4010,4705,null,null,null,null,2.009E-2,0.12803,0]
[null,null,"kWh",4025,4705,null,null,null,null,2.009E-2,0.12803,0]
[null,null,"kWh",4025,4705,null,null,null,null,2.009E-2,0.12803,0]
[null,null,"kWh",4025,4705,null,null,null,null,2.009E-2,0.12803,0]
[null,null,"kWh",4025,4705,null,null,null,null,2.009E-2,0.12803,0]
[null,null,"kWh",4025,4705,null,null,null,null,2.009E-2,0.12803,0]
[null,"TOTAL",null,null,null,null,null,null,null,null,null,{"$f":"SUM(L29:L37)","v":0}]
[]
[]
[null,"Class A - non-RPP Global Adjustment",null,null,null,null,{"$f":"G26","v":"2021 Test Year"}]
[null,"Customer",null,"Revenue","Expense",null,"kWh Volume",null,null,null,"Hist. Avg GA/kWh ***","Amount"]
[null,null,null,4035,4707,null,null,null,null,null,null,{"$f":"+K43*G43","v":0}]
[null,null,null,4010,4707,null,null,null,null,null,null,{"$f":"+K44*G44","v":0}]
[null,null,null,4010,4707,null,null,null,null,null,null,{"$f":"+K45*G45","v":0}]
[null,null,null,null,null,{"$f":"+F43+F44","v":0},{"$f":"SUM(G43:G45)","v":0},null,null,null,null,{"$f":"SUM(L43:L45)","v":0}]
[]
[null,"Class B - non-RPP Global Adjustment",null,null,null,null,{"$f":"G41","v":"2021 Test Year"}]
[null,"Customer",null,"Revenue","Expense",null,null,null,null,null,null,"Amount"]
[null,"Class Name","UoM","USA #","USA #",null,null,"Class B Non-RPP Volume",null,null,"GA Rate/kWh"]
[null,{"$f":"IF(B29=0,\"\",B29)","v":""},"kWh",4006,4707,null,null,{"$f":"+H29","v":0},null,null,{"$f":"+$G$18/1000","v":0.10693999999999999},{"$f":"+K51*H51","v":0}]
[null,{"$f":"IF(B30=0,\"\",B30)","v":""},"kWh",4010,4707,null,null,{"$f":"+H30","v":0},null,null,0.10693999999999999,0]
[null,"","kWh",4035,4707,null,null,0,null,null,0.10693999999999999,0]
[null,"","kWh",4010,4707,null,null,0,null,null,0.10693999999999999,0]
[null,"","kWh",4025,4707,null,null,0,null,null,0.10693999999999999,0]
[null,"","kWh",4025,4707,null,null,0,null,null,0.10693999999999999,0]
[null,"","kWh",4025,4707,null,null,0,null,null,0.10693999999999999,{"$f":"K57*H57","v":0}]
[null,"","kWh",4025,4707,null,null,0,null,null,0.10693999999999999,{"$f":"K58*H58","v":0}]
[null,"Total Volume",null,null,null,null,null,{"$f":"SUM(H51:H58)","v":0}]
[null,"TOTAL",null,null,null,null,null,null,null,null,null,{"$f":"SUM(L51:L58)","v":0}]
[]
[]
["*Regulated Price Plan Prices for the Period November 1, 2019 – October 31, 2020"]
["** Enter 2021 load forecast data by class based on the most recent 12-month historic Class A and Class B RPP/Non-RPP proportions"]
["*** Based on average $ GA per kWh billed to class A customers for most recent 12-month historical year."]

{"sheet":"App.2-ZB_Cost of Power","index":47,"n_rows":152,"n_cols":12,"rows_kept":152,"cut":false,"hidden":false,"merged":[[130,10,131,10],[142,3,142,4],[117,10,123,10],[128,1,129,1],[128,3,129,3],[128,4,129,4],[128,5,129,5],[128,7,129,7],[128,8,129,8],[128,9,129,9],[128,10,129,10],[104,10,110,10],[115,1,116,1],[115,3,116,3],[115,4,116,4],[115,5,116,5],[115,7,116,7],[115,8,116,8],[115,9,116,9],[115,10,116,10],[91,10,97,10],[102,1,103,1],[102,3,103,3],[102,4,103,4],[102,5,103,5],[102,7,103,7],[102,8,103,8],[102,9,103,9],[102,10,103,10],[78,10,84,10],[89,1,90,1],[89,3,90,3],[89,4,90,4],[89,5,90,5],[89,7,90,7],[89,8,90,8],[89,9,90,9],[89,10,90,10],[65,10,71,10],[76,1,77,1],[76,3,77,3],[76,4,77,4],[76,5,77,5],[76,7,77,7],[76,8,77,8],[76,9,77,9],[76,10,77,10],[52,10,58,10],[63,1,64,1],[63,3,64,3],[63,4,64,4],[63,5,64,5],[63,7,64,7],[63,8,64,8],[63,9,64,9],[63,10,64,10],[38,10,44,10],[50,1,51,1],[50,3,51,3],[50,4,51,4],[50,5,51,5],[50,7,51,7],[50,8,51,8],[50,9,51,9],[50,10,51,10],[25,10,31,10],[36,1,37,1],[36,3,37,3],[36,4,37,4],[36,5,37,5],[36,7,37,7],[36,8,37,8],[36,9,37,9],[36,10,37,10],[11,10,18,10],[22,8,22,9],[23,1,24,1],[23,3,24,3],[23,4,24,4],[23,5,24,5],[23,7,24,7],[23,8,24,8],[23,9,24,9],[23,10,24,10],[10,1,11,1],[0,0,0,9],[8,4,8,5],[8,8,8,9],[9,4,9,5],[9,8,9,9]]}
["Cost of Power Calculation"]
[null,null,null,null,null,null,null,null,null,"File Number:"]
[null,null,null,null,null,null,null,null,null,"Exhibit:"]
[null,null,null,null,null,null,null,null,null,"Tab:"]
[null,null,null,null,null,null,null,null,null,"Schedule:"]
["1. Volumns for Electricity Commodity and Global Adjustment non-RPP in kWh",null,null,null,null,null,null,null,null,"Page:"]
["2. All Volume should be loss adjusted with the exception of:"]
["  - Volume for Electricity Commodity, Wholesale Market Services, Class A and B should loss adjusted less WMP",null,null,null,null,null,null,null,null,"Date:"]
["  - Low Voltage Charges - No loss adjustment for kWh"]
[null,null,null,"2021 Test Year","RPP",null,null,{"$f":"D10","v":"2021 Test Year"},"non-RPP",null,"Total"]
["Electricity Commodity","Units",null,"Volume","Rate","$ ",null,"Volume","Rate","$ ","$"]
["Class per Load Forecast",null,null,null,null,{"$f":"D12*E12","v":0}]
[{"$f":"IF('App.2-ZA_Com. Exp. Forecast'!B51=0,\"\",'App.2-ZA_Com. Exp. Forecast'!B29)","v":0},null,null,{"$f":"'App.2-ZA_Com. Exp. Forecast'!I29","v":0},null,{"$f":"D13*'App.2-ZA_Com. Exp. Forecast'!K29","v":0},null,{"$f":"'App.2-ZA_Com. Exp. Forecast'!F29+'App.2-ZA_Com. Exp. Forecast'!H29","v":0},null,{"$f":"H13*'App.2-ZA_Com. Exp. Forecast'!J29","v":0}]
[{"$f":"IF('App.2-ZA_Com. Exp. Forecast'!B52=0,\"\",'App.2-ZA_Com. Exp. Forecast'!B30)","v":0},null,null,{"$f":"'App.2-ZA_Com. Exp. Forecast'!I30","v":0},null,{"$f":"D14*'App.2-ZA_Com. Exp. Forecast'!K30","v":0},null,{"$f":"'App.2-ZA_Com. Exp. Forecast'!F30+'App.2-ZA_Com. Exp. Forecast'!H30","v":0},null,{"$f":"H14*'App.2-ZA_Com. Exp. Forecast'!J30","v":0}]
[{"$f":"IF('App.2-ZA_Com. Exp. Forecast'!B53=0,\"\",'App.2-ZA_Com. Exp. Forecast'!B31)","v":0},null,null,{"$f":"'App.2-ZA_Com. Exp. Forecast'!I31","v":0},null,{"$f":"D15*'App.2-ZA_Com. Exp. Forecast'!K31","v":0},null,{"$f":"'App.2-ZA_Com. Exp. Forecast'!F31+'App.2-ZA_Com. Exp. Forecast'!H31","v":0},null,{"$f":"H15*'App.2-ZA_Com. Exp. Forecast'!J31","v":0}]
[{"$f":"IF('App.2-ZA_Com. Exp. Forecast'!B54=0,\"\",'App.2-ZA_Com. Exp. Forecast'!B32)","v":0},null,null,{"$f":"'App.2-ZA_Com. Exp. Forecast'!I32","v":0},null,{"$f":"D16*'App.2-ZA_Com. Exp. Forecast'!K32","v":0},null,{"$f":"'App.2-ZA_Com. Exp. Forecast'!F32+'App.2-ZA_Com. Exp. Forecast'!H32","v":0},null,{"$f":"H16*'App.2-ZA_Com. Exp. Forecast'!J32","v":0}]
[{"$f":"IF('App.2-ZA_Com. Exp. Forecast'!B55=0,\"\",'App.2-ZA_Com. Exp. Forecast'!B33)","v":0},null,null,{"$f":"'App.2-ZA_Com. Exp. Forecast'!I33","v":0},null,{"$f":"D17*'App.2-ZA_Com. Exp. Forecast'!K33","v":0},null,{"$f":"'App.2-ZA_Com. Exp. Forecast'!F33+'App.2-ZA_Com. Exp. Forecast'!H33","v":0},null,{"$f":"H17*'App.2-ZA_Com. Exp. Forecast'!J33","v":0}]
[{"$f":"IF('App.2-ZA_Com. Exp. Forecast'!B56=0,\"\",'App.2-ZA_Com. Exp. Forecast'!B34)","v":0},null,null,{"$f":"'App.2-ZA_Com. Exp. Forecast'!I34","v":0},null,{"$f":"D18*'App.2-ZA_Com. Exp. Forecast'!K34","v":0},null,{"$f":"'App.2-ZA_Com. Exp. Forecast'!F34+'App.2-ZA_Com. Exp. Forecast'!H34","v":0},null,{"$f":"H18*'App.2-ZA_Com. Exp. Forecast'!J34","v":0}]
[{"$f":"IF('App.2-ZA_Com. Exp. Forecast'!B57=0,\"\",'App.2-ZA_Com. Exp. Forecast'!B35)","v":0},null,null,{"$f":"'App.2-ZA_Com. Exp. Forecast'!I35","v":0},null,{"$f":"D19*'App.2-ZA_Com. Exp. Forecast'!K35","v":0},null,{"$f":"'App.2-ZA_Com. Exp. Forecast'!F35+'App.2-ZA_Com. Exp. Forecast'!H35","v":0},null,{"$f":"H19*'App.2-ZA_Com. Exp. Forecast'!J35","v":0}]
[{"$f":"IF('App.2-ZA_Com. Exp. Forecast'!B58=0,\"\",'App.2-ZA_Com. Exp. Forecast'!B36)","v":0},null,null,{"$f":"'App.2-ZA_Com. Exp. Forecast'!I36","v":0},null,{"$f":"D20*'App.2-ZA_Com. Exp. Forecast'!K36","v":0},null,{"$f":"'App.2-ZA_Com. Exp. Forecast'!F36+'App.2-ZA_Com. Exp. Forecast'!H36","v":0},null,{"$f":"H20*'App.2-ZA_Com. Exp. Forecast'!J36","v":0}]
[{"$f":"IF('App.2-ZA_Com. Exp. Forecast'!B59=0,\"\",'App.2-ZA_Com. Exp. Forecast'!B37)","v":0},null,null,{"$f":"'App.2-ZA_Com. Exp. Forecast'!I37","v":0},null,{"$f":"D21*'App.2-ZA_Com. Exp. Forecast'!K37","v":0},null,{"$f":"'App.2-ZA_Com. Exp. Forecast'!F37+'App.2-ZA_Com. Exp. Forecast'!H37","v":0},null,{"$f":"H21*'App.2-ZA_Com. Exp. Forecast'!J37","v":0}]
["SUB-TOTAL",null,null,{"$f":"SUM(D13:D19)","v":0},null,{"$f":"SUM(F13:F20)","v":0},null,{"$f":"SUM(H13:H19)","v":0},null,{"$f":"SUM(J13:J20)","v":0},{"$f":"F22+J22","v":0},"OK"]
[]
["Global Adjustment non-RPP","Units",null,"Volume","Rate","$ ",null,"Volume","Rate","$ ","Total"]
["Class per Load Forecast "]
[{"$f":"IF(A13=0,\"\",A13)","v":""},null,null,null,null,{"$f":"D26*E26","v":0}]
["",null,null,null,null,{"$f":"D27*E27","v":0}]
["",null,null,null,null,0]
["",null,null,null,null,0]
["",null,null,null,null,0]
["",null,null,null,null,0]
["",null,null,null,null,0]
["",null,null,null,null,0]
["",null,null,null,null,0]
["SUB-TOTAL",null,null,{"$f":"SUM(D26:D32)","v":0},null,{"$f":"SUM(F26:F34)","v":0},null,null,null,{"$f":"SUM(J26:J34)","v":0},{"$f":"F35+J35","v":0},"OK"]
[]
["Transmission - Network","Units",null," Volume","Rate","$ ",null,"Volume","Rate","$ ","Total"]
["Class per Load Forecast "]
[{"$f":"IF(A26=0,\"\",A26)","v":""},null,null,null,null,{"$f":"D39*E39","v":0},null,null,null,{"$f":"H39*I39","v":0}]
["",null,null,null,null,{"$f":"D40*E40","v":0},null,null,null,{"$f":"H40*I40","v":0}]
["",null,null,null,null,0,null,null,null,0]
["",null,null,null,null,0,null,null,null,0]
["",null,null,null,null,0,null,null,null,0]
["",null,null,null,null,0,null,null,null,0]
["",null,null,null,null,0,null,null,null,0]
["",null,null,null,null,0,null,null,null,0]
["",null,null,null,null,0,null,null,null,0]
[null,null,null,null,null,0,null,null,null,0]
["SUB-TOTAL",null,null,null,null,{"$f":"SUM(F39:F48)","v":0},null,null,null,{"$f":"SUM(J39:J48)","v":0},{"$f":"F49+J49","v":0}]
[]
["Transmission - Connection","Units",null,"Volume","Rate","$ ",null,"Volume","Rate","$ ","Total"]
["Class per Load Forecast "]
[{"$f":"IF(A39=0,\"\",A39)","v":""},null,null,null,null,{"$f":"D53*E53","v":0},null,null,null,{"$f":"H53*I53","v":0}]
["",null,null,null,null,{"$f":"D54*E54","v":0},null,null,null,{"$f":"H54*I54","v":0}]
["",null,null,null,null,0,null,null,null,0]
["",null,null,null,null,0,null,null,null,0]
["",null,null,null,null,0,null,null,null,0]
["",null,null,null,null,0,null,null,null,0]
["",null,null,null,null,0,null,null,null,0]
["",null,null,null,null,0,null,null,null,0]
["",null,null,null,null,0,null,null,null,0]
["SUB-TOTAL",null,null,null,null,{"$f":"SUM(F53:F61)","v":0},null,null,null,{"$f":"SUM(J53:J61)","v":0},{"$f":"F62+J62","v":0}]
[]
["Wholesale Market Service","Units",null," Volume","Rate","$ ",null,"Volume","Rate","$ ","Total"]
["Class per Load Forecast "]
[{"$f":"IF(A53=0,\"\",A53)","v":""},null,null,null,null,{"$f":"D66*E66","v":0},null,null,null,{"$f":"H66*I66","v":0}]
["",null,null,null,null,{"$f":"D67*E67","v":0},null,null,null,{"$f":"H67*I67","v":0}]
["",null,null,null,null,0,null,null,null,0]
["",null,null,null,null,0,null,null,null,0]
["",null,null,null,null,0,null,null,null,0]
["",null,null,null,null,0,null,null,null,0]
["",null,null,null,null,0,null,null,null,0]
["",null,null,null,null,0,null,null,null,0]
["",null,null,null,null,0,null,null,null,0]
["SUB-TOTAL",null,null,null,null,{"$f":"SUM(F66:F74)","v":0},null,null,null,{"$f":"SUM(J66:J74)","v":0},{"$f":"F75+J75","v":0}]
[]
["Class A CBR ","Units",null," Volume","Rate","$ ",null,"Volume","Rate4","$ ","Total"]
["Class per Load Forecast "]
[{"$f":"IF(A66=0,\"\",A66)","v":""},null,null,null,null,{"$f":"D79*E79","v":0},null,null,null,{"$f":"H79*I79","v":0}]
["",null,null,null,null,{"$f":"D80*E80","v":0},null,null,null,{"$f":"H80*I80","v":0}]
["",null,null,null,null,0,null,null,null,0]
["",null,null,null,null,0,null,null,null,0]
["",null,null,null,null,0,null,null,null,0]
["",null,null,null,null,0,null,null,null,0]
["",null,null,null,null,0,null,null,null,0]
["",null,null,null,null,0,null,null,null,0]
["",null,null,null,null,0,null,null,null,0]
["SUB-TOTAL",null,null,null,null,{"$f":"SUM(F79:F87)","v":0},null,null,null,{"$f":"SUM(J79:J87)","v":0},{"$f":"F88+J88","v":0}]
[]
["Class B CBR ","Units",null," Volume","Rate","$ ",null,"Volume","Rate","$ ","Total"]
["Class per Load Forecast "]
[{"$f":"IF(A79=0,\"\",A79)","v":""},null,null,null,null,{"$f":"D92*E92","v":0},null,null,null,{"$f":"H92*I92","v":0}]
["",null,null,null,null,{"$f":"D93*E93","v":0},null,null,null,{"$f":"H93*I93","v":0}]
["",null,null,null,null,0,null,null,null,0]
["",null,null,null,null,0,null,null,null,0]
["",null,null,null,null,0,null,null,null,0]
["",null,null,null,null,0,null,null,null,0]
["",null,null,null,null,0,null,null,null,0]
["",null,null,null,null,0,null,null,null,0]
["",null,null,null,null,0,null,null,null,0]
["SUB-TOTAL",null,null,null,null,{"$f":"SUM(F92:F100)","v":0},null,null,null,{"$f":"SUM(J92:J100)","v":0},{"$f":"F101+J101","v":0}]
[]
["RRRP","Units",null," Volume","Rate","$ ",null,"Volume","Rate","$ ","Total"]
["Class per Load Forecast "]
[{"$f":"IF(A66=0,\"\",A66)","v":""},null,null,null,null,{"$f":"D105*E105","v":0},null,null,null,{"$f":"H105*I105","v":0}]
["",null,null,null,null,{"$f":"D106*E106","v":0},null,null,null,{"$f":"H106*I106","v":0}]
["",null,null,null,null,0,null,null,null,0]
["",null,null,null,null,0,null,null,null,0]
["",null,null,null,null,0,null,null,null,0]
["",null,null,null,null,0,null,null,null,0]
["",null,null,null,null,0,null,null,null,0]
["",null,null,null,null,0,null,null,null,0]
["",null,null,null,null,0,null,null,null,0]
["SUB-TOTAL",null,null,null,null,{"$f":"SUM(F105:F113)","v":0},null,null,null,{"$f":"SUM(J105:J113)","v":0},{"$f":"F114+J114","v":0}]
[]
["Low Voltage - No TLF adjustment","Units",null,"Volume","Rate","$ ",null,"Volume","Rate","$ ","Total"]
["Class per Load Forecast "]
[{"$f":"IF(A105=0,\"\",A105)","v":""},null,null,null,null,{"$f":"D118*E118","v":0},null,null,null,{"$f":"H118*I118","v":0}]
["",null,null,null,null,{"$f":"D119*E119","v":0},null,null,null,{"$f":"H119*I119","v":0}]
["",null,null,null,null,0,null,null,null,0]
["",null,null,null,null,0,null,null,null,0]
["",null,null,null,null,0,null,null,null,0]
["",null,null,null,null,0,null,null,null,0]
["",null,null,null,null,0,null,null,null,0]
["",null,null,null,null,0,null,null,null,0]
["",null,null,null,null,0,null,null,null,0]
["SUB-TOTAL",null,null,null,null,{"$f":"SUM(F118:F126)","v":0},null,null,null,{"$f":"SUM(J118:J126)","v":0},{"$f":"F127+J127","v":0}]
[]
["Smart Meter Entity Charge",null,null,"Customers","Rate","$ ",null,"Customers","Rate","$ ","Total"]
["Class per Load Forecast "]
[null,null,null,null,null,{"$f":"D131*E131*12","v":0},null,null,null,{"$f":"H131*I131*12","v":0}]
[null,null,null,null,null,{"$f":"D132*E132*12","v":0},null,null,null,{"$f":"H132*I132*12","v":0}]
[null,null,null,null,null,{"$f":"D133*E133*12","v":0},null,null,null,{"$f":"H133*I133*12","v":0}]
["SUB-TOTAL",null,null,null,null,{"$f":"SUM(F131:F133)","v":0},null,null,null,{"$f":"SUM(J131:J133)","v":0},{"$f":"F134+J134","v":0}]
[]
["SUB- TOTAL",null,null,null,null,{"$f":"SUM(F22+F49+F62+F75+F101+F114+F127+F134)","v":0},null,null,null,{"$f":"SUM(J22+J35+J49+J62+J75+J88+J101+J114+J127+J134)","v":0},{"$f":"+F136+J136","v":0}]
["OER CREDIT3",0.318,null,null,null,{"$f":"-F136*B137","v":0},null,null,null,0,{"$f":"+F137+J137","v":0}]
["TOTAL",null,null,null,null,{"$f":"+F136+F137","v":0},null,null,null,{"$f":"+J136+J137","v":0},{"$f":"+K136+K137","v":0}]
[]
["3.The OER Credit of 31.8% will only apply to RPP proportion of the listed components. Impacts on distribution charges are excluded for the purpose of calculating the cost of power. "]
["4. Class A CBR: use the average CBR per kWh, similar to how the Class A GA cost is calculated. A Class A customer is a customer who participate in the ICI, pays global adjustment (GA) based on their percentage contribution to the top five peak Ontario demand hours over a 12-month period"]
[]
[null,null,null,{"$f":"D10 & \" - Cop\"","v":"2021 Test Year - Cop"}]
[null,null,null,"4705 -Power Purchased",{"$f":"K22","v":0}]
[null,null,null,"4707- Global Adjustment",{"$f":"K35","v":0}]
[null,null,null,"4708-Charges-WMS",{"$f":"(K75+K88+K101+K114)","v":0}]
[null,null,null,"4714-Charges-NW",{"$f":"K49","v":0}]
[null,null,null,"4716-Charges-CN",{"$f":"K62","v":0}]
[null,null,null,"4750-Charges-LV",{"$f":"K127","v":0}]
[null,null,null,"4751-IESO SME",{"$f":"K134","v":0}]
[null,null,null,"Misc A/R or A/P",{"$f":"+K137","v":0}]
[null,null,null,"TOTAL",{"$f":"SUM(E144:E151)","v":0}]

{"sheet":"App.2-S_Stranded Meters","index":48,"n_rows":96,"n_cols":8,"rows_kept":96,"cut":false,"hidden":true,"merged":[[95,0,98,7],[88,1,90,7],[92,1,93,7],[73,1,74,7],[80,1,82,7],[84,1,86,7],[76,1,78,7],[66,2,68,7],[70,0,71,7],[41,1,42,7],[44,1,46,7],[48,1,51,7],[53,1,56,7],[61,2,64,7],[8,0,8,7],[9,0,9,7],[33,0,36,7],[38,0,39,7],[58,2,59,7]]}
[null,null,null,null,null,null,"File Number:",{"$f":"EBNUMBER","v":0}]
[null,null,null,null,null,null,"Exhibit:"]
[null,null,null,null,null,null,"Tab:"]
[null,null,null,null,null,null,"Schedule:"]
[null,null,null,null,null,null,"Page:"]
[]
[null,null,null,null,null,null,"Date:"]
[]
["Appendix 2-S"]
["Stranded Meter Treatment"]
[]
["Year","Notes","Gross Asset Value","Accumulated Amortization","Contributed Capital (Net of Amortization)","Net Asset","Proceeds on Disposition","Residual Net Book Value"]
[null,null,"(A)","(B)","(C)","(D ) = (A) - (B) - (C)","(E)","(F) = (D) - (E)"]
[2006,null,null,null,null,{"$f":"C14-D14-E14","v":0},null,{"$f":"F14-G14","v":0}]
[2007,null,null,null,null,0,null,0]
[2008,null,null,null,null,0,null,0]
[2009,null,null,null,null,0,null,0]
[2010,null,null,null,null,0,null,0]
[2011,null,null,null,null,0,null,0]
[2012,null,null,null,null,0,null,0]
[2013,null,null,null,null,{"$f":"C21-D21-E21","v":0},null,{"$f":"F21-G21","v":0}]
[2014,null,null,null,null,{"$f":"C22-D22-E22","v":0},null,{"$f":"F22-G22","v":0}]
[2015,null,null,null,null,{"$f":"C23-D23-E23","v":0},null,{"$f":"F23-G23","v":0}]
[2016,null,null,null,null,{"$f":"C24-D24-E24","v":0},null,{"$f":"F24-G24","v":0}]
[2017,null,null,null,null,{"$f":"C25-D25-E25","v":0},null,{"$f":"F25-G25","v":0}]
[2018,"(1)",null,null,null,0,null,0]
[2019,null,null,null,null,{"$f":"C27-D27-E27","v":0},null,{"$f":"F27-G27","v":0}]
[2020,null,null,null,null,{"$f":"C28-D28-E28","v":0},null,{"$f":"F28-G28","v":0}]
[]
["Notes:"]
[]
["(1)","For 2018, please indicate whether the amounts provided are on a forecast or actual basis."]
[]
["Some distributors have transferred the cost of stranded meters from Account 1860 - Meters to \"Sub-account Stranded Meter Costs of Account 1555\", while in some cases distributors have left these costs in Account 1860.  Depending on which treatment the applicant has chosen. please provide the information under either of the two scenarios (A and B below), as applicable."]
[]
[]
[]
[]
["Scenario A:  If the stranded meter costs were transferred to \"Sub-account Stranded Meter Costs\" of Account 1555, the above table should be completed and the following information should be provided in Exhibit 9."]
[]
[]
[1,"A description of the accounting treatment followed by the applicant on stranded meter costs for financial accounting and reporting purposes."]
[]
[]
[2,"The amount of the pooled residual net book value of the removed from service stranded meters, less any contributed capital (net of accumulated amortization), and less any net proceeds from sales, which were transferred to this sub-account as of December 31, 2010."]
[]
[]
[]
[3,"A statement as to whether or not, since transferring the removed stranded meter costs to the sub-account, the recording of depreciation expenses was continued in order to reduce the net book value through accumulated depreciation.  If so, the total depreciation expense amount for the period from the time the costs for the stranded meters were transferred to the sub-account to December 31, 2010 should be provided."]
[]
[]
[]
[]
[null,"If no depreciation expenses were recorded to reduce the net book value of stranded meter costs through accumulated depreciation, the total depreciation expense amount that would have been applicable from the time that the stranded meter costs were transferred to the sub-account of Account 1555 to December 31, 2010 should be provided.  In addition, the following information should be provided:"]
[]
[]
[]
[]
[null,"a)","Whether or not carrying charges were recorded for the stranded meter cost balances in the sub-account, and if so, the total carrying charges recorded to December 31, 2010."]
[]
[]
[null,"b)","The estimated amount of the pooled residual net book value of the removed from service meters, less any net proceeds from sales and contributed capital, at the time when the smart meters will have been fully deployed (e.g., as of December 31, 2010).  If the smart meters have been fully deployed, the actual amount should be provided."]
[]
[]
[]
[]
[null,"c)","A description as to how the applicant intends to recover in rates the remaining costs for stranded meters, including the proposed accounting treatment, the proposed disposition period, and the associated bill impacts."]
[]
[]
[]
["Scenario B:  If the stranded meter costs remained recorded in Account 1860, the above table should be completed and the following information should be provided in Exhibit 9:"]
[]
[]
[1,"A description of the accounting treatment followed by the applicant on stranded meter costs for financial accounting and reporting purposes."]
[]
[]
[2,"The amount of the pooled residual net book value of the removed from service stranded meters, less any contributed capital (net of accumulated amortization), and less any net proceeds from sales, as of December 31, 2010."]
[]
[]
[]
[3,"A statement as to whether or not the recording of depreciation expenses continued in order to reduce the net book value through accumulated depreciation.  If so, provision of the total (cumulative) depreciation expense for the period from the time that the meters became stranded to December 31, 2010."]
[]
[]
[]
[4,"If no depreciation expenses were recorded to reduce the net book value of stranded meters through accumulated depreciation, the total (cumulative) depreciation expense amount that would have been applicable for the period from the time that the meters became stranded to December 31, 2010."]
[]
[]
[]
[5,"The estimated amount of the pooled residual net book value of the removed from service meters, less any net proceeds from sales and contributed capital, at the time when smart meters will have been fully deployed.  If the smart meters have been fully deployed, please provide the actual amount."]
[]
[]
[]
[6,"A description as to how the applicant intends to recover in rates the costs for stranded meters, including the proposed accounting treatment, the proposed disposition period and the associated bill impacts."]
[]
[]
["Distributors should also provide the Net Book Value per class of meter as of December 31, 2010 as well as the number of meters that were removed / stranded.  In preparing this information, distributors should review the OEB's letter of January 16, 2007 Stranded Meter Costs Related to the Installation of Smart Meters which stated that records were to be kept of the type and number of each meter to support the stranded meter costs."]

{"sheet":"App.2-Y_MIFRS Summary Impacts","index":49,"n_rows":37,"n_cols":9,"rows_kept":37,"cut":false,"hidden":true,"merged":[[36,0,36,8],[29,0,29,2],[29,6,29,8],[30,0,30,2],[30,6,30,8],[31,0,31,2],[31,6,31,8],[32,0,32,2],[32,6,32,8],[33,0,33,2],[33,6,33,8],[34,0,34,2],[34,6,34,8],[26,0,26,2],[26,6,26,8],[27,0,27,2],[27,6,27,8],[28,0,28,2],[28,6,28,8],[23,0,23,2],[23,6,23,8],[24,0,24,2],[24,6,24,8],[25,0,25,2],[25,6,25,8],[20,0,20,2],[20,6,20,8],[21,0,21,2],[21,6,21,8],[22,0,22,2],[22,3,22,5],[22,6,22,8],[17,0,17,2],[17,6,17,8],[18,0,18,2],[18,6,18,8],[19,0,19,2],[19,6,19,8],[8,0,8,8],[9,0,9,8],[10,0,10,8],[14,0,16,2],[14,6,14,8],[15,6,15,8]]}
[null,null,null,null,null,null,null,"File Number:",{"$f":"EBNUMBER","v":0}]
[null,null,null,null,null,null,null,"Exhibit:"]
[null,null,null,null,null,null,null,"Tab:"]
[null,null,null,null,null,null,null,"Schedule:"]
[null,null,null,null,null,null,null,"Page:"]
[]
[null,null,null,null,null,null,null,"Date:"]
[]
["Appendix 2-Y"]
["Summary of Impacts to Revenue Requirement"]
["from Transition to MIFRS"]
[]
[]
[]
["Revenue Requirement Component",null,null,{"$f":"TestYear","v":2021},{"$f":"TestYear","v":2021},"Difference","Reasons why the revenue requirement "]
[null,null,null,"MIFRS","CGAAP 1",null,"component is different under MIFRS"]
[]
["Closing NBV 2017",null,null,null,null,{"$f":"+D18-E18","v":0}]
["Closing NBV 2018",null,null,null,null,{"$f":"+D19-E19","v":0}]
["Average NBV",null,null,{"$f":"(D18+D19)/2","v":0},{"$f":"(E18+E19)/2","v":0},{"$f":"+D20-E20","v":0}]
["Working Capital",null,null,null,null,{"$f":"+D21-E21","v":0}]
["Rate Base",null,null,{"$f":"SUM(D20:D21)","v":0},{"$f":"SUM(E20:E21)","v":0},{"$f":"+D22-E22","v":0}]
[null,null,null,null,null,{"$f":"+D23-E23","v":0}]
["Return on Rate Base",null,null,null,null,0]
[null,null,null,null,null,0]
["OM&A",null,null,null,null,0]
["Depreciation",null,null,null,null,0]
["PILs or Income Taxes",null,null,null,null,0]
[null,null,null,null,null,0]
["Less: Revenue Offsets",null,null,null,null,0]
[null,null,null,null,null,0]
[null,null,null,null,null,0]
[null,null,null,null,null,0]
["Insert description of additional item(s) and new rows if needed.",null,null,null,null,0]
["Total Base Revenue Requirement",null,null,{"$f":"SUM(D24:D34)","v":0},{"$f":"SUM(E24:E34)","v":0},{"$f":"SUM(F24:F34)","v":0}]
[]
["1.  Applicants must provide a summary of the dollar impacts of MIFRS to each component of the revenue requirement (e.g. rate base, operating costs, etc.), including the overall impact on the proposed revenue requirement.  Accordingly, the applicants must identify financial differences and resulting revenue requirement impacts arising from the adoption of  MIFRS as compared to CGAAP.  If the applicant is reflecting the changes in capitalization and depreciation policies for the first time in a rebasing application, then the comparison in the above table should be between MIFRS and CGAAP before the change in accounting policies. If the applicant changed capitalization and depreciation policies and reflected these changes in a previous rebasing application, the comparison in the above table should be between MIFRS and CGAAP after the change in accounting policies.  "]

{"sheet":"Sheet19","index":50,"n_rows":72,"n_cols":9,"rows_kept":72,"cut":false,"hidden":true,"merged":[]}
[null,"CGAAP","CGAAP","CGAAP","MIFRS","USGAAP","ASPE","ASPE","ASPE"]
[null,"N/A",2012,2013,null,null,"N/A",2012,2013]
["LDC Info","x","x","x","x","x","x","x","x"]
["Table of Contents","x","x","x","x","x","x","x","x"]
["COS Flowchart","x","x","x","x","x","x","x","x"]
["List of Key References","x","x","x","x","x","x","x","x"]
["App.2-AA_Capital Projects","x","x","x","x","x","x","x","x"]
["App.2-AB_Capital Expenditures","x","x","x","x","x","x","x","x"]
["App.2-BA1_Fix Asset Cont.CGAAP","x","x","x","n","x","x","x","x"]
["App.2-BA2_Fix Asset Cont.MIFRS","n","n","n","x","n","n","n","n"]
["Appendix 2-BB Service Life Comp","x","x","x","x","x","x","x","x"]
["Instruction for App. 2-C MIFRS","n","n","n","x","n","n","n","n"]
["App.2-CA_CGAAP_DepExp_2011","n","n","n","x","n","n","n","n"]
["App.2-CB_MIFRS_DepExp_2011","n","n","n","x","n","n","n","n"]
["App.2-CC_MIFRS_DepExp_2012","n","n","n","x","n","n","n","n"]
["App.2-CD_MIFRS_DepExp_2013","n","n","n","x","n","n","n","n"]
["App.2-CE_MIFRS_DepExp_2014","n","n","n","x","n","n","n","n"]
["App.2-CF_CGAAP_DepExp_2012","n","n","n","x","n","n","n","n"]
["App.2-CG_MIFRS_DepExp_2012","n","n","n","x","n","n","n","n"]
["App.2-CH_MIFRS_DepExp_2013","n","n","n","x","n","n","n","n"]
["App.2-CI_MIFRS_DepExp_2014","n","n","n","x","n","n","n","n"]
["App.2-CJ_CGAAP_DepExp_2012","n","n","n","x","n","n","n","n"]
["App.2-CK_CGAAP_DepExp_2013","n","n","n","x","n","n","n","n"]
["App.2-CL_MIFRS_DepExp_2013","n","n","n","x","n","n","n","n"]
["App.2-CM_MIFRS_DepExp_2014","n","n","n","x","n","n","n","n"]
["Instruction for App. 2-C CGAAP","x","x","x","n","n","x","x","x"]
["App.2-CN_OldCGAAP_DepExp_2012","x","x","n","n","n","x","x","n"]
["App.2-CO_NewCGAAP_DepExp_2012","x","x","n","n","n","x","x","n"]
["App.2-CP_NewCGAAP_DepExp_2013","x","x","n","n","n","x","x","n"]
["App.2-CQ NewCGAAP_DepExp_2014","x","x","n","n","n","x","x","n"]
["App.2-CR_OldCGAAP_DepExp_2012","x","n","x","n","n","x","n","x"]
["App.2-CS_OldCGAAP_DepExp_2013","x","n","x","n","n","x","n","x"]
["App.2-CT_NewCGAAP_DepExp_2013","x","n","x","n","n","x","n","x"]
["App.2-CU_NewCGAAP_DepExp_2014","x","n","x","n","n","x","n","x"]
["App.2-CV_USGAAP_DepExp","n","n","n","n","x","n","n","n"]
["App.2-DA_Overhead","n","n","n","x","n","n","n","n"]
["App.2-DB_Overhead","x","x","x","n","n","x","x","x"]
["App.2-EA_PP&E Deferral Account","n","n","n","x","x","n","n","n"]
["App.2-EB_PP&E Deferral Account","n","n","n","x","x","n","n","n"]
["App.2-EC_PP&E Deferral Account","n","n","n","x","x","n","n","n"]
["App.2-ED_Account 1576 (2012)","x","x","n","x","x","x","x","n"]
["App.2-EE_Account 1576 (2013)","x","n","x","x","x","x","n","x"]
["App.2-FA Proposed REG Invest.","o","o","o","o","o","o","o","o"]
["App.2-FB Calc of REG Improvemnt","o","o","o","o","o","o","o","o"]
["App.2-FC Calc of REG Expansion","o","o","o","o","o","o","o","o"]
["App.2-G SQI","x","x","x","x","x","x","x","x"]
["App.2-H_Other_Oper_Rev","x","x","x","x","x","x","x","x"]
["App.2-I LF_CDM_WF","x","x","x","x","x","x","x","x"]
["App.2-JA_OM&A_Summary_Analys","x","x","x","x","x","x","x","x"]
["App.2-JB_OM&A_Cost _Drivers","x","x","x","x","x","x","x","x"]
["App.2-JC_OMA Programs","x","x","x","x","x","x","x","x"]
["App.2-K_Employee Costs","x","x","x","x","x","x","x","x"]
["App.2-L_OM&A_per_Cust_FTEE","x","x","x","x","x","x","x","x"]
["App.2-M_Regulatory_Costs","x","x","x","x","x","x","x","x"]
["App.2-N_Corp_Cost_Allocation","x","x","x","x","x","x","x","x"]
["App.2-OA Capital Structure","x","x","x","x","x","x","x","x"]
["App.2-OB_Debt Instruments","x","x","x","x","x","x","x","x"]
["App.2-P_Cost_Allocation","x","x","x","x","x","x","x","x"]
["App.2-Q_Cost of Serv. Emb. Dx","e","e","e","e","e","e","e","e"]
["App.2-R_Loss Factors","x","x","x","x","x","x","x","x"]
["App.2-S_Stranded Meters","x","x","x","x","x","x","x","x"]
["App.2-TA_1592_Tax_Variance","x","x","x","x","x","x","x","x"]
["App.2-TB_1592_HST-OVAT","x","x","x","x","x","x","x","x"]
["App.2-U_IFRS Transition Costs","x","x","x","x","x","x","x","x"]
["App.2-V_Rev_Reconciliation","x","x","x","x","x","x","x","x"]
["App.2-W_Bill Impacts","x","x","x","x","x","x","x","x"]
["App.2-YA_MIFRS Summary Impacts","n","n","n","x","n","n","n","n"]
["App. 2-YB_CGAAP Summary Impacts","x","x","x","n","n","x","x","x"]
["App. 2-Z_Tariff","x","x","x","x","x","x","x","x"]
["lists","n","n","n","n","n","n","n","n"]
["lists2","n","n","n","n","n","n","n","n"]
["Sheet19","n","n","n","n","n","n","n","n"]

{"sheet":"App.2-YA_IFRS Transition Costs","index":51,"n_rows":34,"n_cols":15,"rows_kept":34,"cut":false,"hidden":true,"merged":[[32,1,32,4],[32,5,32,6],[31,1,31,14],[33,1,33,14],[39,0,42,0],[39,1,42,3],[44,0,45,0],[44,1,45,3],[33,0,34,0],[36,0,37,0],[36,1,37,3],[28,0,28,2],[17,0,17,2],[18,0,18,2],[19,0,19,2],[20,0,20,2],[21,0,21,2],[22,0,22,2],[23,0,23,2],[24,0,24,2],[25,0,25,2],[26,0,26,2],[27,0,27,2],[8,0,8,16],[9,0,9,16],[11,0,11,14],[13,11,14,11],[13,14,15,14],[16,0,16,2],[13,0,15,2],[13,13,15,13],[13,10,14,10],[13,12,15,12]]}
[]
[null,null,null,null,null,null,null,null,null,null,null,null,null,"File Number:",{"$f":"EBNUMBER","v":0}]
[null,null,null,null,null,null,null,null,null,null,null,null,null,"Exhibit:"]
[null,null,null,null,null,null,null,null,null,null,null,null,null,"Tab:"]
[null,null,null,null,null,null,null,null,null,null,null,null,null,"Schedule:"]
[null,null,null,null,null,null,null,null,null,null,null,null,null,"Page:"]
[]
[null,null,null,null,null,null,null,null,null,null,null,null,null,"Date:"]
["Appendix 2-YA"]
["One-Time Incremental IFRS Transition Costs"]
[]
["The following table should be completed based on the information requested below. An explanation should be provided for any blank entries.  The entries should include one-time incremental IFRS transition costs that are currently included in Account 1508, Other Regulatory Assets, sub-account Deferred IFRS Transition Costs Account, or Account 1508, Other Regulatory Assets, sub-account IFRS Transition Costs Variance Account."]
[]
["Nature of One-Time Incremental IFRS Transition Costs 1",null,null,null,"Audited Actual Costs Incurred","Audited Actual Costs Incurred","Audited Actual Costs Incurred","Audited Actual Costs Incurred","Audited Actual Costs Incurred","Audited Carrying Charges ","Forecasted Costs ","Forecasted Costs ","Carrying Charges January 1, 2017 to December 31, 2017 or April 30, 2017 (As appropriate)","Total Costs and Carrying Charges","Reasons why the costs recorded meet the criteria of one-time IFRS administrative incremental costs"]
[]
[null,null,null,null,2012,2013,2014,2015,"2016 3","To December 31, 2016","2017 3","2018 3"]
["Professional accounting fees",null,null,null,null,null,null,null,null,null,null,null,null,{"$f":"SUM(E17:M17)","v":0}]
["Professional legal fees",null,null,null,null,null,null,null,null,null,null,null,null,0]
["Salaries, wages and benefits of staff added to support the transition to IFRS",null,null,null,null,null,null,null,null,null,null,null,null,0]
["Associated staff training and development costs",null,null,null,null,null,null,null,null,null,null,null,null,0]
["Costs related to system upgrades, or replacements or changes where IFRS was the major reason for conversion",null,null,null,null,null,null,null,null,null,null,null,null,0]
[null,null,null,null,null,null,null,null,null,null,null,null,null,0]
[null,null,null,null,null,null,null,null,null,null,null,null,null,0]
[null,null,null,null,null,null,null,null,null,null,null,null,null,0]
[null,null,null,null,null,null,null,null,null,null,null,null,null,0]
["Amounts, if any, included in previous Board approved rates (amounts should be negative) 2",null,null,null,null,null,null,null,null,null,null,null,null,0]
[null,null,null,null,null,null,null,null,null,null,null,null,null,0]
["Insert description of additional item(s) and new rows if needed.",null,null,null,null,null,null,null,null,null,null,null,null,0]
["Total",null,null,null,{"$f":"SUM(E17:E28)","v":0},0,null,{"$f":"SUM(H17:H28)","v":0},null,0,null,0,null,{"$f":"SUM(N17:N28)","v":0}]
[]
["Note:"]
[1,"The Deferred IFRS Transition Costs Account and the IFRS Transition Costs Variance Account are exclusively for necessary, incremental transition costs and shall not include ongoing IFRS compliance costs or impacts arising from adopting accounting policy changes that reflect changes in the timing of the recognition of income. The incremental costs in these accounts shall not include costs related to system upgrades, or replacements or changes where IFRS was not the major reason for conversion. In addition, incremental IFRS costs shall not include capital assets or expenditures."]
[2,"If there were any amounts approved in previous Board approved rates, please state the EB #:"]
[3,"Any forecasted One-time costs past 2015 should be fully explained in the application, since distributors were required to adopt IFRS or an alternative accounting standard by January 1, 2015."]

{"sheet":"Sheet1","index":52,"n_rows":0,"n_cols":0,"rows_kept":0,"cut":false,"hidden":true,"merged":[]}