{"text_format":"1","workbook":"xlsx","n_sheets":10,"sheets":["Overview","Project Inputs","Capital Cont Inputs","Standard Inputs","Prelim Calc","NPV Calc","Standard Report","Report After Cont $k","True-up Report","Menus"],"not_rendered":{"charts":0,"images":1,"macros":1,"external_links":1,"defined_names":65,"comments":0,"pivot_tables":0},"unopened":[],"bounds":{"document_bytes":16777216,"sheet_cells":100000,"rows_first":2000,"rows_last":500,"rows_between":2000,"halvings":0,"cell_chars":16384,"cell_head_chars":4096},"cells_cut":0,"cells_raw":0,"read":"whole","date_system":"1900"}

{"sheet":"Overview","index":0,"n_rows":5,"n_cols":2,"rows_kept":5,"cut":false,"hidden":false,"merged":[[5,1,5,3]]}
[]
[]
[null,"Hydro One Transmission Contribution Model"]
[null,"Holland TS 5 Year True Up - Transformation"]
[null,"NewMarket Hydro"]

{"sheet":"Project Inputs","index":1,"n_rows":82,"n_cols":27,"rows_kept":82,"cut":false,"hidden":false,"merged":[[37,2,37,11],[48,2,48,11],[54,2,54,11],[60,2,60,11],[4,1,4,3],[27,2,27,11],[8,1,8,6],[22,1,22,6],[20,2,20,9],[10,1,10,6],[12,1,12,6]]}
["A: PROJECT INFORMATION"]
[]
["To reset all user inputs, please click here:"]
[]
["Analysis prepared by:","Hydro One"]
[]
["Plan Number:"]
[]
["Project name:",{"$f":"'[1]Input - Proj Info'!$I$13","v":"Holland TS"}]
[]
["Description:","Capital Contribution, Transformation Pool, Newmarket Hydro"]
[]
["Customer:","Newmarket Hydro"]
[]
["Project in-service date:","2009-05-01"]
[]
["Type of Project:","Transformation"]
[]
["Customer Risk Classification","Low","Evaluation period (years):",null,{"$f":"VLOOKUP('Project Inputs'!B19,Menus!D12:E15,MATCH(C19,Menus!D11:E11,0),0)","v":25}]
[]
["Alternate evaluation period (enter in years)",null,{"$f":"IF('Project Inputs'!B21>E19,\"Warning - please select an alternate horizon that is less than the standard horizon of \"&E19&\" years.\",\"Check: ok\")","v":"Check: ok"}]
[]
["Rationale for selected economic evaluation period:","Customer is a LDC"]
[]
[]
["B: STAGE INFORMATION"]
[]
["Current stage of economic evaluation:","1st true-up",{"$f":"IF(OR(AND('Project Inputs'!B19=\"Low\",OR('Project Inputs'!B28=\"4th true-up\",'Project Inputs'!B28=\"5th true-up\")),AND('Project Inputs'!B19=\"Medium-low\",OR('Project Inputs'!B28=\"4th true-up\",'Project Inputs'!B28=\"5th true-up\")),AND('Project Inputs'!B19=\"Medium-high\",OR('Project Inputs'!B28=\"4th true-up\",'Project Inputs'!B28=\"5th true-up\"))),\"A true-up stage has been selected that does not exist for the selected customer risk classification. Please review the inputs.\",\"Check: ok\")","v":"Check: ok"}]
[]
[]
["C: UP-FRONT COSTS:"]
[]
[{"$f":"'Standard Inputs'!A29","v":"Land costs"},{"$f":"'Capital Cont Inputs'!B15","v":2009}]
["Enter total up-front capital costs ($k):",297.31681180957543]
[]
[]
[{"$f":"'Standard Inputs'!A30","v":"Class 47 costs"},{"$f":"'Capital Cont Inputs'!B15","v":2009}]
["Enter total up-front capital costs (excluding AFUDC & OH - $k):",8781.1587536461029,{"$f":"IF(AND(SUM(B38:B40)<>0,ISBLANK('Standard Inputs'!C30)),\"Error - Decision Support has not assigned a class of asset for this input. Remove any inputs within this section\",\"Check: ok\")","v":"Check: ok"}]
["Enter Overhead - $k"]
["Enter AFUDC - $k"]
[]
[]
["Removal costs",{"$f":"'Capital Cont Inputs'!B15","v":2009}]
["Enter Cash Flows (excluding OH - $k):"]
["Enter Overhead - $k"]
[]
[]
[{"$f":"'Standard Inputs'!A31","v":"Decision Support defined costs (1)"},{"$f":"'Capital Cont Inputs'!B15","v":2009}]
["Enter total up-front capital costs (excluding AFUDC & OH - $k):",null,{"$f":"IF(AND(SUM(B49:B51)<>0,ISBLANK('Standard Inputs'!C31)),\"Error - Decision Support has not assigned a class of asset for this input. Remove any inputs within this section\",\"Check: ok\")","v":"Check: ok"}]
["Enter Overhead - $k"]
["Enter AFUDC - $k"]
[]
[]
[{"$f":"'Standard Inputs'!A32","v":"Decision Support defined costs (2)"},{"$f":"'Capital Cont Inputs'!B15","v":2009}]
["Enter total up-front capital costs (excluding AFUDC & OH - $k):",null,{"$f":"IF(AND(SUM(B55:B57)<>0,ISBLANK('Standard Inputs'!C32)),\"Error - Decision Support has not assigned a class of asset for this input. Remove any inputs within this section\",\"Check: ok\")","v":"Check: ok"}]
["Enter Overhead - $k"]
["Enter AFUDC - $k"]
[]
[]
[{"$f":"'Standard Inputs'!A33","v":"Decision Support defined costs (3)"},{"$f":"'Capital Cont Inputs'!B15","v":2009}]
["Enter total up-front capital costs (excluding AFUDC & OH - $k):",null,{"$f":"IF(AND(SUM(B61:B63)<>0,ISBLANK('Standard Inputs'!C33)),\"Error - Decision Support has not assigned a class of asset for this input. Remove any inputs within this section\",\"Check: ok\")","v":"Check: ok"}]
["Enter Overhead - $k"]
["Enter AFUDC - $k"]
[]
[]
[]
["D: INCREMENTAL OM&A:"]
[]
[null,null,{"$f":"'Capital Cont Inputs'!C15","v":2010},{"$f":"'Capital Cont Inputs'!D15","v":2011},{"$f":"'Capital Cont Inputs'!E15","v":2012},{"$f":"'Capital Cont Inputs'!F15","v":2013},{"$f":"'Capital Cont Inputs'!G15","v":2014},{"$f":"'Capital Cont Inputs'!H15","v":2015},{"$f":"'Capital Cont Inputs'!I15","v":2016},{"$f":"'Capital Cont Inputs'!J15","v":2017},{"$f":"'Capital Cont Inputs'!K15","v":2018},{"$f":"'Capital Cont Inputs'!L15","v":2019},{"$f":"'Capital Cont Inputs'!M15","v":2020},{"$f":"'Capital Cont Inputs'!N15","v":2021},{"$f":"'Capital Cont Inputs'!O15","v":2022},{"$f":"'Capital Cont Inputs'!P15","v":2023},{"$f":"'Capital Cont Inputs'!Q15","v":2024},{"$f":"'Capital Cont Inputs'!R15","v":2025},{"$f":"'Capital Cont Inputs'!S15","v":2026},{"$f":"'Capital Cont Inputs'!T15","v":2027},{"$f":"'Capital Cont Inputs'!U15","v":2028},{"$f":"'Capital Cont Inputs'!V15","v":2029},{"$f":"'Capital Cont Inputs'!W15","v":2030},{"$f":"'Capital Cont Inputs'!X15","v":2031},{"$f":"'Capital Cont Inputs'!Y15","v":2032},{"$f":"'Capital Cont Inputs'!Z15","v":2033},{"$f":"'Capital Cont Inputs'!AA15","v":2034}]
["OM&A input - $k",null,42,42,42,42,42,42,42,42,42,42,42,42,42,42,42,65,65,65,65,65,65,65,65,65,65]
[]
[]
["E: LOAD INPUTS:"]
[]
["Is this load based on calendar or project year?","Project Year"]
["Has the load been load factor adjusted?","Yes","Enter PLI adj",{"$f":"[1]!Load_Adjustment_Factor","v":0.81}]
[]
[null,{"$f":"IF($B$75=\"Project Year\",\"Project Year Ended\",$B$75)","v":"Project Year Ended"},{"$f":"B78","v":"Project Year Ended"},"Project Year Ended","Project Year Ended","Project Year Ended","Project Year Ended","Project Year Ended","Project Year Ended","Project Year Ended","Project Year Ended","Project Year Ended","Project Year Ended","Project Year Ended","Project Year Ended","Project Year Ended","Project Year Ended","Project Year Ended","Project Year Ended","Project Year Ended","Project Year Ended","Project Year Ended","Project Year Ended","Project Year Ended","Project Year Ended","Project Year Ended","Project Year Ended"]
[null,{"$f":"IF(B75=\"Calendar Year\",'Capital Cont Inputs'!B15,\"\")","v":""},{"$f":"'Capital Cont Inputs'!C15","v":2010},{"$f":"'Capital Cont Inputs'!D15","v":2011},{"$f":"'Capital Cont Inputs'!E15","v":2012},{"$f":"'Capital Cont Inputs'!F15","v":2013},{"$f":"'Capital Cont Inputs'!G15","v":2014},{"$f":"'Capital Cont Inputs'!H15","v":2015},{"$f":"'Capital Cont Inputs'!I15","v":2016},{"$f":"'Capital Cont Inputs'!J15","v":2017},{"$f":"'Capital Cont Inputs'!K15","v":2018},{"$f":"'Capital Cont Inputs'!L15","v":2019},{"$f":"'Capital Cont Inputs'!M15","v":2020},{"$f":"'Capital Cont Inputs'!N15","v":2021},{"$f":"'Capital Cont Inputs'!O15","v":2022},{"$f":"'Capital Cont Inputs'!P15","v":2023},{"$f":"'Capital Cont Inputs'!Q15","v":2024},{"$f":"'Capital Cont Inputs'!R15","v":2025},{"$f":"'Capital Cont Inputs'!S15","v":2026},{"$f":"'Capital Cont Inputs'!T15","v":2027},{"$f":"'Capital Cont Inputs'!U15","v":2028},{"$f":"'Capital Cont Inputs'!V15","v":2029},{"$f":"'Capital Cont Inputs'!W15","v":2030},{"$f":"'Capital Cont Inputs'!X15","v":2031},{"$f":"'Capital Cont Inputs'!Y15","v":2032},{"$f":"'Capital Cont Inputs'!Z15","v":2033},{"$f":"'Capital Cont Inputs'!AA15","v":2034}]
["Actual/Forecasted Load",{"$f":"C80","v":"Actual"},{"$f":"IF('Capital Cont Inputs'!B8<'Project Inputs'!C79,\"Forecast\",\"Actual\")","v":"Actual"},{"$f":"IF('Capital Cont Inputs'!B8<'Project Inputs'!D79,\"Forecast\",\"Actual\")","v":"Actual"},{"$f":"IF('Capital Cont Inputs'!B8<'Project Inputs'!E79,\"Forecast\",\"Actual\")","v":"Actual"},{"$f":"IF('Capital Cont Inputs'!B8<'Project Inputs'!F79,\"Forecast\",\"Actual\")","v":"Actual"},{"$f":"IF('Capital Cont Inputs'!B8<'Project Inputs'!G79,\"Forecast\",\"Actual\")","v":"Actual"},{"$f":"IF('Capital Cont Inputs'!B8<'Project Inputs'!H79,\"Forecast\",\"Actual\")","v":"Forecast"},{"$f":"IF('Capital Cont Inputs'!B8<'Project Inputs'!I79,\"Forecast\",\"Actual\")","v":"Forecast"},{"$f":"IF('Capital Cont Inputs'!B8<'Project Inputs'!J79,\"Forecast\",\"Actual\")","v":"Forecast"},{"$f":"IF('Capital Cont Inputs'!B8<'Project Inputs'!K79,\"Forecast\",\"Actual\")","v":"Forecast"},{"$f":"IF('Capital Cont Inputs'!B8<'Project Inputs'!L79,\"Forecast\",\"Actual\")","v":"Forecast"},{"$f":"IF('Capital Cont Inputs'!B8<'Project Inputs'!M79,\"Forecast\",\"Actual\")","v":"Forecast"},{"$f":"IF('Capital Cont Inputs'!B8<'Project Inputs'!N79,\"Forecast\",\"Actual\")","v":"Forecast"},{"$f":"IF('Capital Cont Inputs'!B8<'Project Inputs'!O79,\"Forecast\",\"Actual\")","v":"Forecast"},{"$f":"IF('Capital Cont Inputs'!B8<'Project Inputs'!P79,\"Forecast\",\"Actual\")","v":"Forecast"},{"$f":"IF('Capital Cont Inputs'!B8<'Project Inputs'!Q79,\"Forecast\",\"Actual\")","v":"Forecast"},{"$f":"IF('Capital Cont Inputs'!B8<'Project Inputs'!R79,\"Forecast\",\"Actual\")","v":"Forecast"},{"$f":"IF('Capital Cont Inputs'!B8<'Project Inputs'!S79,\"Forecast\",\"Actual\")","v":"Forecast"},{"$f":"IF('Capital Cont Inputs'!B8<'Project Inputs'!T79,\"Forecast\",\"Actual\")","v":"Forecast"},{"$f":"IF('Capital Cont Inputs'!B8<'Project Inputs'!U79,\"Forecast\",\"Actual\")","v":"Forecast"},{"$f":"IF('Capital Cont Inputs'!B8<'Project Inputs'!V79,\"Forecast\",\"Actual\")","v":"Forecast"},{"$f":"IF('Capital Cont Inputs'!B8<'Project Inputs'!W79,\"Forecast\",\"Actual\")","v":"Forecast"},{"$f":"IF('Capital Cont Inputs'!B8<'Project Inputs'!X79,\"Forecast\",\"Actual\")","v":"Forecast"},{"$f":"IF('Capital Cont Inputs'!B8<'Project Inputs'!Y79,\"Forecast\",\"Actual\")","v":"Forecast"},{"$f":"IF('Capital Cont Inputs'!B8<'Project Inputs'!Z79,\"Forecast\",\"Actual\")","v":"Forecast"},{"$f":"IF('Capital Cont Inputs'!B8<'Project Inputs'!AA79,\"Forecast\",\"Actual\")","v":"Forecast"}]
["Enter Load data by Year (MW) ",{"$f":"'[1]Input - Proj Info'!I119","v":34.308935578702211},0,2.230416666666649,0,0,5.1048333333333247,14.174999999999997,16.766999999999996,19.359000000000009,21.950999999999993,24.705000000000013,27.459000000000003,28.188000000000017,28.836000000000013,29.564999999999998,30.294000000000011,31.023000000000025,31.751999999999981,32.480999999999995,33.210000000000008,33.939000000000021,34.668000000000006,35.396999999999991,36.126000000000005,36.855000000000018,37.664999999999992]
["Enter Load adjustments (MW)"]

{"sheet":"Capital Cont Inputs","index":2,"n_rows":59,"n_cols":54,"rows_kept":59,"cut":false,"hidden":false,"merged":[[31,0,31,2],[15,28,15,53],[11,1,11,10],[12,1,12,10],[51,3,51,8]]}
["SUMMARY OF CAPITAL CONTRIBUTIONS & ECONOMIC EVALUATION PERIOD"]
[]
["Summary of Key Dates:"]
["In-service year",{"$f":"YEAR('Project Inputs'!B15)","v":2009}]
["Duration of Economic Evaluation",{"$f":"IF(ISNUMBER('Project Inputs'!B21),'Project Inputs'!B21,'Project Inputs'!E19)","v":25},{"$f":"\"Based on \"&'Project Inputs'!B19&\" \"&'Project Inputs'!A19&IF(ISNUMBER('Project Inputs'!B21),\" with alternate evaluation period of \"&'Project Inputs'!B21&\" years.\",\".\")","v":"Based on Low Customer Risk Classification."}]
[]
[null,"Year","Stage"]
["Current Stage Data",{"$f":"VLOOKUP('Project Inputs'!B19&\" - \"&'Project Inputs'!B28,'Standard Inputs'!$A$52:$F$84,MATCH('Standard Inputs'!$F$52,'Standard Inputs'!$A$52:$F$52,0),0)","v":2014},{"$f":"'Project Inputs'!B28","v":"1st true-up"}]
[]
["End of Economic Evaluation",{"$f":"B4+B5","v":2034}]
[]
["Economic Evaluation Period by Year:",{"$f":"IF(ISNUMBER(AlternateEvaluationYears),\"Warning - an alternate evaluation period has been selected. This could result in an incorrect economic horizon schedule below. Please consult with your Decision Support contact.\",\"Check: ok\")","v":"Check: ok"}]
[null,{"$f":"IF(SUM('Standard Inputs'!C53:C84)<>0,\"Warning - an alternate period has been used within the standard inputs worksheet. This could result in an incorrect economic horizon schedule below. Please review.\",\"Check: ok\")","v":"Check: ok"},null,null,null,null,null,null,null,null,null,null,null,null,null,null,{"$f":"IF(RiskLevel=\"Low\",\"Note: the economic horizon schedule above contains a planned third true-up. This may not be required as per 6.5.3 section (c) of the Transmission System Code\",\"Check: ok\")","v":"Note: the economic horizon schedule above contains a planned third true-up. This may not be required as per 6.5.3 section (c) of the Transmission System Code"}]
["Economic evaluation stages","IEE",{"$f":"IF('Project Inputs'!$B$19=\"High\",VLOOKUP('Capital Cont Inputs'!C16,'Standard Inputs'!$D$54:$E$60,MATCH('Standard Inputs'!$E$52,'Standard Inputs'!$D$52:$E$52,0),0),IF('Project Inputs'!$B$19=\"Medium-high\",VLOOKUP('Capital Cont Inputs'!C16,'Standard Inputs'!$D$64:$E$68,MATCH('Standard Inputs'!$E$52,'Standard Inputs'!$D$52:$E$52,0),0),IF('Project Inputs'!$B$19=\"Medium-low\",VLOOKUP('Capital Cont Inputs'!C16,'Standard Inputs'!$D$72:$E$76,MATCH('Standard Inputs'!$E$52,'Standard Inputs'!$D$52:$E$52,0),0),IF('Project Inputs'!$B$19=\"Low\",VLOOKUP('Capital Cont Inputs'!C16,'Standard Inputs'!$D$80:$E$84,MATCH('Standard Inputs'!$E$52,'Standard Inputs'!$D$52:$E$52,0),0),\"Error\"))))","v":{"$error":"#N/A"}},{"$f":"IF('Project Inputs'!$B$19=\"High\",VLOOKUP('Capital Cont Inputs'!D16,'Standard Inputs'!$D$54:$E$60,MATCH('Standard Inputs'!$E$52,'Standard Inputs'!$D$52:$E$52,0),0),IF('Project Inputs'!$B$19=\"Medium-high\",VLOOKUP('Capital Cont Inputs'!D16,'Standard Inputs'!$D$64:$E$68,MATCH('Standard Inputs'!$E$52,'Standard Inputs'!$D$52:$E$52,0),0),IF('Project Inputs'!$B$19=\"Medium-low\",VLOOKUP('Capital Cont Inputs'!D16,'Standard Inputs'!$D$72:$E$76,MATCH('Standard Inputs'!$E$52,'Standard Inputs'!$D$52:$E$52,0),0),IF('Project Inputs'!$B$19=\"Low\",VLOOKUP('Capital Cont Inputs'!D16,'Standard Inputs'!$D$80:$E$84,MATCH('Standard Inputs'!$E$52,'Standard Inputs'!$D$52:$E$52,0),0),\"Error\"))))","v":{"$error":"#N/A"}},{"$f":"IF('Project Inputs'!$B$19=\"High\",VLOOKUP('Capital Cont Inputs'!E16,'Standard Inputs'!$D$54:$E$60,MATCH('Standard Inputs'!$E$52,'Standard Inputs'!$D$52:$E$52,0),0),IF('Project Inputs'!$B$19=\"Medium-high\",VLOOKUP('Capital Cont Inputs'!E16,'Standard Inputs'!$D$64:$E$68,MATCH('Standard Inputs'!$E$52,'Standard Inputs'!$D$52:$E$52,0),0),IF('Project Inputs'!$B$19=\"Medium-low\",VLOOKUP('Capital Cont Inputs'!E16,'Standard Inputs'!$D$72:$E$76,MATCH('Standard Inputs'!$E$52,'Standard Inputs'!$D$52:$E$52,0),0),IF('Project Inputs'!$B$19=\"Low\",VLOOKUP('Capital Cont Inputs'!E16,'Standard Inputs'!$D$80:$E$84,MATCH('Standard Inputs'!$E$52,'Standard Inputs'!$D$52:$E$52,0),0),\"Error\"))))","v":{"$error":"#N/A"}},{"$f":"IF('Project Inputs'!$B$19=\"High\",VLOOKUP('Capital Cont Inputs'!F16,'Standard Inputs'!$D$54:$E$60,MATCH('Standard Inputs'!$E$52,'Standard Inputs'!$D$52:$E$52,0),0),IF('Project Inputs'!$B$19=\"Medium-high\",VLOOKUP('Capital Cont Inputs'!F16,'Standard Inputs'!$D$64:$E$68,MATCH('Standard Inputs'!$E$52,'Standard Inputs'!$D$52:$E$52,0),0),IF('Project Inputs'!$B$19=\"Medium-low\",VLOOKUP('Capital Cont Inputs'!F16,'Standard Inputs'!$D$72:$E$76,MATCH('Standard Inputs'!$E$52,'Standard Inputs'!$D$52:$E$52,0),0),IF('Project Inputs'!$B$19=\"Low\",VLOOKUP('Capital Cont Inputs'!F16,'Standard Inputs'!$D$80:$E$84,MATCH('Standard Inputs'!$E$52,'Standard Inputs'!$D$52:$E$52,0),0),\"Error\"))))","v":{"$error":"#N/A"}},{"$f":"IF('Project Inputs'!$B$19=\"High\",VLOOKUP('Capital Cont Inputs'!G16,'Standard Inputs'!$D$54:$E$60,MATCH('Standard Inputs'!$E$52,'Standard Inputs'!$D$52:$E$52,0),0),IF('Project Inputs'!$B$19=\"Medium-high\",VLOOKUP('Capital Cont Inputs'!G16,'Standard Inputs'!$D$64:$E$68,MATCH('Standard Inputs'!$E$52,'Standard Inputs'!$D$52:$E$52,0),0),IF('Project Inputs'!$B$19=\"Medium-low\",VLOOKUP('Capital Cont Inputs'!G16,'Standard Inputs'!$D$72:$E$76,MATCH('Standard Inputs'!$E$52,'Standard Inputs'!$D$52:$E$52,0),0),IF('Project Inputs'!$B$19=\"Low\",VLOOKUP('Capital Cont Inputs'!G16,'Standard Inputs'!$D$80:$E$84,MATCH('Standard Inputs'!$E$52,'Standard Inputs'!$D$52:$E$52,0),0),\"Error\"))))","v":"1st true-up"},{"$f":"IF('Project Inputs'!$B$19=\"High\",VLOOKUP('Capital Cont Inputs'!H16,'Standard Inputs'!$D$54:$E$60,MATCH('Standard Inputs'!$E$52,'Standard Inputs'!$D$52:$E$52,0),0),IF('Project Inputs'!$B$19=\"Medium-high\",VLOOKUP('Capital Cont Inputs'!H16,'Standard Inputs'!$D$64:$E$68,MATCH('Standard Inputs'!$E$52,'Standard Inputs'!$D$52:$E$52,0),0),IF('Project Inputs'!$B$19=\"Medium-low\",VLOOKUP('Capital Cont Inputs'!H16,'Standard Inputs'!$D$72:$E$76,MATCH('Standard Inputs'!$E$52,'Standard Inputs'!$D$52:$E$52,0),0),IF('Project Inputs'!$B$19=\"Low\",VLOOKUP('Capital Cont Inputs'!H16,'Standard Inputs'!$D$80:$E$84,MATCH('Standard Inputs'!$E$52,'Standard Inputs'!$D$52:$E$52,0),0),\"Error\"))))","v":{"$error":"#N/A"}},{"$f":"IF('Project Inputs'!$B$19=\"High\",VLOOKUP('Capital Cont Inputs'!I16,'Standard Inputs'!$D$54:$E$60,MATCH('Standard Inputs'!$E$52,'Standard Inputs'!$D$52:$E$52,0),0),IF('Project Inputs'!$B$19=\"Medium-high\",VLOOKUP('Capital Cont Inputs'!I16,'Standard Inputs'!$D$64:$E$68,MATCH('Standard Inputs'!$E$52,'Standard Inputs'!$D$52:$E$52,0),0),IF('Project Inputs'!$B$19=\"Medium-low\",VLOOKUP('Capital Cont Inputs'!I16,'Standard Inputs'!$D$72:$E$76,MATCH('Standard Inputs'!$E$52,'Standard Inputs'!$D$52:$E$52,0),0),IF('Project Inputs'!$B$19=\"Low\",VLOOKUP('Capital Cont Inputs'!I16,'Standard Inputs'!$D$80:$E$84,MATCH('Standard Inputs'!$E$52,'Standard Inputs'!$D$52:$E$52,0),0),\"Error\"))))","v":{"$error":"#N/A"}},{"$f":"IF('Project Inputs'!$B$19=\"High\",VLOOKUP('Capital Cont Inputs'!J16,'Standard Inputs'!$D$54:$E$60,MATCH('Standard Inputs'!$E$52,'Standard Inputs'!$D$52:$E$52,0),0),IF('Project Inputs'!$B$19=\"Medium-high\",VLOOKUP('Capital Cont Inputs'!J16,'Standard Inputs'!$D$64:$E$68,MATCH('Standard Inputs'!$E$52,'Standard Inputs'!$D$52:$E$52,0),0),IF('Project Inputs'!$B$19=\"Medium-low\",VLOOKUP('Capital Cont Inputs'!J16,'Standard Inputs'!$D$72:$E$76,MATCH('Standard Inputs'!$E$52,'Standard Inputs'!$D$52:$E$52,0),0),IF('Project Inputs'!$B$19=\"Low\",VLOOKUP('Capital Cont Inputs'!J16,'Standard Inputs'!$D$80:$E$84,MATCH('Standard Inputs'!$E$52,'Standard Inputs'!$D$52:$E$52,0),0),\"Error\"))))","v":{"$error":"#N/A"}},{"$f":"IF('Project Inputs'!$B$19=\"High\",VLOOKUP('Capital Cont Inputs'!K16,'Standard Inputs'!$D$54:$E$60,MATCH('Standard Inputs'!$E$52,'Standard Inputs'!$D$52:$E$52,0),0),IF('Project Inputs'!$B$19=\"Medium-high\",VLOOKUP('Capital Cont Inputs'!K16,'Standard Inputs'!$D$64:$E$68,MATCH('Standard Inputs'!$E$52,'Standard Inputs'!$D$52:$E$52,0),0),IF('Project Inputs'!$B$19=\"Medium-low\",VLOOKUP('Capital Cont Inputs'!K16,'Standard Inputs'!$D$72:$E$76,MATCH('Standard Inputs'!$E$52,'Standard Inputs'!$D$52:$E$52,0),0),IF('Project Inputs'!$B$19=\"Low\",VLOOKUP('Capital Cont Inputs'!K16,'Standard Inputs'!$D$80:$E$84,MATCH('Standard Inputs'!$E$52,'Standard Inputs'!$D$52:$E$52,0),0),\"Error\"))))","v":{"$error":"#N/A"}},{"$f":"IF('Project Inputs'!$B$19=\"High\",VLOOKUP('Capital Cont Inputs'!L16,'Standard Inputs'!$D$54:$E$60,MATCH('Standard Inputs'!$E$52,'Standard Inputs'!$D$52:$E$52,0),0),IF('Project Inputs'!$B$19=\"Medium-high\",VLOOKUP('Capital Cont Inputs'!L16,'Standard Inputs'!$D$64:$E$68,MATCH('Standard Inputs'!$E$52,'Standard Inputs'!$D$52:$E$52,0),0),IF('Project Inputs'!$B$19=\"Medium-low\",VLOOKUP('Capital Cont Inputs'!L16,'Standard Inputs'!$D$72:$E$76,MATCH('Standard Inputs'!$E$52,'Standard Inputs'!$D$52:$E$52,0),0),IF('Project Inputs'!$B$19=\"Low\",VLOOKUP('Capital Cont Inputs'!L16,'Standard Inputs'!$D$80:$E$84,MATCH('Standard Inputs'!$E$52,'Standard Inputs'!$D$52:$E$52,0),0),\"Error\"))))","v":"2nd true-up"},{"$f":"IF('Project Inputs'!$B$19=\"High\",VLOOKUP('Capital Cont Inputs'!M16,'Standard Inputs'!$D$54:$E$60,MATCH('Standard Inputs'!$E$52,'Standard Inputs'!$D$52:$E$52,0),0),IF('Project Inputs'!$B$19=\"Medium-high\",VLOOKUP('Capital Cont Inputs'!M16,'Standard Inputs'!$D$64:$E$68,MATCH('Standard Inputs'!$E$52,'Standard Inputs'!$D$52:$E$52,0),0),IF('Project Inputs'!$B$19=\"Medium-low\",VLOOKUP('Capital Cont Inputs'!M16,'Standard Inputs'!$D$72:$E$76,MATCH('Standard Inputs'!$E$52,'Standard Inputs'!$D$52:$E$52,0),0),IF('Project Inputs'!$B$19=\"Low\",VLOOKUP('Capital Cont Inputs'!M16,'Standard Inputs'!$D$80:$E$84,MATCH('Standard Inputs'!$E$52,'Standard Inputs'!$D$52:$E$52,0),0),\"Error\"))))","v":{"$error":"#N/A"}},{"$f":"IF('Project Inputs'!$B$19=\"High\",VLOOKUP('Capital Cont Inputs'!N16,'Standard Inputs'!$D$54:$E$60,MATCH('Standard Inputs'!$E$52,'Standard Inputs'!$D$52:$E$52,0),0),IF('Project Inputs'!$B$19=\"Medium-high\",VLOOKUP('Capital Cont Inputs'!N16,'Standard Inputs'!$D$64:$E$68,MATCH('Standard Inputs'!$E$52,'Standard Inputs'!$D$52:$E$52,0),0),IF('Project Inputs'!$B$19=\"Medium-low\",VLOOKUP('Capital Cont Inputs'!N16,'Standard Inputs'!$D$72:$E$76,MATCH('Standard Inputs'!$E$52,'Standard Inputs'!$D$52:$E$52,0),0),IF('Project Inputs'!$B$19=\"Low\",VLOOKUP('Capital Cont Inputs'!N16,'Standard Inputs'!$D$80:$E$84,MATCH('Standard Inputs'!$E$52,'Standard Inputs'!$D$52:$E$52,0),0),\"Error\"))))","v":{"$error":"#N/A"}},{"$f":"IF('Project Inputs'!$B$19=\"High\",VLOOKUP('Capital Cont Inputs'!O16,'Standard Inputs'!$D$54:$E$60,MATCH('Standard Inputs'!$E$52,'Standard Inputs'!$D$52:$E$52,0),0),IF('Project Inputs'!$B$19=\"Medium-high\",VLOOKUP('Capital Cont Inputs'!O16,'Standard Inputs'!$D$64:$E$68,MATCH('Standard Inputs'!$E$52,'Standard Inputs'!$D$52:$E$52,0),0),IF('Project Inputs'!$B$19=\"Medium-low\",VLOOKUP('Capital Cont Inputs'!O16,'Standard Inputs'!$D$72:$E$76,MATCH('Standard Inputs'!$E$52,'Standard Inputs'!$D$52:$E$52,0),0),IF('Project Inputs'!$B$19=\"Low\",VLOOKUP('Capital Cont Inputs'!O16,'Standard Inputs'!$D$80:$E$84,MATCH('Standard Inputs'!$E$52,'Standard Inputs'!$D$52:$E$52,0),0),\"Error\"))))","v":{"$error":"#N/A"}},{"$f":"IF('Project Inputs'!$B$19=\"High\",VLOOKUP('Capital Cont Inputs'!P16,'Standard Inputs'!$D$54:$E$60,MATCH('Standard Inputs'!$E$52,'Standard Inputs'!$D$52:$E$52,0),0),IF('Project Inputs'!$B$19=\"Medium-high\",VLOOKUP('Capital Cont Inputs'!P16,'Standard Inputs'!$D$64:$E$68,MATCH('Standard Inputs'!$E$52,'Standard Inputs'!$D$52:$E$52,0),0),IF('Project Inputs'!$B$19=\"Medium-low\",VLOOKUP('Capital Cont Inputs'!P16,'Standard Inputs'!$D$72:$E$76,MATCH('Standard Inputs'!$E$52,'Standard Inputs'!$D$52:$E$52,0),0),IF('Project Inputs'!$B$19=\"Low\",VLOOKUP('Capital Cont Inputs'!P16,'Standard Inputs'!$D$80:$E$84,MATCH('Standard Inputs'!$E$52,'Standard Inputs'!$D$52:$E$52,0),0),\"Error\"))))","v":{"$error":"#N/A"}},{"$f":"IF('Project Inputs'!$B$19=\"High\",VLOOKUP('Capital Cont Inputs'!Q16,'Standard Inputs'!$D$54:$E$60,MATCH('Standard Inputs'!$E$52,'Standard Inputs'!$D$52:$E$52,0),0),IF('Project Inputs'!$B$19=\"Medium-high\",VLOOKUP('Capital Cont Inputs'!Q16,'Standard Inputs'!$D$64:$E$68,MATCH('Standard Inputs'!$E$52,'Standard Inputs'!$D$52:$E$52,0),0),IF('Project Inputs'!$B$19=\"Medium-low\",VLOOKUP('Capital Cont Inputs'!Q16,'Standard Inputs'!$D$72:$E$76,MATCH('Standard Inputs'!$E$52,'Standard Inputs'!$D$52:$E$52,0),0),IF('Project Inputs'!$B$19=\"Low\",VLOOKUP('Capital Cont Inputs'!Q16,'Standard Inputs'!$D$80:$E$84,MATCH('Standard Inputs'!$E$52,'Standard Inputs'!$D$52:$E$52,0),0),\"Error\"))))","v":"3rd true-up"},{"$f":"IF('Project Inputs'!$B$19=\"High\",VLOOKUP('Capital Cont Inputs'!R16,'Standard Inputs'!$D$54:$E$60,MATCH('Standard Inputs'!$E$52,'Standard Inputs'!$D$52:$E$52,0),0),IF('Project Inputs'!$B$19=\"Medium-high\",VLOOKUP('Capital Cont Inputs'!R16,'Standard Inputs'!$D$64:$E$68,MATCH('Standard Inputs'!$E$52,'Standard Inputs'!$D$52:$E$52,0),0),IF('Project Inputs'!$B$19=\"Medium-low\",VLOOKUP('Capital Cont Inputs'!R16,'Standard Inputs'!$D$72:$E$76,MATCH('Standard Inputs'!$E$52,'Standard Inputs'!$D$52:$E$52,0),0),IF('Project Inputs'!$B$19=\"Low\",VLOOKUP('Capital Cont Inputs'!R16,'Standard Inputs'!$D$80:$E$84,MATCH('Standard Inputs'!$E$52,'Standard Inputs'!$D$52:$E$52,0),0),\"Error\"))))","v":{"$error":"#N/A"}},{"$f":"IF('Project Inputs'!$B$19=\"High\",VLOOKUP('Capital Cont Inputs'!S16,'Standard Inputs'!$D$54:$E$60,MATCH('Standard Inputs'!$E$52,'Standard Inputs'!$D$52:$E$52,0),0),IF('Project Inputs'!$B$19=\"Medium-high\",VLOOKUP('Capital Cont Inputs'!S16,'Standard Inputs'!$D$64:$E$68,MATCH('Standard Inputs'!$E$52,'Standard Inputs'!$D$52:$E$52,0),0),IF('Project Inputs'!$B$19=\"Medium-low\",VLOOKUP('Capital Cont Inputs'!S16,'Standard Inputs'!$D$72:$E$76,MATCH('Standard Inputs'!$E$52,'Standard Inputs'!$D$52:$E$52,0),0),IF('Project Inputs'!$B$19=\"Low\",VLOOKUP('Capital Cont Inputs'!S16,'Standard Inputs'!$D$80:$E$84,MATCH('Standard Inputs'!$E$52,'Standard Inputs'!$D$52:$E$52,0),0),\"Error\"))))","v":{"$error":"#N/A"}},{"$f":"IF('Project Inputs'!$B$19=\"High\",VLOOKUP('Capital Cont Inputs'!T16,'Standard Inputs'!$D$54:$E$60,MATCH('Standard Inputs'!$E$52,'Standard Inputs'!$D$52:$E$52,0),0),IF('Project Inputs'!$B$19=\"Medium-high\",VLOOKUP('Capital Cont Inputs'!T16,'Standard Inputs'!$D$64:$E$68,MATCH('Standard Inputs'!$E$52,'Standard Inputs'!$D$52:$E$52,0),0),IF('Project Inputs'!$B$19=\"Medium-low\",VLOOKUP('Capital Cont Inputs'!T16,'Standard Inputs'!$D$72:$E$76,MATCH('Standard Inputs'!$E$52,'Standard Inputs'!$D$52:$E$52,0),0),IF('Project Inputs'!$B$19=\"Low\",VLOOKUP('Capital Cont Inputs'!T16,'Standard Inputs'!$D$80:$E$84,MATCH('Standard Inputs'!$E$52,'Standard Inputs'!$D$52:$E$52,0),0),\"Error\"))))","v":{"$error":"#N/A"}},{"$f":"IF('Project Inputs'!$B$19=\"High\",VLOOKUP('Capital Cont Inputs'!U16,'Standard Inputs'!$D$54:$E$60,MATCH('Standard Inputs'!$E$52,'Standard Inputs'!$D$52:$E$52,0),0),IF('Project Inputs'!$B$19=\"Medium-high\",VLOOKUP('Capital Cont Inputs'!U16,'Standard Inputs'!$D$64:$E$68,MATCH('Standard Inputs'!$E$52,'Standard Inputs'!$D$52:$E$52,0),0),IF('Project Inputs'!$B$19=\"Medium-low\",VLOOKUP('Capital Cont Inputs'!U16,'Standard Inputs'!$D$72:$E$76,MATCH('Standard Inputs'!$E$52,'Standard Inputs'!$D$52:$E$52,0),0),IF('Project Inputs'!$B$19=\"Low\",VLOOKUP('Capital Cont Inputs'!U16,'Standard Inputs'!$D$80:$E$84,MATCH('Standard Inputs'!$E$52,'Standard Inputs'!$D$52:$E$52,0),0),\"Error\"))))","v":{"$error":"#N/A"}},{"$f":"IF('Project Inputs'!$B$19=\"High\",VLOOKUP('Capital Cont Inputs'!V16,'Standard Inputs'!$D$54:$E$60,MATCH('Standard Inputs'!$E$52,'Standard Inputs'!$D$52:$E$52,0),0),IF('Project Inputs'!$B$19=\"Medium-high\",VLOOKUP('Capital Cont Inputs'!V16,'Standard Inputs'!$D$64:$E$68,MATCH('Standard Inputs'!$E$52,'Standard Inputs'!$D$52:$E$52,0),0),IF('Project Inputs'!$B$19=\"Medium-low\",VLOOKUP('Capital Cont Inputs'!V16,'Standard Inputs'!$D$72:$E$76,MATCH('Standard Inputs'!$E$52,'Standard Inputs'!$D$52:$E$52,0),0),IF('Project Inputs'!$B$19=\"Low\",VLOOKUP('Capital Cont Inputs'!V16,'Standard Inputs'!$D$80:$E$84,MATCH('Standard Inputs'!$E$52,'Standard Inputs'!$D$52:$E$52,0),0),\"Error\"))))","v":{"$error":"#N/A"}},{"$f":"IF('Project Inputs'!$B$19=\"High\",VLOOKUP('Capital Cont Inputs'!W16,'Standard Inputs'!$D$54:$E$60,MATCH('Standard Inputs'!$E$52,'Standard Inputs'!$D$52:$E$52,0),0),IF('Project Inputs'!$B$19=\"Medium-high\",VLOOKUP('Capital Cont Inputs'!W16,'Standard Inputs'!$D$64:$E$68,MATCH('Standard Inputs'!$E$52,'Standard Inputs'!$D$52:$E$52,0),0),IF('Project Inputs'!$B$19=\"Medium-low\",VLOOKUP('Capital Cont Inputs'!W16,'Standard Inputs'!$D$72:$E$76,MATCH('Standard Inputs'!$E$52,'Standard Inputs'!$D$52:$E$52,0),0),IF('Project Inputs'!$B$19=\"Low\",VLOOKUP('Capital Cont Inputs'!W16,'Standard Inputs'!$D$80:$E$84,MATCH('Standard Inputs'!$E$52,'Standard Inputs'!$D$52:$E$52,0),0),\"Error\"))))","v":{"$error":"#N/A"}},{"$f":"IF('Project Inputs'!$B$19=\"High\",VLOOKUP('Capital Cont Inputs'!X16,'Standard Inputs'!$D$54:$E$60,MATCH('Standard Inputs'!$E$52,'Standard Inputs'!$D$52:$E$52,0),0),IF('Project Inputs'!$B$19=\"Medium-high\",VLOOKUP('Capital Cont Inputs'!X16,'Standard Inputs'!$D$64:$E$68,MATCH('Standard Inputs'!$E$52,'Standard Inputs'!$D$52:$E$52,0),0),IF('Project Inputs'!$B$19=\"Medium-low\",VLOOKUP('Capital Cont Inputs'!X16,'Standard Inputs'!$D$72:$E$76,MATCH('Standard Inputs'!$E$52,'Standard Inputs'!$D$52:$E$52,0),0),IF('Project Inputs'!$B$19=\"Low\",VLOOKUP('Capital Cont Inputs'!X16,'Standard Inputs'!$D$80:$E$84,MATCH('Standard Inputs'!$E$52,'Standard Inputs'!$D$52:$E$52,0),0),\"Error\"))))","v":{"$error":"#N/A"}},{"$f":"IF('Project Inputs'!$B$19=\"High\",VLOOKUP('Capital Cont Inputs'!Y16,'Standard Inputs'!$D$54:$E$60,MATCH('Standard Inputs'!$E$52,'Standard Inputs'!$D$52:$E$52,0),0),IF('Project Inputs'!$B$19=\"Medium-high\",VLOOKUP('Capital Cont Inputs'!Y16,'Standard Inputs'!$D$64:$E$68,MATCH('Standard Inputs'!$E$52,'Standard Inputs'!$D$52:$E$52,0),0),IF('Project Inputs'!$B$19=\"Medium-low\",VLOOKUP('Capital Cont Inputs'!Y16,'Standard Inputs'!$D$72:$E$76,MATCH('Standard Inputs'!$E$52,'Standard Inputs'!$D$52:$E$52,0),0),IF('Project Inputs'!$B$19=\"Low\",VLOOKUP('Capital Cont Inputs'!Y16,'Standard Inputs'!$D$80:$E$84,MATCH('Standard Inputs'!$E$52,'Standard Inputs'!$D$52:$E$52,0),0),\"Error\"))))","v":{"$error":"#N/A"}},{"$f":"IF('Project Inputs'!$B$19=\"High\",VLOOKUP('Capital Cont Inputs'!Z16,'Standard Inputs'!$D$54:$E$60,MATCH('Standard Inputs'!$E$52,'Standard Inputs'!$D$52:$E$52,0),0),IF('Project Inputs'!$B$19=\"Medium-high\",VLOOKUP('Capital Cont Inputs'!Z16,'Standard Inputs'!$D$64:$E$68,MATCH('Standard Inputs'!$E$52,'Standard Inputs'!$D$52:$E$52,0),0),IF('Project Inputs'!$B$19=\"Medium-low\",VLOOKUP('Capital Cont Inputs'!Z16,'Standard Inputs'!$D$72:$E$76,MATCH('Standard Inputs'!$E$52,'Standard Inputs'!$D$52:$E$52,0),0),IF('Project Inputs'!$B$19=\"Low\",VLOOKUP('Capital Cont Inputs'!Z16,'Standard Inputs'!$D$80:$E$84,MATCH('Standard Inputs'!$E$52,'Standard Inputs'!$D$52:$E$52,0),0),\"Error\"))))","v":{"$error":"#N/A"}},{"$f":"IF('Project Inputs'!$B$19=\"High\",VLOOKUP('Capital Cont Inputs'!AA16,'Standard Inputs'!$D$54:$E$60,MATCH('Standard Inputs'!$E$52,'Standard Inputs'!$D$52:$E$52,0),0),IF('Project Inputs'!$B$19=\"Medium-high\",VLOOKUP('Capital Cont Inputs'!AA16,'Standard Inputs'!$D$64:$E$68,MATCH('Standard Inputs'!$E$52,'Standard Inputs'!$D$52:$E$52,0),0),IF('Project Inputs'!$B$19=\"Medium-low\",VLOOKUP('Capital Cont Inputs'!AA16,'Standard Inputs'!$D$72:$E$76,MATCH('Standard Inputs'!$E$52,'Standard Inputs'!$D$52:$E$52,0),0),IF('Project Inputs'!$B$19=\"Low\",VLOOKUP('Capital Cont Inputs'!AA16,'Standard Inputs'!$D$80:$E$84,MATCH('Standard Inputs'!$E$52,'Standard Inputs'!$D$52:$E$52,0),0),\"Error\"))))","v":{"$error":"#N/A"}}]
["Years",{"$f":"B4","v":2009},{"$f":"IF(ISNUMBER(B15),IF(B15+1>$B$10,\"\",B15+1),\"\")","v":2010},2011,2012,2013,2014,2015,2016,2017,2018,2019,2020,2021,2022,2023,2024,2025,2026,2027,2028,2029,2030,2031,2032,2033,2034]
["Project Year",{"$f":"IF(ISNUMBER(B15),0,\"\")","v":0},{"$f":"IF(ISNUMBER(C15),B16+1,\"\")","v":1},2,3,4,5,6,7,8,9,10,11,12,13,14,15,16,17,18,19,20,21,22,23,24,25,null,"Capital Contribution Input Warnings"]
["Actual Contribution Payments made - $k",null,null,null,null,null,null,null,null,null,null,null,null,null,null,null,null,null,null,null,null,null,null,null,null,null,null,null,{"$f":"B15","v":2009},2010,2011,2012,2013,2014,2015,2016,2017,2018,2019,2020,2021,2022,2023,2024,2025,2026,2027,2028,2029,2030,2031,2032,2033,2034]
["Current Contribution Payment - $k",null,null,null,null,null,8180.0989492524241]
[{"$f":"IF(ISNA(HLOOKUP(\"Warning\",$AC19:$BB19,1,0)),\"Check: ok\",\"Warning, a cap con't has been improperly input beyond the current stage. Remove all con't inputs beyond \"&'Capital Cont Inputs'!B8&\".\")","v":"Check: ok"},null,null,null,null,null,null,null,null,null,null,null,null,null,null,null,null,null,null,null,null,null,null,null,null,null,null,null,{"$f":"IF(AND(B15>$B$8,(B17+B18)<>0),\"Warning\",\"Check: Ok\")","v":"Check: Ok"},"Check: Ok","Check: Ok","Check: Ok","Check: Ok","Check: Ok","Check: Ok","Check: Ok","Check: Ok","Check: Ok","Check: Ok","Check: Ok","Check: Ok","Check: Ok","Check: Ok","Check: Ok","Check: Ok","Check: Ok","Check: Ok","Check: Ok","Check: Ok","Check: Ok","Check: Ok","Check: Ok","Check: Ok","Check: Ok"]
[{"$f":"IF(ISNA(HLOOKUP(\"Warning\",$AC20:$BB20,1,0)),\"Check: ok\",\"Warning, an actual cap con't has been improperly input in the current stage. Remove the actual con't in \"&'Capital Cont Inputs'!B8&\".\")","v":"Check: ok"},null,null,null,null,null,null,null,null,null,null,null,null,null,null,null,null,null,null,null,null,null,null,null,null,null,null,null,{"$f":"IF(AND('Project Inputs'!B28=\"Estimated cost\",B17<>0),\"Warning\",\"Check: Ok\")","v":"Check: Ok"},{"$f":"IF(AND(C15=$B$8,C17<>0),\"Warning\",\"Check: Ok\")","v":"Check: Ok"},"Check: Ok","Check: Ok","Check: Ok","Check: Ok","Check: Ok","Check: Ok","Check: Ok","Check: Ok","Check: Ok","Check: Ok","Check: Ok","Check: Ok","Check: Ok","Check: Ok","Check: Ok","Check: Ok","Check: Ok","Check: Ok","Check: Ok","Check: Ok","Check: Ok","Check: Ok","Check: Ok","Check: Ok"]
[{"$f":"IF(ISNA(HLOOKUP(\"Warning\",$AC21:$BB21,1,0)),\"Check: ok\",\"Warning, a cap con't has been improperly input in a non true-up year. Remove all con't inputs in non true-up years.\")","v":"Check: ok"},null,null,null,null,null,null,null,null,null,null,null,null,null,null,null,null,null,null,null,null,null,null,null,null,null,null,null,"Check: Ok",{"$f":"IF(AND(ISNA(C14),(C18+C17)<>0),\"Warning\",\"Check: Ok\")","v":"Check: Ok"},"Check: Ok","Check: Ok","Check: Ok","Check: Ok","Check: Ok","Check: Ok","Check: Ok","Check: Ok","Check: Ok","Check: Ok","Check: Ok","Check: Ok","Check: Ok","Check: Ok","Check: Ok","Check: Ok","Check: Ok","Check: Ok","Check: Ok","Check: Ok","Check: Ok","Check: Ok","Check: Ok","Check: Ok"]
[]
[]
["CALCULATIONS:"]
[]
["Calculation of initial economic evaluation (IEE) / true-up:"]
["Is the NPV before contributions less than 0?",{"$f":"IF(ROUND('NPV Calc'!D53,4)<0,\"Yes\",\"No\")","v":"Yes"}]
["Or"]
["Have contributions been paid (excluding estimated IEE pre-payments)?",{"$f":"IF(AND(OR(Stage='Standard Inputs'!E55, Stage='Standard Inputs'!E54),B17>0),\"N/A\",IF(OR(B17<>0,B18<>0,SUM(C17:AA18)<>0),\"Yes\",\"No\"))","v":"Yes"}]
[]
["Is the model ready to proceed with the true-up calculation?",{"$f":"IF(AND(OR(B29=\"Yes\",B27=\"Yes\"),B45=\"Revenue Guarantee\"),\"Warning\",IF(OR(B29=\"Yes\",B27=\"Yes\"),\"Yes\",\"No\"))","v":"Yes"}]
[{"$f":"IF(TrueUpFlag=\"Warning\",\"The model is currently set to a revenue guarantee, which is resulting in a warning. To correct, please run the IEE / True-up Calculation\",\"Check ok\")","v":"Check ok"}]
[]
[]
[]
[]
["Calculation of Revenue Guarantee:"]
[]
["Is the model ready to proceed with the Revenue Guarantee calculation?",{"$f":"IF(B31=\"No\",\"Yes\",\"No\")","v":"No"}]
[]
[]
["Revenue guarantee factor:",1]
[]
[]
["Last completed macro calculation:","IEE/True-up"]
[]
["REPORTING / PRINT:"]
[]
["1. Standard Report: "]
["- Contains a detailed summary of the calculation of capital contributions or revenue requirement"]
[]
["Please select which report you would like to review:","IEE/True-up",null,{"$f":"IF(OR((AND(B39=\"Yes\",B45=\"IEE/True-up\")),(AND(B31=\"Yes\",B52=\"Revenue Guarantee\"))),\"Warning - the revenue guarantee has not been calculated, please review detail above.\",\"Check: ok\")","v":"Check: ok"}]
["Display capital contributions in the standard report?",{"$f":"IF(B52=\"Revenue Guarantee\",\"N/A\",IF(AND(B52=\"IEE/True-up\",B39=\"Yes\",B29=\"No\"),\"No\",\"Yes\"))","v":"Yes"}]
[]
["To print this report, please click here:"]
[]
["2. Secondary Reports: for Decision Support use:"]
["- Report After Cont $k"]
["- True-up Report"]

{"sheet":"Standard Inputs","index":3,"n_rows":84,"n_cols":7,"rows_kept":84,"cut":false,"hidden":false,"merged":[[83,6,83,14],[75,6,75,14],[79,6,79,14],[80,6,80,14],[81,6,81,14],[82,6,82,14],[67,6,67,14],[71,6,71,14],[72,6,72,14],[73,6,73,14],[74,6,74,14],[59,6,59,14],[63,6,63,14],[64,6,64,14],[65,6,65,14],[66,6,66,14],[47,1,47,4],[53,6,53,14],[54,6,54,14],[55,6,55,14],[56,6,56,14],[30,5,30,10],[31,5,31,10],[32,5,32,10],[57,6,57,14],[58,6,58,14]]}
[]
[]
[]
["REVENUE INPUTS:"]
["Pool","Tariffs ($/kW/Month)"]
["Line",0.59]
["Network",2.31]
["Transformation",1.61]
[]
["DISCOUNT RATE INPUTS:"]
[]
["After-tax discount rate",5.681332E-2]
[]
["TAX INPUTS:"]
[]
["Federal Income Tax Rate",0.19500000000000001]
["Ontario Income Tax Rate",0.14000000000000001]
["Surtax",0]
["Income Tax rate",{"$f":"B16+B17+B18","v":0.33500000000000002}]
[]
["Large Corporation Tax Rate (LCT)",0]
["Ontario Capital Tax Rate (OCT)",2.2499999999999998E-3]
[]
["Municipal tax estimated based on gross or net capital?","Net"]
["Municipal (Property) Tax",6.2518373346398823E-3]
[]
["CCA:"]
[null,"Class Number","CCA Rates"]
["Land costs","N/A","N/A",null,"Land does not attract CCA"]
[{"$f":"\"Class \"&B30&\" costs\"","v":"Class 47 costs"},47,{"$f":"IF(B30=47,0.08,0.04)","v":0.08},null,"Transmission equipment"]
["Decision Support defined costs (1)"]
["Decision Support defined costs (2)"]
["Decision Support defined costs (3)"]
[]
[]
["WORKING CAPITAL INPUTS:"]
[]
["Revenue Lag",36.96]
["OM&A Lead",19.21]
["Net Lag",{"$f":"B38-B39","v":17.75}]
["Net Lag / 365",{"$f":"B40/365","v":4.8630136986301371E-2}]
[]
[]
["REPORTING INPUTS:"]
[]
["GST",0.05]
[]
["Working capital detail (report description):","As per Lead Lag study"]
[]
["ALTERNATE HORIZON INPUTS:"]
[]
["Risk Level","Standard Period","Alternate Period","In-use Period","Stage","Year"]
["High"]
[{"$f":"$A$53&\" - \"&E54","v":"High - Estimated cost"},0,null,{"$f":"IF(ISNUMBER(C54),C54,B54)","v":0},"Estimated cost",{"$f":"'Capital Cont Inputs'!B15","v":2009},{"$f":"IF(C54>$D$60,\"Warning - you cannot input an alternate horizon that is greater than the standard horizon given the selected risk classification\",\"Check: ok\")","v":"Check: ok"}]
[{"$f":"$A$53&\" - \"&E55","v":"High - Actual cost"},0,null,0,"Actual cost",{"$f":"$F$54+D55","v":2009},{"$f":"IF(C55>$D$60,\"Warning - you cannot input an alternate horizon that is greater than the standard horizon given the selected risk classification\",\"Check: ok\")","v":"Check: ok"}]
[{"$f":"$A$53&\" - \"&E56","v":"High - 1st true-up"},{"$f":"B54+1","v":1},null,1,"1st true-up",2010,"Check: ok"]
["High - 2nd true-up",{"$f":"B56+1","v":2},null,2,"2nd true-up",2011,"Check: ok"]
["High - 3rd true-up",{"$f":"B57+1","v":3},null,3,"3rd true-up",2012,"Check: ok"]
["High - 4th true-up",{"$f":"B58+1","v":4},null,4,"4th true-up",2013,"Check: ok"]
["High - 5th true-up",{"$f":"B59+1","v":5},null,5,"5th true-up",2014,"Check: ok"]
[]
[]
["Medium-high"]
[{"$f":"$A$63&\" - \"&E64","v":"Medium-high - Estimated cost"},0,null,{"$f":"IF(ISNUMBER(C64),C64,B64)","v":0},{"$f":"E54","v":"Estimated cost"},{"$f":"'Capital Cont Inputs'!B15","v":2009},{"$f":"IF(C64>$D$68,\"Warning - you cannot input an alternate horizon that is greater than the standard horizon given the selected risk classification\",\"Check: ok\")","v":"Check: ok"}]
[{"$f":"$A$63&\" - \"&E65","v":"Medium-high - Actual cost"},0,null,{"$f":"IF(ISNUMBER(C65),C65,B65)","v":0},{"$f":"E55","v":"Actual cost"},{"$f":"$F$64+D65","v":2009},{"$f":"IF(C65>$D$68,\"Warning - you cannot input an alternate horizon that is greater than the standard horizon given the selected risk classification\",\"Check: ok\")","v":"Check: ok"}]
["Medium-high - 1st true-up",{"$f":"B64+3","v":3},null,{"$f":"IF(ISNUMBER(C66),C66,B66)","v":3},{"$f":"E56","v":"1st true-up"},{"$f":"$F$64+D66","v":2012},"Check: ok"]
["Medium-high - 2nd true-up",{"$f":"B66+2","v":5},null,{"$f":"IF(ISNUMBER(C67),C67,B67)","v":5},"2nd true-up",{"$f":"$F$64+D67","v":2014},"Check: ok"]
["Medium-high - 3rd true-up",{"$f":"B67+5","v":10},null,{"$f":"IF(ISNUMBER(C68),C68,B68)","v":10},"3rd true-up",{"$f":"$F$64+D68","v":2019},"Check: ok"]
[]
[]
["Medium-low"]
[{"$f":"$A$71&\" - \"&E72","v":"Medium-low - Estimated cost"},0,null,{"$f":"IF(ISNUMBER(C72),C72,B72)","v":0},{"$f":"E54","v":"Estimated cost"},{"$f":"'Capital Cont Inputs'!B15","v":2009},{"$f":"IF(C72>$D$76,\"Warning - you cannot input an alternate horizon that is greater than the standard horizon given the selected risk classification\",\"Check: ok\")","v":"Check: ok"}]
[{"$f":"$A$71&\" - \"&E73","v":"Medium-low - Actual cost"},0,null,{"$f":"IF(ISNUMBER(C73),C73,B73)","v":0},{"$f":"E55","v":"Actual cost"},{"$f":"$F$72+D73","v":2009},{"$f":"IF(C73>$D$76,\"Warning - you cannot input an alternate horizon that is greater than the standard horizon given the selected risk classification\",\"Check: ok\")","v":"Check: ok"}]
["Medium-low - 1st true-up",{"$f":"B72+3","v":3},null,{"$f":"IF(ISNUMBER(C74),C74,B74)","v":3},{"$f":"E56","v":"1st true-up"},{"$f":"$F$72+D74","v":2012},"Check: ok"]
["Medium-low - 2nd true-up",{"$f":"B74+2","v":5},null,{"$f":"IF(ISNUMBER(C75),C75,B75)","v":5},"2nd true-up",{"$f":"$F$72+D75","v":2014},"Check: ok"]
["Medium-low - 3rd true-up",{"$f":"B75+5","v":10},null,{"$f":"IF(ISNUMBER(C76),C76,B76)","v":10},"3rd true-up",{"$f":"$F$72+D76","v":2019},"Check: ok"]
[]
[]
["Low"]
[{"$f":"$A$79&\" - \"&E80","v":"Low - Estimated cost"},0,null,{"$f":"IF(ISNUMBER(C80),C80,B80)","v":0},{"$f":"E54","v":"Estimated cost"},{"$f":"'Capital Cont Inputs'!B15","v":2009},{"$f":"IF(C80>$D$84,\"Warning - you cannot input an alternate horizon that is greater than the standard horizon given the selected risk classification\",\"Check: ok\")","v":"Check: ok"}]
[{"$f":"$A$79&\" - \"&E81","v":"Low - Actual cost"},0,null,{"$f":"IF(ISNUMBER(C81),C81,B81)","v":0},{"$f":"E55","v":"Actual cost"},{"$f":"$F$80+D81","v":2009},{"$f":"IF(C81>$D$84,\"Warning - you cannot input an alternate horizon that is greater than the standard horizon given the selected risk classification\",\"Check: ok\")","v":"Check: ok"}]
["Low - 1st true-up",{"$f":"B80+5","v":5},null,{"$f":"IF(ISNUMBER(C82),C82,B82)","v":5},{"$f":"E56","v":"1st true-up"},{"$f":"$F$80+D82","v":2014},"Check: ok"]
["Low - 2nd true-up",{"$f":"B82+5","v":10},null,{"$f":"IF(ISNUMBER(C83),C83,B83)","v":10},"2nd true-up",{"$f":"$F$80+D83","v":2019},"Check: ok"]
["Low - 3rd true-up",{"$f":"B83+5","v":15},null,{"$f":"IF(ISNUMBER(C84),C84,B84)","v":15},"3rd true-up",{"$f":"$F$80+D84","v":2024},"Check: ok"]

{"sheet":"Prelim Calc","index":4,"n_rows":83,"n_cols":30,"rows_kept":83,"cut":false,"hidden":false,"merged":[[86,6,86,7]]}
[]
[null,null,"Summary of Up-front Costs Before Contributions"]
[null,null,null,null,{"$f":"'Capital Cont Inputs'!B15","v":2009}]
[]
[null,null,"Up-front capital excluding AFUDC & Overhead - $k",null,{"$f":"'Project Inputs'!B34+'Project Inputs'!B38+'Project Inputs'!B49+'Project Inputs'!B55+'Project Inputs'!B61","v":9078.4755654556775}]
[null,null,"Overhead - $k",null,{"$f":"'Project Inputs'!B39+'Project Inputs'!B50+'Project Inputs'!B56+'Project Inputs'!B62","v":0}]
[null,null,"AFUDC - $k",null,{"$f":"'Project Inputs'!B40+'Project Inputs'!B51+'Project Inputs'!B57+'Project Inputs'!B63","v":0}]
[null,null,"Total up-front capital before capital contributions - $k",null,{"$f":"SUM(E5:E7)","v":9078.4755654556775}]
[]
[null,null,"Up-front removal costs - $k",null,{"$f":"SUM('Project Inputs'!B44:B45)","v":0}]
[]
[null,null,"Total up-front capital including removals - $k",null,{"$f":"E8+E10","v":9078.4755654556775}]
[]
[]
[]
[null,null,"Calculation of Municipal Tax"]
[null,null,"Project Year:",null,null,{"$f":"'Capital Cont Inputs'!C16","v":1},{"$f":"'Capital Cont Inputs'!D16","v":2},{"$f":"'Capital Cont Inputs'!E16","v":3},{"$f":"'Capital Cont Inputs'!F16","v":4},{"$f":"'Capital Cont Inputs'!G16","v":5},{"$f":"'Capital Cont Inputs'!H16","v":6},{"$f":"'Capital Cont Inputs'!I16","v":7},{"$f":"'Capital Cont Inputs'!J16","v":8},{"$f":"'Capital Cont Inputs'!K16","v":9},{"$f":"'Capital Cont Inputs'!L16","v":10},{"$f":"'Capital Cont Inputs'!M16","v":11},{"$f":"'Capital Cont Inputs'!N16","v":12},{"$f":"'Capital Cont Inputs'!O16","v":13},{"$f":"'Capital Cont Inputs'!P16","v":14},{"$f":"'Capital Cont Inputs'!Q16","v":15},{"$f":"'Capital Cont Inputs'!R16","v":16},{"$f":"'Capital Cont Inputs'!S16","v":17},{"$f":"'Capital Cont Inputs'!T16","v":18},{"$f":"'Capital Cont Inputs'!U16","v":19},{"$f":"'Capital Cont Inputs'!V16","v":20},{"$f":"'Capital Cont Inputs'!W16","v":21},{"$f":"'Capital Cont Inputs'!X16","v":22},{"$f":"'Capital Cont Inputs'!Y16","v":23},{"$f":"'Capital Cont Inputs'!Z16","v":24},{"$f":"'Capital Cont Inputs'!AA16","v":25}]
[null,null,"Year Ended:",null,null,{"$f":"'Capital Cont Inputs'!C15","v":2010},{"$f":"'Capital Cont Inputs'!D15","v":2011},{"$f":"'Capital Cont Inputs'!E15","v":2012},{"$f":"'Capital Cont Inputs'!F15","v":2013},{"$f":"'Capital Cont Inputs'!G15","v":2014},{"$f":"'Capital Cont Inputs'!H15","v":2015},{"$f":"'Capital Cont Inputs'!I15","v":2016},{"$f":"'Capital Cont Inputs'!J15","v":2017},{"$f":"'Capital Cont Inputs'!K15","v":2018},{"$f":"'Capital Cont Inputs'!L15","v":2019},{"$f":"'Capital Cont Inputs'!M15","v":2020},{"$f":"'Capital Cont Inputs'!N15","v":2021},{"$f":"'Capital Cont Inputs'!O15","v":2022},{"$f":"'Capital Cont Inputs'!P15","v":2023},{"$f":"'Capital Cont Inputs'!Q15","v":2024},{"$f":"'Capital Cont Inputs'!R15","v":2025},{"$f":"'Capital Cont Inputs'!S15","v":2026},{"$f":"'Capital Cont Inputs'!T15","v":2027},{"$f":"'Capital Cont Inputs'!U15","v":2028},{"$f":"'Capital Cont Inputs'!V15","v":2029},{"$f":"'Capital Cont Inputs'!W15","v":2030},{"$f":"'Capital Cont Inputs'!X15","v":2031},{"$f":"'Capital Cont Inputs'!Y15","v":2032},{"$f":"'Capital Cont Inputs'!Z15","v":2033},{"$f":"'Capital Cont Inputs'!AA15","v":2034}]
[]
[null,null,{"$f":"'Standard Inputs'!A24","v":"Municipal tax estimated based on gross or net capital?"},{"$f":"'Standard Inputs'!B24","v":"Net"}]
[]
[null,null,{"$f":"IF('Standard Inputs'!$B$24=Menus!$D$45,\"Opening Up-front Capital, net of prior contribution payments - $k\",\"Up-front capital - $k\")","v":"Opening Up-front Capital, net of prior contribution payments - $k"},null,null,{"$f":"E8","v":9078.4755654556775},{"$f":"IF(ISNUMBER(G$17),IF('Standard Inputs'!$B$24=Menus!$D$46,F22,F25),0)","v":9078.4755654556775},{"$f":"IF(ISNUMBER(H$17),IF('Standard Inputs'!$B$24=Menus!$D$46,G22,G25),0)","v":9078.4755654556775},{"$f":"IF(ISNUMBER(I$17),IF('Standard Inputs'!$B$24=Menus!$D$46,H22,H25),0)","v":9078.4755654556775},{"$f":"IF(ISNUMBER(J$17),IF('Standard Inputs'!$B$24=Menus!$D$46,I22,I25),0)","v":9078.4755654556775},{"$f":"IF(ISNUMBER(K$17),IF('Standard Inputs'!$B$24=Menus!$D$46,J22,J25),0)","v":9078.4755654556775},{"$f":"IF(ISNUMBER(L$17),IF('Standard Inputs'!$B$24=Menus!$D$46,K22,K25),0)","v":9078.4755654556775},{"$f":"IF(ISNUMBER(M$17),IF('Standard Inputs'!$B$24=Menus!$D$46,L22,L25),0)","v":9078.4755654556775},{"$f":"IF(ISNUMBER(N$17),IF('Standard Inputs'!$B$24=Menus!$D$46,M22,M25),0)","v":9078.4755654556775},{"$f":"IF(ISNUMBER(O$17),IF('Standard Inputs'!$B$24=Menus!$D$46,N22,N25),0)","v":9078.4755654556775},{"$f":"IF(ISNUMBER(P$17),IF('Standard Inputs'!$B$24=Menus!$D$46,O22,O25),0)","v":9078.4755654556775},{"$f":"IF(ISNUMBER(Q$17),IF('Standard Inputs'!$B$24=Menus!$D$46,P22,P25),0)","v":9078.4755654556775},{"$f":"IF(ISNUMBER(R$17),IF('Standard Inputs'!$B$24=Menus!$D$46,Q22,Q25),0)","v":9078.4755654556775},{"$f":"IF(ISNUMBER(S$17),IF('Standard Inputs'!$B$24=Menus!$D$46,R22,R25),0)","v":9078.4755654556775},{"$f":"IF(ISNUMBER(T$17),IF('Standard Inputs'!$B$24=Menus!$D$46,S22,S25),0)","v":9078.4755654556775},{"$f":"IF(ISNUMBER(U$17),IF('Standard Inputs'!$B$24=Menus!$D$46,T22,T25),0)","v":9078.4755654556775},{"$f":"IF(ISNUMBER(V$17),IF('Standard Inputs'!$B$24=Menus!$D$46,U22,U25),0)","v":9078.4755654556775},{"$f":"IF(ISNUMBER(W$17),IF('Standard Inputs'!$B$24=Menus!$D$46,V22,V25),0)","v":9078.4755654556775},{"$f":"IF(ISNUMBER(X$17),IF('Standard Inputs'!$B$24=Menus!$D$46,W22,W25),0)","v":9078.4755654556775},{"$f":"IF(ISNUMBER(Y$17),IF('Standard Inputs'!$B$24=Menus!$D$46,X22,X25),0)","v":9078.4755654556775},{"$f":"IF(ISNUMBER(Z$17),IF('Standard Inputs'!$B$24=Menus!$D$46,Y22,Y25),0)","v":9078.4755654556775},{"$f":"IF(ISNUMBER(AA$17),IF('Standard Inputs'!$B$24=Menus!$D$46,Z22,Z25),0)","v":9078.4755654556775},{"$f":"IF(ISNUMBER(AB$17),IF('Standard Inputs'!$B$24=Menus!$D$46,AA22,AA25),0)","v":9078.4755654556775},{"$f":"IF(ISNUMBER(AC$17),IF('Standard Inputs'!$B$24=Menus!$D$46,AB22,AB25),0)","v":9078.4755654556775},{"$f":"IF(ISNUMBER(AD$17),IF('Standard Inputs'!$B$24=Menus!$D$46,AC22,AC25),0)","v":9078.4755654556775}]
[null,null,"Less: Capital contribution payment/(credit)",null,null,{"$f":"IF(AND(ISNUMBER(F17),'NPV Calc'!C2=\"Yes\"),'Capital Cont Inputs'!C17+'Capital Cont Inputs'!C18+'Capital Cont Inputs'!B17+'Capital Cont Inputs'!B18,0)","v":0},{"$f":"IF(AND(ISNUMBER(G17),'NPV Calc'!C2=\"Yes\"),'Capital Cont Inputs'!D17+'Capital Cont Inputs'!D18,0)","v":0},{"$f":"IF(AND(ISNUMBER(H17),'NPV Calc'!C2=\"Yes\"),'Capital Cont Inputs'!E17+'Capital Cont Inputs'!E18,0)","v":0},{"$f":"IF(AND(ISNUMBER(I17),'NPV Calc'!C2=\"Yes\"),'Capital Cont Inputs'!F17+'Capital Cont Inputs'!F18,0)","v":0},{"$f":"IF(AND(ISNUMBER(J17),'NPV Calc'!C2=\"Yes\"),'Capital Cont Inputs'!G17+'Capital Cont Inputs'!G18,0)","v":0},{"$f":"IF(AND(ISNUMBER(K17),'NPV Calc'!C2=\"Yes\"),'Capital Cont Inputs'!H17+'Capital Cont Inputs'!H18,0)","v":0},{"$f":"IF(AND(ISNUMBER(L17),'NPV Calc'!C2=\"Yes\"),'Capital Cont Inputs'!I17+'Capital Cont Inputs'!I18,0)","v":0},{"$f":"IF(AND(ISNUMBER(M17),'NPV Calc'!C2=\"Yes\"),'Capital Cont Inputs'!J17+'Capital Cont Inputs'!J18,0)","v":0},{"$f":"IF(AND(ISNUMBER(N17),'NPV Calc'!C2=\"Yes\"),'Capital Cont Inputs'!K17+'Capital Cont Inputs'!K18,0)","v":0},{"$f":"IF(AND(ISNUMBER(O17),'NPV Calc'!C2=\"Yes\"),'Capital Cont Inputs'!L17+'Capital Cont Inputs'!L18,0)","v":0},{"$f":"IF(AND(ISNUMBER(P17),'NPV Calc'!C2=\"Yes\"),'Capital Cont Inputs'!M17+'Capital Cont Inputs'!M18,0)","v":0},{"$f":"IF(AND(ISNUMBER(Q17),'NPV Calc'!C2=\"Yes\"),'Capital Cont Inputs'!N17+'Capital Cont Inputs'!N18,0)","v":0},{"$f":"IF(AND(ISNUMBER(R17),'NPV Calc'!C2=\"Yes\"),'Capital Cont Inputs'!O17+'Capital Cont Inputs'!O18,0)","v":0},{"$f":"IF(AND(ISNUMBER(S17),'NPV Calc'!C2=\"Yes\"),'Capital Cont Inputs'!P17+'Capital Cont Inputs'!P18,0)","v":0},{"$f":"IF(AND(ISNUMBER(T17),'NPV Calc'!C2=\"Yes\"),'Capital Cont Inputs'!Q17+'Capital Cont Inputs'!Q18,0)","v":0},{"$f":"IF(AND(ISNUMBER(U17),'NPV Calc'!C2=\"Yes\"),'Capital Cont Inputs'!R17+'Capital Cont Inputs'!R18,0)","v":0},{"$f":"IF(AND(ISNUMBER(V17),'NPV Calc'!C2=\"Yes\"),'Capital Cont Inputs'!S17+'Capital Cont Inputs'!S18,0)","v":0},{"$f":"IF(AND(ISNUMBER(W17),'NPV Calc'!C2=\"Yes\"),'Capital Cont Inputs'!T17+'Capital Cont Inputs'!T18,0)","v":0},{"$f":"IF(AND(ISNUMBER(X17),'NPV Calc'!C2=\"Yes\"),'Capital Cont Inputs'!U17+'Capital Cont Inputs'!U18,0)","v":0},{"$f":"IF(AND(ISNUMBER(Y17),'NPV Calc'!C2=\"Yes\"),'Capital Cont Inputs'!V17+'Capital Cont Inputs'!V18,0)","v":0},{"$f":"IF(AND(ISNUMBER(Z17),'NPV Calc'!C2=\"Yes\"),'Capital Cont Inputs'!W17+'Capital Cont Inputs'!W18,0)","v":0},{"$f":"IF(AND(ISNUMBER(AA17),'NPV Calc'!C2=\"Yes\"),'Capital Cont Inputs'!X17+'Capital Cont Inputs'!X18,0)","v":0},{"$f":"IF(AND(ISNUMBER(AB17),'NPV Calc'!C2=\"Yes\"),'Capital Cont Inputs'!Y17+'Capital Cont Inputs'!Y18,0)","v":0},{"$f":"IF(AND(ISNUMBER(AC17),'NPV Calc'!C2=\"Yes\"),'Capital Cont Inputs'!Z17+'Capital Cont Inputs'!Z18,0)","v":0},{"$f":"IF(AND(ISNUMBER(AD17),'NPV Calc'!C2=\"Yes\"),'Capital Cont Inputs'!AA17+'Capital Cont Inputs'!AA18,0)","v":0}]
[]
[null,null,"Net capital",null,null,{"$f":"IF(ISNUMBER(F17),IF('NPV Calc'!C2=\"No\",'Prelim Calc'!F22,'Prelim Calc'!F22-'Prelim Calc'!F23),0)","v":9078.4755654556775},{"$f":"IF(ISNUMBER(G17),IF('NPV Calc'!C2=\"No\",'Prelim Calc'!G22,'Prelim Calc'!G22-'Prelim Calc'!G23),0)","v":9078.4755654556775},{"$f":"IF(ISNUMBER(H17),IF('NPV Calc'!C2=\"No\",'Prelim Calc'!H22,'Prelim Calc'!H22-'Prelim Calc'!H23),0)","v":9078.4755654556775},{"$f":"IF(ISNUMBER(I17),IF('NPV Calc'!C2=\"No\",'Prelim Calc'!I22,'Prelim Calc'!I22-'Prelim Calc'!I23),0)","v":9078.4755654556775},{"$f":"IF(ISNUMBER(J17),IF('NPV Calc'!C2=\"No\",'Prelim Calc'!J22,'Prelim Calc'!J22-'Prelim Calc'!J23),0)","v":9078.4755654556775},{"$f":"IF(ISNUMBER(K17),IF('NPV Calc'!C2=\"No\",'Prelim Calc'!K22,'Prelim Calc'!K22-'Prelim Calc'!K23),0)","v":9078.4755654556775},{"$f":"IF(ISNUMBER(L17),IF('NPV Calc'!C2=\"No\",'Prelim Calc'!L22,'Prelim Calc'!L22-'Prelim Calc'!L23),0)","v":9078.4755654556775},{"$f":"IF(ISNUMBER(M17),IF('NPV Calc'!C2=\"No\",'Prelim Calc'!M22,'Prelim Calc'!M22-'Prelim Calc'!M23),0)","v":9078.4755654556775},{"$f":"IF(ISNUMBER(N17),IF('NPV Calc'!C2=\"No\",'Prelim Calc'!N22,'Prelim Calc'!N22-'Prelim Calc'!N23),0)","v":9078.4755654556775},{"$f":"IF(ISNUMBER(O17),IF('NPV Calc'!C2=\"No\",'Prelim Calc'!O22,'Prelim Calc'!O22-'Prelim Calc'!O23),0)","v":9078.4755654556775},{"$f":"IF(ISNUMBER(P17),IF('NPV Calc'!C2=\"No\",'Prelim Calc'!P22,'Prelim Calc'!P22-'Prelim Calc'!P23),0)","v":9078.4755654556775},{"$f":"IF(ISNUMBER(Q17),IF('NPV Calc'!C2=\"No\",'Prelim Calc'!Q22,'Prelim Calc'!Q22-'Prelim Calc'!Q23),0)","v":9078.4755654556775},{"$f":"IF(ISNUMBER(R17),IF('NPV Calc'!C2=\"No\",'Prelim Calc'!R22,'Prelim Calc'!R22-'Prelim Calc'!R23),0)","v":9078.4755654556775},{"$f":"IF(ISNUMBER(S17),IF('NPV Calc'!C2=\"No\",'Prelim Calc'!S22,'Prelim Calc'!S22-'Prelim Calc'!S23),0)","v":9078.4755654556775},{"$f":"IF(ISNUMBER(T17),IF('NPV Calc'!C2=\"No\",'Prelim Calc'!T22,'Prelim Calc'!T22-'Prelim Calc'!T23),0)","v":9078.4755654556775},{"$f":"IF(ISNUMBER(U17),IF('NPV Calc'!C2=\"No\",'Prelim Calc'!U22,'Prelim Calc'!U22-'Prelim Calc'!U23),0)","v":9078.4755654556775},{"$f":"IF(ISNUMBER(V17),IF('NPV Calc'!C2=\"No\",'Prelim Calc'!V22,'Prelim Calc'!V22-'Prelim Calc'!V23),0)","v":9078.4755654556775},{"$f":"IF(ISNUMBER(W17),IF('NPV Calc'!C2=\"No\",'Prelim Calc'!W22,'Prelim Calc'!W22-'Prelim Calc'!W23),0)","v":9078.4755654556775},{"$f":"IF(ISNUMBER(X17),IF('NPV Calc'!C2=\"No\",'Prelim Calc'!X22,'Prelim Calc'!X22-'Prelim Calc'!X23),0)","v":9078.4755654556775},{"$f":"IF(ISNUMBER(Y17),IF('NPV Calc'!C2=\"No\",'Prelim Calc'!Y22,'Prelim Calc'!Y22-'Prelim Calc'!Y23),0)","v":9078.4755654556775},{"$f":"IF(ISNUMBER(Z17),IF('NPV Calc'!C2=\"No\",'Prelim Calc'!Z22,'Prelim Calc'!Z22-'Prelim Calc'!Z23),0)","v":9078.4755654556775},{"$f":"IF(ISNUMBER(AA17),IF('NPV Calc'!C2=\"No\",'Prelim Calc'!AA22,'Prelim Calc'!AA22-'Prelim Calc'!AA23),0)","v":9078.4755654556775},{"$f":"IF(ISNUMBER(AB17),IF('NPV Calc'!C2=\"No\",'Prelim Calc'!AB22,'Prelim Calc'!AB22-'Prelim Calc'!AB23),0)","v":9078.4755654556775},{"$f":"IF(ISNUMBER(AC17),IF('NPV Calc'!C2=\"No\",'Prelim Calc'!AC22,'Prelim Calc'!AC22-'Prelim Calc'!AC23),0)","v":9078.4755654556775},{"$f":"IF(ISNUMBER(AD17),IF('NPV Calc'!C2=\"No\",'Prelim Calc'!AD22,'Prelim Calc'!AD22-'Prelim Calc'!AD23),0)","v":9078.4755654556775}]
[]
[null,null,"Municipal tax rate",null,null,{"$f":"'Standard Inputs'!B25","v":6.2518373346398823E-3},{"$f":"IF(ISNUMBER(G$17),F27,0)","v":6.2518373346398823E-3},{"$f":"IF(ISNUMBER(H$17),G27,0)","v":6.2518373346398823E-3},6.2518373346398823E-3,6.2518373346398823E-3,6.2518373346398823E-3,6.2518373346398823E-3,6.2518373346398823E-3,6.2518373346398823E-3,6.2518373346398823E-3,6.2518373346398823E-3,6.2518373346398823E-3,6.2518373346398823E-3,6.2518373346398823E-3,6.2518373346398823E-3,6.2518373346398823E-3,6.2518373346398823E-3,6.2518373346398823E-3,6.2518373346398823E-3,6.2518373346398823E-3,6.2518373346398823E-3,6.2518373346398823E-3,6.2518373346398823E-3,6.2518373346398823E-3,6.2518373346398823E-3]
[]
[null,null,"Municipal tax - $k",null,null,{"$f":"IF('Standard Inputs'!$B$24=Menus!$D$45,IF(ISNUMBER(F17),F25*F27,0),IF(ISNUMBER(F17),F22*F27,0))","v":56.757152481731723},{"$f":"IF('Standard Inputs'!$B$24=Menus!$D$45,IF(ISNUMBER(G17),G25*G27,0),IF(ISNUMBER(G17),G22*G27,0))","v":56.757152481731723},{"$f":"IF('Standard Inputs'!$B$24=Menus!$D$45,IF(ISNUMBER(H17),H25*H27,0),IF(ISNUMBER(H17),H22*H27,0))","v":56.757152481731723},{"$f":"IF('Standard Inputs'!$B$24=Menus!$D$45,IF(ISNUMBER(I17),I25*I27,0),IF(ISNUMBER(I17),I22*I27,0))","v":56.757152481731723},{"$f":"IF('Standard Inputs'!$B$24=Menus!$D$45,IF(ISNUMBER(J17),J25*J27,0),IF(ISNUMBER(J17),J22*J27,0))","v":56.757152481731723},{"$f":"IF('Standard Inputs'!$B$24=Menus!$D$45,IF(ISNUMBER(K17),K25*K27,0),IF(ISNUMBER(K17),K22*K27,0))","v":56.757152481731723},{"$f":"IF('Standard Inputs'!$B$24=Menus!$D$45,IF(ISNUMBER(L17),L25*L27,0),IF(ISNUMBER(L17),L22*L27,0))","v":56.757152481731723},{"$f":"IF('Standard Inputs'!$B$24=Menus!$D$45,IF(ISNUMBER(M17),M25*M27,0),IF(ISNUMBER(M17),M22*M27,0))","v":56.757152481731723},{"$f":"IF('Standard Inputs'!$B$24=Menus!$D$45,IF(ISNUMBER(N17),N25*N27,0),IF(ISNUMBER(N17),N22*N27,0))","v":56.757152481731723},{"$f":"IF('Standard Inputs'!$B$24=Menus!$D$45,IF(ISNUMBER(O17),O25*O27,0),IF(ISNUMBER(O17),O22*O27,0))","v":56.757152481731723},{"$f":"IF('Standard Inputs'!$B$24=Menus!$D$45,IF(ISNUMBER(P17),P25*P27,0),IF(ISNUMBER(P17),P22*P27,0))","v":56.757152481731723},{"$f":"IF('Standard Inputs'!$B$24=Menus!$D$45,IF(ISNUMBER(Q17),Q25*Q27,0),IF(ISNUMBER(Q17),Q22*Q27,0))","v":56.757152481731723},{"$f":"IF('Standard Inputs'!$B$24=Menus!$D$45,IF(ISNUMBER(R17),R25*R27,0),IF(ISNUMBER(R17),R22*R27,0))","v":56.757152481731723},{"$f":"IF('Standard Inputs'!$B$24=Menus!$D$45,IF(ISNUMBER(S17),S25*S27,0),IF(ISNUMBER(S17),S22*S27,0))","v":56.757152481731723},{"$f":"IF('Standard Inputs'!$B$24=Menus!$D$45,IF(ISNUMBER(T17),T25*T27,0),IF(ISNUMBER(T17),T22*T27,0))","v":56.757152481731723},{"$f":"IF('Standard Inputs'!$B$24=Menus!$D$45,IF(ISNUMBER(U17),U25*U27,0),IF(ISNUMBER(U17),U22*U27,0))","v":56.757152481731723},{"$f":"IF('Standard Inputs'!$B$24=Menus!$D$45,IF(ISNUMBER(V17),V25*V27,0),IF(ISNUMBER(V17),V22*V27,0))","v":56.757152481731723},{"$f":"IF('Standard Inputs'!$B$24=Menus!$D$45,IF(ISNUMBER(W17),W25*W27,0),IF(ISNUMBER(W17),W22*W27,0))","v":56.757152481731723},{"$f":"IF('Standard Inputs'!$B$24=Menus!$D$45,IF(ISNUMBER(X17),X25*X27,0),IF(ISNUMBER(X17),X22*X27,0))","v":56.757152481731723},{"$f":"IF('Standard Inputs'!$B$24=Menus!$D$45,IF(ISNUMBER(Y17),Y25*Y27,0),IF(ISNUMBER(Y17),Y22*Y27,0))","v":56.757152481731723},{"$f":"IF('Standard Inputs'!$B$24=Menus!$D$45,IF(ISNUMBER(Z17),Z25*Z27,0),IF(ISNUMBER(Z17),Z22*Z27,0))","v":56.757152481731723},{"$f":"IF('Standard Inputs'!$B$24=Menus!$D$45,IF(ISNUMBER(AA17),AA25*AA27,0),IF(ISNUMBER(AA17),AA22*AA27,0))","v":56.757152481731723},{"$f":"IF('Standard Inputs'!$B$24=Menus!$D$45,IF(ISNUMBER(AB17),AB25*AB27,0),IF(ISNUMBER(AB17),AB22*AB27,0))","v":56.757152481731723},{"$f":"IF('Standard Inputs'!$B$24=Menus!$D$45,IF(ISNUMBER(AC17),AC25*AC27,0),IF(ISNUMBER(AC17),AC22*AC27,0))","v":56.757152481731723},{"$f":"IF('Standard Inputs'!$B$24=Menus!$D$45,IF(ISNUMBER(AD17),AD25*AD27,0),IF(ISNUMBER(AD17),AD22*AD27,0))","v":56.757152481731723}]
[]
[]
[]
[null,null,"Calculation of Working Capital"]
[null,null,{"$f":"C17","v":"Project Year:"},null,null,{"$f":"'Capital Cont Inputs'!C16","v":1},{"$f":"'Capital Cont Inputs'!D16","v":2},{"$f":"'Capital Cont Inputs'!E16","v":3},{"$f":"'Capital Cont Inputs'!F16","v":4},{"$f":"'Capital Cont Inputs'!G16","v":5},{"$f":"'Capital Cont Inputs'!H16","v":6},{"$f":"'Capital Cont Inputs'!I16","v":7},{"$f":"'Capital Cont Inputs'!J16","v":8},{"$f":"'Capital Cont Inputs'!K16","v":9},{"$f":"'Capital Cont Inputs'!L16","v":10},{"$f":"'Capital Cont Inputs'!M16","v":11},{"$f":"'Capital Cont Inputs'!N16","v":12},{"$f":"'Capital Cont Inputs'!O16","v":13},{"$f":"'Capital Cont Inputs'!P16","v":14},{"$f":"'Capital Cont Inputs'!Q16","v":15},{"$f":"'Capital Cont Inputs'!R16","v":16},{"$f":"'Capital Cont Inputs'!S16","v":17},{"$f":"'Capital Cont Inputs'!T16","v":18},{"$f":"'Capital Cont Inputs'!U16","v":19},{"$f":"'Capital Cont Inputs'!V16","v":20},{"$f":"'Capital Cont Inputs'!W16","v":21},{"$f":"'Capital Cont Inputs'!X16","v":22},{"$f":"'Capital Cont Inputs'!Y16","v":23},{"$f":"'Capital Cont Inputs'!Z16","v":24},{"$f":"'Capital Cont Inputs'!AA16","v":25}]
[null,null,{"$f":"C18","v":"Year Ended:"},null,null,{"$f":"'Capital Cont Inputs'!C15","v":2010},{"$f":"'Capital Cont Inputs'!D15","v":2011},{"$f":"'Capital Cont Inputs'!E15","v":2012},{"$f":"'Capital Cont Inputs'!F15","v":2013},{"$f":"'Capital Cont Inputs'!G15","v":2014},{"$f":"'Capital Cont Inputs'!H15","v":2015},{"$f":"'Capital Cont Inputs'!I15","v":2016},{"$f":"'Capital Cont Inputs'!J15","v":2017},{"$f":"'Capital Cont Inputs'!K15","v":2018},{"$f":"'Capital Cont Inputs'!L15","v":2019},{"$f":"'Capital Cont Inputs'!M15","v":2020},{"$f":"'Capital Cont Inputs'!N15","v":2021},{"$f":"'Capital Cont Inputs'!O15","v":2022},{"$f":"'Capital Cont Inputs'!P15","v":2023},{"$f":"'Capital Cont Inputs'!Q15","v":2024},{"$f":"'Capital Cont Inputs'!R15","v":2025},{"$f":"'Capital Cont Inputs'!S15","v":2026},{"$f":"'Capital Cont Inputs'!T15","v":2027},{"$f":"'Capital Cont Inputs'!U15","v":2028},{"$f":"'Capital Cont Inputs'!V15","v":2029},{"$f":"'Capital Cont Inputs'!W15","v":2030},{"$f":"'Capital Cont Inputs'!X15","v":2031},{"$f":"'Capital Cont Inputs'!Y15","v":2032},{"$f":"'Capital Cont Inputs'!Z15","v":2033},{"$f":"'Capital Cont Inputs'!AA15","v":2034}]
[]
[null,null,"Annual OM&A cost - $k",null,null,{"$f":"'Project Inputs'!C70","v":42},{"$f":"'Project Inputs'!D70","v":42},{"$f":"'Project Inputs'!E70","v":42},{"$f":"'Project Inputs'!F70","v":42},{"$f":"'Project Inputs'!G70","v":42},{"$f":"'Project Inputs'!H70","v":42},{"$f":"'Project Inputs'!I70","v":42},{"$f":"'Project Inputs'!J70","v":42},{"$f":"'Project Inputs'!K70","v":42},{"$f":"'Project Inputs'!L70","v":42},{"$f":"'Project Inputs'!M70","v":42},{"$f":"'Project Inputs'!N70","v":42},{"$f":"'Project Inputs'!O70","v":42},{"$f":"'Project Inputs'!P70","v":42},{"$f":"'Project Inputs'!Q70","v":42},{"$f":"'Project Inputs'!R70","v":65},{"$f":"'Project Inputs'!S70","v":65},{"$f":"'Project Inputs'!T70","v":65},{"$f":"'Project Inputs'!U70","v":65},{"$f":"'Project Inputs'!V70","v":65},{"$f":"'Project Inputs'!W70","v":65},{"$f":"'Project Inputs'!X70","v":65},{"$f":"'Project Inputs'!Y70","v":65},{"$f":"'Project Inputs'!Z70","v":65},{"$f":"'Project Inputs'!AA70","v":65}]
[null,null,"Incremental OM&A cost compared with prior year - $k",null,null,{"$f":"F37","v":42},{"$f":"G37-F37","v":0},0,0,0,0,0,0,0,0,0,0,0,0,0,23,0,0,0,0,0,0,0,0,0]
[]
[null,null,"Net Lag / 365",null,null,{"$f":"'Standard Inputs'!$B$41","v":4.8630136986301371E-2},{"$f":"IF(ISNUMBER(F34),'Standard Inputs'!$B$41,0)","v":4.8630136986301371E-2},{"$f":"IF(ISNUMBER(G34),'Standard Inputs'!$B$41,0)","v":4.8630136986301371E-2},{"$f":"IF(ISNUMBER(H34),'Standard Inputs'!$B$41,0)","v":4.8630136986301371E-2},{"$f":"IF(ISNUMBER(I34),'Standard Inputs'!$B$41,0)","v":4.8630136986301371E-2},{"$f":"IF(ISNUMBER(J34),'Standard Inputs'!$B$41,0)","v":4.8630136986301371E-2},{"$f":"IF(ISNUMBER(K34),'Standard Inputs'!$B$41,0)","v":4.8630136986301371E-2},{"$f":"IF(ISNUMBER(L34),'Standard Inputs'!$B$41,0)","v":4.8630136986301371E-2},{"$f":"IF(ISNUMBER(M34),'Standard Inputs'!$B$41,0)","v":4.8630136986301371E-2},{"$f":"IF(ISNUMBER(N34),'Standard Inputs'!$B$41,0)","v":4.8630136986301371E-2},{"$f":"IF(ISNUMBER(O34),'Standard Inputs'!$B$41,0)","v":4.8630136986301371E-2},{"$f":"IF(ISNUMBER(P34),'Standard Inputs'!$B$41,0)","v":4.8630136986301371E-2},{"$f":"IF(ISNUMBER(Q34),'Standard Inputs'!$B$41,0)","v":4.8630136986301371E-2},{"$f":"IF(ISNUMBER(R34),'Standard Inputs'!$B$41,0)","v":4.8630136986301371E-2},{"$f":"IF(ISNUMBER(S34),'Standard Inputs'!$B$41,0)","v":4.8630136986301371E-2},{"$f":"IF(ISNUMBER(T34),'Standard Inputs'!$B$41,0)","v":4.8630136986301371E-2},{"$f":"IF(ISNUMBER(U34),'Standard Inputs'!$B$41,0)","v":4.8630136986301371E-2},{"$f":"IF(ISNUMBER(V34),'Standard Inputs'!$B$41,0)","v":4.8630136986301371E-2},{"$f":"IF(ISNUMBER(W34),'Standard Inputs'!$B$41,0)","v":4.8630136986301371E-2},{"$f":"IF(ISNUMBER(X34),'Standard Inputs'!$B$41,0)","v":4.8630136986301371E-2},{"$f":"IF(ISNUMBER(Y34),'Standard Inputs'!$B$41,0)","v":4.8630136986301371E-2},{"$f":"IF(ISNUMBER(Z34),'Standard Inputs'!$B$41,0)","v":4.8630136986301371E-2},{"$f":"IF(ISNUMBER(AA34),'Standard Inputs'!$B$41,0)","v":4.8630136986301371E-2},{"$f":"IF(ISNUMBER(AB34),'Standard Inputs'!$B$41,0)","v":4.8630136986301371E-2},{"$f":"IF(ISNUMBER(AC34),'Standard Inputs'!$B$41,0)","v":4.8630136986301371E-2}]
[]
[null,null,"Annual working cash impact - $k",null,null,{"$f":"F38*F40","v":2.0424657534246577},{"$f":"G38*G40","v":0},0,0,0,0,0,0,0,0,0,0,0,0,0,1.1184931506849316,0,0,0,0,0,0,0,0,0]
[]
[null,null,"Cumulative working cash impact - $k",null,null,{"$f":"IF(ISNUMBER(F34),F42+D44,0)","v":2.0424657534246577},{"$f":"IF(ISNUMBER(G34),G42+F44,0)","v":2.0424657534246577},2.0424657534246577,2.0424657534246577,2.0424657534246577,2.0424657534246577,2.0424657534246577,2.0424657534246577,2.0424657534246577,2.0424657534246577,2.0424657534246577,2.0424657534246577,2.0424657534246577,2.0424657534246577,2.0424657534246577,3.1609589041095894,3.1609589041095894,3.1609589041095894,3.1609589041095894,3.1609589041095894,3.1609589041095894,3.1609589041095894,3.1609589041095894,3.1609589041095894,3.1609589041095894]
[]
[null,null,"Reversal of cumulative working cash impact - $k",null,null,{"$f":"IF(ISNUMBER(G34),0,-F44)","v":0},0,0,0,0,0,0,0,0,0,0,0,0,0,0,0,0,0,0,0,0,0,0,0,{"$f":"IF(ISNUMBER(#REF!),0,-AD44)","v":-3.1609589041095894}]
[]
[null,null,"Net annual working cash impact - $k",null,null,{"$f":"IF(ISNUMBER(F35),F42+F46,0)","v":2.0424657534246577},0,0,0,0,0,0,0,0,0,0,0,0,0,0,1.1184931506849316,0,0,0,0,0,0,0,0,-3.1609589041095894]
[]
[]
[]
[null,null,"Summary of Load Forecast"]
[]
[]
[null,null,"Calendar Year Load Forecast Summary",null,{"$f":"'Capital Cont Inputs'!B15","v":2009},{"$f":"'Capital Cont Inputs'!C15","v":2010},{"$f":"'Capital Cont Inputs'!D15","v":2011},{"$f":"'Capital Cont Inputs'!E15","v":2012},{"$f":"'Capital Cont Inputs'!F15","v":2013},{"$f":"'Capital Cont Inputs'!G15","v":2014},{"$f":"'Capital Cont Inputs'!H15","v":2015},{"$f":"'Capital Cont Inputs'!I15","v":2016},{"$f":"'Capital Cont Inputs'!J15","v":2017},{"$f":"'Capital Cont Inputs'!K15","v":2018},{"$f":"'Capital Cont Inputs'!L15","v":2019},{"$f":"'Capital Cont Inputs'!M15","v":2020},{"$f":"'Capital Cont Inputs'!N15","v":2021},{"$f":"'Capital Cont Inputs'!O15","v":2022},{"$f":"'Capital Cont Inputs'!P15","v":2023},{"$f":"'Capital Cont Inputs'!Q15","v":2024},{"$f":"'Capital Cont Inputs'!R15","v":2025},{"$f":"'Capital Cont Inputs'!S15","v":2026},{"$f":"'Capital Cont Inputs'!T15","v":2027},{"$f":"'Capital Cont Inputs'!U15","v":2028},{"$f":"'Capital Cont Inputs'!V15","v":2029},{"$f":"'Capital Cont Inputs'!W15","v":2030},{"$f":"'Capital Cont Inputs'!X15","v":2031},{"$f":"'Capital Cont Inputs'!Y15","v":2032},{"$f":"'Capital Cont Inputs'!Z15","v":2033},{"$f":"'Capital Cont Inputs'!AA15","v":2034}]
[null,null,"Load (MW / month)",null,{"$f":"IF(ISNUMBER(E55),IF('Project Inputs'!$B$75=\"Calendar Year\",'Project Inputs'!B81,\"N/A\"),0)","v":"N/A"},{"$f":"IF(E56=\"N/A\",\"N/A\",IF(ISNUMBER(F55),IF('Project Inputs'!$B$75=\"Calendar Year\",'Project Inputs'!C81,\"N/A\"),0))","v":"N/A"},{"$f":"IF(F56=\"N/A\",\"N/A\",IF(ISNUMBER(G55),IF('Project Inputs'!$B$75=\"Calendar Year\",'Project Inputs'!D81,\"N/A\"),0))","v":"N/A"},{"$f":"IF(G56=\"N/A\",\"N/A\",IF(ISNUMBER(H55),IF('Project Inputs'!$B$75=\"Calendar Year\",'Project Inputs'!E81,\"N/A\"),0))","v":"N/A"},{"$f":"IF(H56=\"N/A\",\"N/A\",IF(ISNUMBER(I55),IF('Project Inputs'!$B$75=\"Calendar Year\",'Project Inputs'!F81,\"N/A\"),0))","v":"N/A"},{"$f":"IF(I56=\"N/A\",\"N/A\",IF(ISNUMBER(J55),IF('Project Inputs'!$B$75=\"Calendar Year\",'Project Inputs'!G81,\"N/A\"),0))","v":"N/A"},{"$f":"IF(J56=\"N/A\",\"N/A\",IF(ISNUMBER(K55),IF('Project Inputs'!$B$75=\"Calendar Year\",'Project Inputs'!H81,\"N/A\"),0))","v":"N/A"},{"$f":"IF(K56=\"N/A\",\"N/A\",IF(ISNUMBER(L55),IF('Project Inputs'!$B$75=\"Calendar Year\",'Project Inputs'!I81,\"N/A\"),0))","v":"N/A"},{"$f":"IF(L56=\"N/A\",\"N/A\",IF(ISNUMBER(M55),IF('Project Inputs'!$B$75=\"Calendar Year\",'Project Inputs'!J81,\"N/A\"),0))","v":"N/A"},{"$f":"IF(M56=\"N/A\",\"N/A\",IF(ISNUMBER(N55),IF('Project Inputs'!$B$75=\"Calendar Year\",'Project Inputs'!K81,\"N/A\"),0))","v":"N/A"},{"$f":"IF(N56=\"N/A\",\"N/A\",IF(ISNUMBER(O55),IF('Project Inputs'!$B$75=\"Calendar Year\",'Project Inputs'!L81,\"N/A\"),0))","v":"N/A"},{"$f":"IF(O56=\"N/A\",\"N/A\",IF(ISNUMBER(P55),IF('Project Inputs'!$B$75=\"Calendar Year\",'Project Inputs'!M81,\"N/A\"),0))","v":"N/A"},{"$f":"IF(P56=\"N/A\",\"N/A\",IF(ISNUMBER(Q55),IF('Project Inputs'!$B$75=\"Calendar Year\",'Project Inputs'!N81,\"N/A\"),0))","v":"N/A"},{"$f":"IF(Q56=\"N/A\",\"N/A\",IF(ISNUMBER(R55),IF('Project Inputs'!$B$75=\"Calendar Year\",'Project Inputs'!O81,\"N/A\"),0))","v":"N/A"},{"$f":"IF(R56=\"N/A\",\"N/A\",IF(ISNUMBER(S55),IF('Project Inputs'!$B$75=\"Calendar Year\",'Project Inputs'!P81,\"N/A\"),0))","v":"N/A"},{"$f":"IF(S56=\"N/A\",\"N/A\",IF(ISNUMBER(T55),IF('Project Inputs'!$B$75=\"Calendar Year\",'Project Inputs'!Q81,\"N/A\"),0))","v":"N/A"},{"$f":"IF(T56=\"N/A\",\"N/A\",IF(ISNUMBER(U55),IF('Project Inputs'!$B$75=\"Calendar Year\",'Project Inputs'!R81,\"N/A\"),0))","v":"N/A"},{"$f":"IF(U56=\"N/A\",\"N/A\",IF(ISNUMBER(V55),IF('Project Inputs'!$B$75=\"Calendar Year\",'Project Inputs'!S81,\"N/A\"),0))","v":"N/A"},{"$f":"IF(V56=\"N/A\",\"N/A\",IF(ISNUMBER(W55),IF('Project Inputs'!$B$75=\"Calendar Year\",'Project Inputs'!T81,\"N/A\"),0))","v":"N/A"},{"$f":"IF(W56=\"N/A\",\"N/A\",IF(ISNUMBER(X55),IF('Project Inputs'!$B$75=\"Calendar Year\",'Project Inputs'!U81,\"N/A\"),0))","v":"N/A"},{"$f":"IF(X56=\"N/A\",\"N/A\",IF(ISNUMBER(Y55),IF('Project Inputs'!$B$75=\"Calendar Year\",'Project Inputs'!V81,\"N/A\"),0))","v":"N/A"},{"$f":"IF(Y56=\"N/A\",\"N/A\",IF(ISNUMBER(Z55),IF('Project Inputs'!$B$75=\"Calendar Year\",'Project Inputs'!W81,\"N/A\"),0))","v":"N/A"},{"$f":"IF(Z56=\"N/A\",\"N/A\",IF(ISNUMBER(AA55),IF('Project Inputs'!$B$75=\"Calendar Year\",'Project Inputs'!X81,\"N/A\"),0))","v":"N/A"},{"$f":"IF(AA56=\"N/A\",\"N/A\",IF(ISNUMBER(AB55),IF('Project Inputs'!$B$75=\"Calendar Year\",'Project Inputs'!Y81,\"N/A\"),0))","v":"N/A"},{"$f":"IF(AB56=\"N/A\",\"N/A\",IF(ISNUMBER(AC55),IF('Project Inputs'!$B$75=\"Calendar Year\",'Project Inputs'!Z81,\"N/A\"),0))","v":"N/A"},{"$f":"IF(AC56=\"N/A\",\"N/A\",IF(ISNUMBER(AD55),IF('Project Inputs'!$B$75=\"Calendar Year\",'Project Inputs'!AA81,\"N/A\"),0))","v":"N/A"}]
[null,null,"Load adjustments (MW / month)",null,{"$f":"IF(ISNUMBER(E55),IF('Project Inputs'!$B$75=\"Calendar Year\",'Project Inputs'!B82,\"N/A\"),0)","v":"N/A"},{"$f":"IF(E57=\"N/A\",\"N/A\",IF(ISNUMBER(F55),IF('Project Inputs'!$B$75=\"Calendar Year\",'Project Inputs'!C82,\"N/A\"),0))","v":"N/A"},{"$f":"IF(F57=\"N/A\",\"N/A\",IF(ISNUMBER(G55),IF('Project Inputs'!$B$75=\"Calendar Year\",'Project Inputs'!D82,\"N/A\"),0))","v":"N/A"},{"$f":"IF(G57=\"N/A\",\"N/A\",IF(ISNUMBER(H55),IF('Project Inputs'!$B$75=\"Calendar Year\",'Project Inputs'!E82,\"N/A\"),0))","v":"N/A"},{"$f":"IF(H57=\"N/A\",\"N/A\",IF(ISNUMBER(I55),IF('Project Inputs'!$B$75=\"Calendar Year\",'Project Inputs'!F82,\"N/A\"),0))","v":"N/A"},{"$f":"IF(I57=\"N/A\",\"N/A\",IF(ISNUMBER(J55),IF('Project Inputs'!$B$75=\"Calendar Year\",'Project Inputs'!G82,\"N/A\"),0))","v":"N/A"},{"$f":"IF(J57=\"N/A\",\"N/A\",IF(ISNUMBER(K55),IF('Project Inputs'!$B$75=\"Calendar Year\",'Project Inputs'!H82,\"N/A\"),0))","v":"N/A"},{"$f":"IF(K57=\"N/A\",\"N/A\",IF(ISNUMBER(L55),IF('Project Inputs'!$B$75=\"Calendar Year\",'Project Inputs'!I82,\"N/A\"),0))","v":"N/A"},{"$f":"IF(L57=\"N/A\",\"N/A\",IF(ISNUMBER(M55),IF('Project Inputs'!$B$75=\"Calendar Year\",'Project Inputs'!J82,\"N/A\"),0))","v":"N/A"},{"$f":"IF(M57=\"N/A\",\"N/A\",IF(ISNUMBER(N55),IF('Project Inputs'!$B$75=\"Calendar Year\",'Project Inputs'!K82,\"N/A\"),0))","v":"N/A"},{"$f":"IF(N57=\"N/A\",\"N/A\",IF(ISNUMBER(O55),IF('Project Inputs'!$B$75=\"Calendar Year\",'Project Inputs'!L82,\"N/A\"),0))","v":"N/A"},{"$f":"IF(O57=\"N/A\",\"N/A\",IF(ISNUMBER(P55),IF('Project Inputs'!$B$75=\"Calendar Year\",'Project Inputs'!M82,\"N/A\"),0))","v":"N/A"},{"$f":"IF(P57=\"N/A\",\"N/A\",IF(ISNUMBER(Q55),IF('Project Inputs'!$B$75=\"Calendar Year\",'Project Inputs'!N82,\"N/A\"),0))","v":"N/A"},{"$f":"IF(Q57=\"N/A\",\"N/A\",IF(ISNUMBER(R55),IF('Project Inputs'!$B$75=\"Calendar Year\",'Project Inputs'!O82,\"N/A\"),0))","v":"N/A"},{"$f":"IF(R57=\"N/A\",\"N/A\",IF(ISNUMBER(S55),IF('Project Inputs'!$B$75=\"Calendar Year\",'Project Inputs'!P82,\"N/A\"),0))","v":"N/A"},{"$f":"IF(S57=\"N/A\",\"N/A\",IF(ISNUMBER(T55),IF('Project Inputs'!$B$75=\"Calendar Year\",'Project Inputs'!Q82,\"N/A\"),0))","v":"N/A"},{"$f":"IF(T57=\"N/A\",\"N/A\",IF(ISNUMBER(U55),IF('Project Inputs'!$B$75=\"Calendar Year\",'Project Inputs'!R82,\"N/A\"),0))","v":"N/A"},{"$f":"IF(U57=\"N/A\",\"N/A\",IF(ISNUMBER(V55),IF('Project Inputs'!$B$75=\"Calendar Year\",'Project Inputs'!S82,\"N/A\"),0))","v":"N/A"},{"$f":"IF(V57=\"N/A\",\"N/A\",IF(ISNUMBER(W55),IF('Project Inputs'!$B$75=\"Calendar Year\",'Project Inputs'!T82,\"N/A\"),0))","v":"N/A"},{"$f":"IF(W57=\"N/A\",\"N/A\",IF(ISNUMBER(X55),IF('Project Inputs'!$B$75=\"Calendar Year\",'Project Inputs'!U82,\"N/A\"),0))","v":"N/A"},{"$f":"IF(X57=\"N/A\",\"N/A\",IF(ISNUMBER(Y55),IF('Project Inputs'!$B$75=\"Calendar Year\",'Project Inputs'!V82,\"N/A\"),0))","v":"N/A"},{"$f":"IF(Y57=\"N/A\",\"N/A\",IF(ISNUMBER(Z55),IF('Project Inputs'!$B$75=\"Calendar Year\",'Project Inputs'!W82,\"N/A\"),0))","v":"N/A"},{"$f":"IF(Z57=\"N/A\",\"N/A\",IF(ISNUMBER(AA55),IF('Project Inputs'!$B$75=\"Calendar Year\",'Project Inputs'!X82,\"N/A\"),0))","v":"N/A"},{"$f":"IF(AA57=\"N/A\",\"N/A\",IF(ISNUMBER(AB55),IF('Project Inputs'!$B$75=\"Calendar Year\",'Project Inputs'!Y82,\"N/A\"),0))","v":"N/A"},{"$f":"IF(AB57=\"N/A\",\"N/A\",IF(ISNUMBER(AC55),IF('Project Inputs'!$B$75=\"Calendar Year\",'Project Inputs'!Z82,\"N/A\"),0))","v":"N/A"},{"$f":"IF(AC57=\"N/A\",\"N/A\",IF(ISNUMBER(AD55),IF('Project Inputs'!$B$75=\"Calendar Year\",'Project Inputs'!AA82,\"N/A\"),0))","v":"N/A"}]
[null,null,"Forecasted load (MW / calendar year)",null,{"$f":"SUM(E56:E57)","v":0},{"$f":"IF(F57=\"N/A\",\"N/A\",SUM(F56:F57))","v":"N/A"},{"$f":"IF(G57=\"N/A\",\"N/A\",SUM(G56:G57))","v":"N/A"},"N/A","N/A","N/A","N/A","N/A","N/A","N/A","N/A","N/A","N/A","N/A","N/A","N/A","N/A","N/A","N/A","N/A","N/A","N/A","N/A","N/A","N/A","N/A"]
[]
[null,null,"* In-Service Month ",null,null,{"$f":"IF(ISNUMBER(F55),IF('Project Inputs'!$B$75=\"Calendar Year\",IF(DAY('Project Inputs'!B15)<15,MONTH('Project Inputs'!B15)-1,MONTH('Project Inputs'!B15)),\"N/A\"),0)","v":"N/A"},{"$f":"IF(F60=\"N/A\",\"N/A\",IF(ISNUMBER(G55),F60,0))","v":"N/A"},{"$f":"IF(G60=\"N/A\",\"N/A\",IF(ISNUMBER(H55),G60,0))","v":"N/A"},"N/A","N/A","N/A","N/A","N/A","N/A","N/A","N/A","N/A","N/A","N/A","N/A","N/A","N/A","N/A","N/A","N/A","N/A","N/A","N/A","N/A","N/A"]
[null,null,"*if = 0, means In-Service falls between Jan 1- 15"]
[null,null,{"$f":"C34","v":"Project Year:"},null,null,{"$f":"'Capital Cont Inputs'!C16","v":1},{"$f":"'Capital Cont Inputs'!D16","v":2},{"$f":"'Capital Cont Inputs'!E16","v":3},{"$f":"'Capital Cont Inputs'!F16","v":4},{"$f":"'Capital Cont Inputs'!G16","v":5},{"$f":"'Capital Cont Inputs'!H16","v":6},{"$f":"'Capital Cont Inputs'!I16","v":7},{"$f":"'Capital Cont Inputs'!J16","v":8},{"$f":"'Capital Cont Inputs'!K16","v":9},{"$f":"'Capital Cont Inputs'!L16","v":10},{"$f":"'Capital Cont Inputs'!M16","v":11},{"$f":"'Capital Cont Inputs'!N16","v":12},{"$f":"'Capital Cont Inputs'!O16","v":13},{"$f":"'Capital Cont Inputs'!P16","v":14},{"$f":"'Capital Cont Inputs'!Q16","v":15},{"$f":"'Capital Cont Inputs'!R16","v":16},{"$f":"'Capital Cont Inputs'!S16","v":17},{"$f":"'Capital Cont Inputs'!T16","v":18},{"$f":"'Capital Cont Inputs'!U16","v":19},{"$f":"'Capital Cont Inputs'!V16","v":20},{"$f":"'Capital Cont Inputs'!W16","v":21},{"$f":"'Capital Cont Inputs'!X16","v":22},{"$f":"'Capital Cont Inputs'!Y16","v":23},{"$f":"'Capital Cont Inputs'!Z16","v":24},{"$f":"'Capital Cont Inputs'!AA16","v":25}]
[null,null,{"$f":"C35","v":"Year Ended:"},null,null,{"$f":"'Capital Cont Inputs'!C15","v":2010},{"$f":"'Capital Cont Inputs'!D15","v":2011},{"$f":"'Capital Cont Inputs'!E15","v":2012},{"$f":"'Capital Cont Inputs'!F15","v":2013},{"$f":"'Capital Cont Inputs'!G15","v":2014},{"$f":"'Capital Cont Inputs'!H15","v":2015},{"$f":"'Capital Cont Inputs'!I15","v":2016},{"$f":"'Capital Cont Inputs'!J15","v":2017},{"$f":"'Capital Cont Inputs'!K15","v":2018},{"$f":"'Capital Cont Inputs'!L15","v":2019},{"$f":"'Capital Cont Inputs'!M15","v":2020},{"$f":"'Capital Cont Inputs'!N15","v":2021},{"$f":"'Capital Cont Inputs'!O15","v":2022},{"$f":"'Capital Cont Inputs'!P15","v":2023},{"$f":"'Capital Cont Inputs'!Q15","v":2024},{"$f":"'Capital Cont Inputs'!R15","v":2025},{"$f":"'Capital Cont Inputs'!S15","v":2026},{"$f":"'Capital Cont Inputs'!T15","v":2027},{"$f":"'Capital Cont Inputs'!U15","v":2028},{"$f":"'Capital Cont Inputs'!V15","v":2029},{"$f":"'Capital Cont Inputs'!W15","v":2030},{"$f":"'Capital Cont Inputs'!X15","v":2031},{"$f":"'Capital Cont Inputs'!Y15","v":2032},{"$f":"'Capital Cont Inputs'!Z15","v":2033},{"$f":"'Capital Cont Inputs'!AA15","v":2034}]
[null,null,"Project Year Load Forecast Summary"]
[null,null,{"$f":"C56","v":"Load (MW / month)"},null,null,{"$f":"IF(ISNUMBER(F55),IF('Project Inputs'!$B$75=\"Calendar Year\",(E56*(12-F$60)+F56*F$60)/12,'Project Inputs'!C81),0)","v":0},{"$f":"IF(ISNUMBER(G55),IF('Project Inputs'!$B$75=\"Calendar Year\",(F56*(12-G$60)+G56*G$60)/12,'Project Inputs'!D81),0)","v":2.230416666666649},{"$f":"IF(ISNUMBER(H55),IF('Project Inputs'!$B$75=\"Calendar Year\",(G56*(12-H$60)+H56*H$60)/12,'Project Inputs'!E81),0)","v":0},{"$f":"IF(ISNUMBER(I55),IF('Project Inputs'!$B$75=\"Calendar Year\",(H56*(12-I$60)+I56*I$60)/12,'Project Inputs'!F81),0)","v":0},{"$f":"IF(ISNUMBER(J55),IF('Project Inputs'!$B$75=\"Calendar Year\",(I56*(12-J$60)+J56*J$60)/12,'Project Inputs'!G81),0)","v":5.1048333333333247},{"$f":"IF(ISNUMBER(K55),IF('Project Inputs'!$B$75=\"Calendar Year\",(J56*(12-K$60)+K56*K$60)/12,'Project Inputs'!H81),0)","v":14.174999999999997},{"$f":"IF(ISNUMBER(L55),IF('Project Inputs'!$B$75=\"Calendar Year\",(K56*(12-L$60)+L56*L$60)/12,'Project Inputs'!I81),0)","v":16.766999999999996},{"$f":"IF(ISNUMBER(M55),IF('Project Inputs'!$B$75=\"Calendar Year\",(L56*(12-M$60)+M56*M$60)/12,'Project Inputs'!J81),0)","v":19.359000000000009},{"$f":"IF(ISNUMBER(N55),IF('Project Inputs'!$B$75=\"Calendar Year\",(M56*(12-N$60)+N56*N$60)/12,'Project Inputs'!K81),0)","v":21.950999999999993},{"$f":"IF(ISNUMBER(O55),IF('Project Inputs'!$B$75=\"Calendar Year\",(N56*(12-O$60)+O56*O$60)/12,'Project Inputs'!L81),0)","v":24.705000000000013},{"$f":"IF(ISNUMBER(P55),IF('Project Inputs'!$B$75=\"Calendar Year\",(O56*(12-P$60)+P56*P$60)/12,'Project Inputs'!M81),0)","v":27.459000000000003},{"$f":"IF(ISNUMBER(Q55),IF('Project Inputs'!$B$75=\"Calendar Year\",(P56*(12-Q$60)+Q56*Q$60)/12,'Project Inputs'!N81),0)","v":28.188000000000017},{"$f":"IF(ISNUMBER(R55),IF('Project Inputs'!$B$75=\"Calendar Year\",(Q56*(12-R$60)+R56*R$60)/12,'Project Inputs'!O81),0)","v":28.836000000000013},{"$f":"IF(ISNUMBER(S55),IF('Project Inputs'!$B$75=\"Calendar Year\",(R56*(12-S$60)+S56*S$60)/12,'Project Inputs'!P81),0)","v":29.564999999999998},{"$f":"IF(ISNUMBER(T55),IF('Project Inputs'!$B$75=\"Calendar Year\",(S56*(12-T$60)+T56*T$60)/12,'Project Inputs'!Q81),0)","v":30.294000000000011},{"$f":"IF(ISNUMBER(U55),IF('Project Inputs'!$B$75=\"Calendar Year\",(T56*(12-U$60)+U56*U$60)/12,'Project Inputs'!R81),0)","v":31.023000000000025},{"$f":"IF(ISNUMBER(V55),IF('Project Inputs'!$B$75=\"Calendar Year\",(U56*(12-V$60)+V56*V$60)/12,'Project Inputs'!S81),0)","v":31.751999999999981},{"$f":"IF(ISNUMBER(W55),IF('Project Inputs'!$B$75=\"Calendar Year\",(V56*(12-W$60)+W56*W$60)/12,'Project Inputs'!T81),0)","v":32.480999999999995},{"$f":"IF(ISNUMBER(X55),IF('Project Inputs'!$B$75=\"Calendar Year\",(W56*(12-X$60)+X56*X$60)/12,'Project Inputs'!U81),0)","v":33.210000000000008},{"$f":"IF(ISNUMBER(Y55),IF('Project Inputs'!$B$75=\"Calendar Year\",(X56*(12-Y$60)+Y56*Y$60)/12,'Project Inputs'!V81),0)","v":33.939000000000021},{"$f":"IF(ISNUMBER(Z55),IF('Project Inputs'!$B$75=\"Calendar Year\",(Y56*(12-Z$60)+Z56*Z$60)/12,'Project Inputs'!W81),0)","v":34.668000000000006},{"$f":"IF(ISNUMBER(AA55),IF('Project Inputs'!$B$75=\"Calendar Year\",(Z56*(12-AA$60)+AA56*AA$60)/12,'Project Inputs'!X81),0)","v":35.396999999999991},{"$f":"IF(ISNUMBER(AB55),IF('Project Inputs'!$B$75=\"Calendar Year\",(AA56*(12-AB$60)+AB56*AB$60)/12,'Project Inputs'!Y81),0)","v":36.126000000000005},{"$f":"IF(ISNUMBER(AC55),IF('Project Inputs'!$B$75=\"Calendar Year\",(AB56*(12-AC$60)+AC56*AC$60)/12,'Project Inputs'!Z81),0)","v":36.855000000000018},{"$f":"IF(ISNUMBER(AD55),IF('Project Inputs'!$B$75=\"Calendar Year\",(AC56*(12-AD$60)+AD56*AD$60)/12,'Project Inputs'!AA81),0)","v":37.664999999999992}]
[null,null,{"$f":"C57","v":"Load adjustments (MW / month)"},null,null,{"$f":"IF(ISNUMBER(F55),IF('Project Inputs'!$B$75=\"Calendar Year\",((E57*(12-F$60)+F57*F$60)/12),'Project Inputs'!C82),0)","v":0},{"$f":"IF(ISNUMBER(G55),IF('Project Inputs'!$B$75=\"Calendar Year\",((F57*(12-G$60)+G57*G$60)/12),'Project Inputs'!D82),0)","v":0},{"$f":"IF(ISNUMBER(H55),IF('Project Inputs'!$B$75=\"Calendar Year\",((G57*(12-H$60)+H57*H$60)/12),'Project Inputs'!E82),0)","v":0},{"$f":"IF(ISNUMBER(I55),IF('Project Inputs'!$B$75=\"Calendar Year\",((H57*(12-I$60)+I57*I$60)/12),'Project Inputs'!F82),0)","v":0},{"$f":"IF(ISNUMBER(J55),IF('Project Inputs'!$B$75=\"Calendar Year\",((I57*(12-J$60)+J57*J$60)/12),'Project Inputs'!G82),0)","v":0},{"$f":"IF(ISNUMBER(K55),IF('Project Inputs'!$B$75=\"Calendar Year\",((J57*(12-K$60)+K57*K$60)/12),'Project Inputs'!H82),0)","v":0},{"$f":"IF(ISNUMBER(L55),IF('Project Inputs'!$B$75=\"Calendar Year\",((K57*(12-L$60)+L57*L$60)/12),'Project Inputs'!I82),0)","v":0},{"$f":"IF(ISNUMBER(M55),IF('Project Inputs'!$B$75=\"Calendar Year\",((L57*(12-M$60)+M57*M$60)/12),'Project Inputs'!J82),0)","v":0},{"$f":"IF(ISNUMBER(N55),IF('Project Inputs'!$B$75=\"Calendar Year\",((M57*(12-N$60)+N57*N$60)/12),'Project Inputs'!K82),0)","v":0},{"$f":"IF(ISNUMBER(O55),IF('Project Inputs'!$B$75=\"Calendar Year\",((N57*(12-O$60)+O57*O$60)/12),'Project Inputs'!L82),0)","v":0},{"$f":"IF(ISNUMBER(P55),IF('Project Inputs'!$B$75=\"Calendar Year\",((O57*(12-P$60)+P57*P$60)/12),'Project Inputs'!M82),0)","v":0},{"$f":"IF(ISNUMBER(Q55),IF('Project Inputs'!$B$75=\"Calendar Year\",((P57*(12-Q$60)+Q57*Q$60)/12),'Project Inputs'!N82),0)","v":0},{"$f":"IF(ISNUMBER(R55),IF('Project Inputs'!$B$75=\"Calendar Year\",((Q57*(12-R$60)+R57*R$60)/12),'Project Inputs'!O82),0)","v":0},{"$f":"IF(ISNUMBER(S55),IF('Project Inputs'!$B$75=\"Calendar Year\",((R57*(12-S$60)+S57*S$60)/12),'Project Inputs'!P82),0)","v":0},{"$f":"IF(ISNUMBER(T55),IF('Project Inputs'!$B$75=\"Calendar Year\",((S57*(12-T$60)+T57*T$60)/12),'Project Inputs'!Q82),0)","v":0},{"$f":"IF(ISNUMBER(U55),IF('Project Inputs'!$B$75=\"Calendar Year\",((T57*(12-U$60)+U57*U$60)/12),'Project Inputs'!R82),0)","v":0},{"$f":"IF(ISNUMBER(V55),IF('Project Inputs'!$B$75=\"Calendar Year\",((U57*(12-V$60)+V57*V$60)/12),'Project Inputs'!S82),0)","v":0},{"$f":"IF(ISNUMBER(W55),IF('Project Inputs'!$B$75=\"Calendar Year\",((V57*(12-W$60)+W57*W$60)/12),'Project Inputs'!T82),0)","v":0},{"$f":"IF(ISNUMBER(X55),IF('Project Inputs'!$B$75=\"Calendar Year\",((W57*(12-X$60)+X57*X$60)/12),'Project Inputs'!U82),0)","v":0},{"$f":"IF(ISNUMBER(Y55),IF('Project Inputs'!$B$75=\"Calendar Year\",((X57*(12-Y$60)+Y57*Y$60)/12),'Project Inputs'!V82),0)","v":0},{"$f":"IF(ISNUMBER(Z55),IF('Project Inputs'!$B$75=\"Calendar Year\",((Y57*(12-Z$60)+Z57*Z$60)/12),'Project Inputs'!W82),0)","v":0},{"$f":"IF(ISNUMBER(AA55),IF('Project Inputs'!$B$75=\"Calendar Year\",((Z57*(12-AA$60)+AA57*AA$60)/12),'Project Inputs'!X82),0)","v":0},{"$f":"IF(ISNUMBER(AB55),IF('Project Inputs'!$B$75=\"Calendar Year\",((AA57*(12-AB$60)+AB57*AB$60)/12),'Project Inputs'!Y82),0)","v":0},{"$f":"IF(ISNUMBER(AC55),IF('Project Inputs'!$B$75=\"Calendar Year\",((AB57*(12-AC$60)+AC57*AC$60)/12),'Project Inputs'!Z82),0)","v":0},{"$f":"IF(ISNUMBER(AD55),IF('Project Inputs'!$B$75=\"Calendar Year\",((AC57*(12-AD$60)+AD57*AD$60)/12),'Project Inputs'!AA82),0)","v":0}]
[null,null,"Forecasted load (MW / project year)",null,null,{"$f":"SUM(F65:F66)","v":0},{"$f":"SUM(G65:G66)","v":2.230416666666649},0,0,5.1048333333333247,14.174999999999997,16.766999999999996,19.359000000000009,21.950999999999993,24.705000000000013,27.459000000000003,28.188000000000017,28.836000000000013,29.564999999999998,30.294000000000011,31.023000000000025,31.751999999999981,32.480999999999995,33.210000000000008,33.939000000000021,34.668000000000006,35.396999999999991,36.126000000000005,36.855000000000018,37.664999999999992]
[]
[]
[null,null,"Load Factor Adjustments"]
[null,null,"PLI adjustment",{"$f":"IF('Project Inputs'!$B$76=\"Yes\",\"N/A\",IF(ISBLANK('Project Inputs'!$D$76),1,'Project Inputs'!$D$76))","v":"N/A"}]
[null,null,{"$f":"C65","v":"Load (MW / month)"},null,null,{"$f":"IF('Project Inputs'!$B$76=\"No\",F65*$D$71,'Prelim Calc'!F65)","v":0},{"$f":"IF('Project Inputs'!$B$76=\"No\",G65*$D$71,'Prelim Calc'!G65)","v":2.230416666666649},{"$f":"IF('Project Inputs'!$B$76=\"No\",H65*$D$71,'Prelim Calc'!H65)","v":0},{"$f":"IF('Project Inputs'!$B$76=\"No\",I65*$D$71,'Prelim Calc'!I65)","v":0},{"$f":"IF('Project Inputs'!$B$76=\"No\",J65*$D$71,'Prelim Calc'!J65)","v":5.1048333333333247},{"$f":"IF('Project Inputs'!$B$76=\"No\",K65*$D$71,'Prelim Calc'!K65)","v":14.174999999999997},{"$f":"IF('Project Inputs'!$B$76=\"No\",L65*$D$71,'Prelim Calc'!L65)","v":16.766999999999996},{"$f":"IF('Project Inputs'!$B$76=\"No\",M65*$D$71,'Prelim Calc'!M65)","v":19.359000000000009},{"$f":"IF('Project Inputs'!$B$76=\"No\",N65*$D$71,'Prelim Calc'!N65)","v":21.950999999999993},{"$f":"IF('Project Inputs'!$B$76=\"No\",O65*$D$71,'Prelim Calc'!O65)","v":24.705000000000013},{"$f":"IF('Project Inputs'!$B$76=\"No\",P65*$D$71,'Prelim Calc'!P65)","v":27.459000000000003},{"$f":"IF('Project Inputs'!$B$76=\"No\",Q65*$D$71,'Prelim Calc'!Q65)","v":28.188000000000017},{"$f":"IF('Project Inputs'!$B$76=\"No\",R65*$D$71,'Prelim Calc'!R65)","v":28.836000000000013},{"$f":"IF('Project Inputs'!$B$76=\"No\",S65*$D$71,'Prelim Calc'!S65)","v":29.564999999999998},{"$f":"IF('Project Inputs'!$B$76=\"No\",T65*$D$71,'Prelim Calc'!T65)","v":30.294000000000011},{"$f":"IF('Project Inputs'!$B$76=\"No\",U65*$D$71,'Prelim Calc'!U65)","v":31.023000000000025},{"$f":"IF('Project Inputs'!$B$76=\"No\",V65*$D$71,'Prelim Calc'!V65)","v":31.751999999999981},{"$f":"IF('Project Inputs'!$B$76=\"No\",W65*$D$71,'Prelim Calc'!W65)","v":32.480999999999995},{"$f":"IF('Project Inputs'!$B$76=\"No\",X65*$D$71,'Prelim Calc'!X65)","v":33.210000000000008},{"$f":"IF('Project Inputs'!$B$76=\"No\",Y65*$D$71,'Prelim Calc'!Y65)","v":33.939000000000021},{"$f":"IF('Project Inputs'!$B$76=\"No\",Z65*$D$71,'Prelim Calc'!Z65)","v":34.668000000000006},{"$f":"IF('Project Inputs'!$B$76=\"No\",AA65*$D$71,'Prelim Calc'!AA65)","v":35.396999999999991},{"$f":"IF('Project Inputs'!$B$76=\"No\",AB65*$D$71,'Prelim Calc'!AB65)","v":36.126000000000005},{"$f":"IF('Project Inputs'!$B$76=\"No\",AC65*$D$71,'Prelim Calc'!AC65)","v":36.855000000000018},{"$f":"IF('Project Inputs'!$B$76=\"No\",AD65*$D$71,'Prelim Calc'!AD65)","v":37.664999999999992}]
[null,null,{"$f":"C66","v":"Load adjustments (MW / month)"},null,null,{"$f":"IF('Project Inputs'!$B$76=\"No\",F66*$D$71,'Prelim Calc'!F66)","v":0},{"$f":"IF('Project Inputs'!$B$76=\"No\",G66*$D$71,'Prelim Calc'!G66)","v":0},{"$f":"IF('Project Inputs'!$B$76=\"No\",H66*$D$71,'Prelim Calc'!H66)","v":0},{"$f":"IF('Project Inputs'!$B$76=\"No\",I66*$D$71,'Prelim Calc'!I66)","v":0},{"$f":"IF('Project Inputs'!$B$76=\"No\",J66*$D$71,'Prelim Calc'!J66)","v":0},{"$f":"IF('Project Inputs'!$B$76=\"No\",K66*$D$71,'Prelim Calc'!K66)","v":0},{"$f":"IF('Project Inputs'!$B$76=\"No\",L66*$D$71,'Prelim Calc'!L66)","v":0},{"$f":"IF('Project Inputs'!$B$76=\"No\",M66*$D$71,'Prelim Calc'!M66)","v":0},{"$f":"IF('Project Inputs'!$B$76=\"No\",N66*$D$71,'Prelim Calc'!N66)","v":0},{"$f":"IF('Project Inputs'!$B$76=\"No\",O66*$D$71,'Prelim Calc'!O66)","v":0},{"$f":"IF('Project Inputs'!$B$76=\"No\",P66*$D$71,'Prelim Calc'!P66)","v":0},{"$f":"IF('Project Inputs'!$B$76=\"No\",Q66*$D$71,'Prelim Calc'!Q66)","v":0},{"$f":"IF('Project Inputs'!$B$76=\"No\",R66*$D$71,'Prelim Calc'!R66)","v":0},{"$f":"IF('Project Inputs'!$B$76=\"No\",S66*$D$71,'Prelim Calc'!S66)","v":0},{"$f":"IF('Project Inputs'!$B$76=\"No\",T66*$D$71,'Prelim Calc'!T66)","v":0},{"$f":"IF('Project Inputs'!$B$76=\"No\",U66*$D$71,'Prelim Calc'!U66)","v":0},{"$f":"IF('Project Inputs'!$B$76=\"No\",V66*$D$71,'Prelim Calc'!V66)","v":0},{"$f":"IF('Project Inputs'!$B$76=\"No\",W66*$D$71,'Prelim Calc'!W66)","v":0},{"$f":"IF('Project Inputs'!$B$76=\"No\",X66*$D$71,'Prelim Calc'!X66)","v":0},{"$f":"IF('Project Inputs'!$B$76=\"No\",Y66*$D$71,'Prelim Calc'!Y66)","v":0},{"$f":"IF('Project Inputs'!$B$76=\"No\",Z66*$D$71,'Prelim Calc'!Z66)","v":0},{"$f":"IF('Project Inputs'!$B$76=\"No\",AA66*$D$71,'Prelim Calc'!AA66)","v":0},{"$f":"IF('Project Inputs'!$B$76=\"No\",AB66*$D$71,'Prelim Calc'!AB66)","v":0},{"$f":"IF('Project Inputs'!$B$76=\"No\",AC66*$D$71,'Prelim Calc'!AC66)","v":0},{"$f":"IF('Project Inputs'!$B$76=\"No\",AD66*$D$71,'Prelim Calc'!AD66)","v":0}]
[null,null,"Load factor adjusted forecasted load (MW / project year)",null,null,{"$f":"F72+F73","v":0},2.230416666666649,0,0,5.1048333333333247,14.174999999999997,16.766999999999996,19.359000000000009,21.950999999999993,24.705000000000013,27.459000000000003,28.188000000000017,28.836000000000013,29.564999999999998,30.294000000000011,31.023000000000025,31.751999999999981,32.480999999999995,33.210000000000008,33.939000000000021,34.668000000000006,35.396999999999991,36.126000000000005,36.855000000000018,37.664999999999992]
[]
[]
[null,null,"Load Used in Model"]
[null,null,"Forecast or revenue guarantee load to be used in model?",{"$f":"IF(RevenueGuaranteeCalc=\"IEE/True-up\",\"Forecast\",RevenueGuaranteeCalc)","v":"Forecast"}]
[]
[null,null,"Revenue guarantee factor",{"$f":"IF(D78=\"Forecast\",\"N/A\",RevenueGuarantee)","v":"N/A"}]
[null,null,"Load (MW / month)",null,null,{"$f":"IF(OR('Project Inputs'!C$80=\"Actual\",'Capital Cont Inputs'!$B$52=\"IEE/True-up\"),F72,$D$80*F72)","v":0},{"$f":"IF(OR('Project Inputs'!D$80=\"Actual\",'Capital Cont Inputs'!$B$52=\"IEE/True-up\"),G72,$D$80*G72)","v":2.230416666666649},{"$f":"IF(OR('Project Inputs'!E$80=\"Actual\",'Capital Cont Inputs'!$B$52=\"IEE/True-up\"),H72,$D$80*H72)","v":0},{"$f":"IF(OR('Project Inputs'!F$80=\"Actual\",'Capital Cont Inputs'!$B$52=\"IEE/True-up\"),I72,$D$80*I72)","v":0},{"$f":"IF(OR('Project Inputs'!G$80=\"Actual\",'Capital Cont Inputs'!$B$52=\"IEE/True-up\"),J72,$D$80*J72)","v":5.1048333333333247},{"$f":"IF(OR('Project Inputs'!H$80=\"Actual\",'Capital Cont Inputs'!$B$52=\"IEE/True-up\"),K72,$D$80*K72)","v":14.174999999999997},{"$f":"IF(OR('Project Inputs'!I$80=\"Actual\",'Capital Cont Inputs'!$B$52=\"IEE/True-up\"),L72,$D$80*L72)","v":16.766999999999996},{"$f":"IF(OR('Project Inputs'!J$80=\"Actual\",'Capital Cont Inputs'!$B$52=\"IEE/True-up\"),M72,$D$80*M72)","v":19.359000000000009},{"$f":"IF(OR('Project Inputs'!K$80=\"Actual\",'Capital Cont Inputs'!$B$52=\"IEE/True-up\"),N72,$D$80*N72)","v":21.950999999999993},{"$f":"IF(OR('Project Inputs'!L$80=\"Actual\",'Capital Cont Inputs'!$B$52=\"IEE/True-up\"),O72,$D$80*O72)","v":24.705000000000013},{"$f":"IF(OR('Project Inputs'!M$80=\"Actual\",'Capital Cont Inputs'!$B$52=\"IEE/True-up\"),P72,$D$80*P72)","v":27.459000000000003},{"$f":"IF(OR('Project Inputs'!N$80=\"Actual\",'Capital Cont Inputs'!$B$52=\"IEE/True-up\"),Q72,$D$80*Q72)","v":28.188000000000017},{"$f":"IF(OR('Project Inputs'!O$80=\"Actual\",'Capital Cont Inputs'!$B$52=\"IEE/True-up\"),R72,$D$80*R72)","v":28.836000000000013},{"$f":"IF(OR('Project Inputs'!P$80=\"Actual\",'Capital Cont Inputs'!$B$52=\"IEE/True-up\"),S72,$D$80*S72)","v":29.564999999999998},{"$f":"IF(OR('Project Inputs'!Q$80=\"Actual\",'Capital Cont Inputs'!$B$52=\"IEE/True-up\"),T72,$D$80*T72)","v":30.294000000000011},{"$f":"IF(OR('Project Inputs'!R$80=\"Actual\",'Capital Cont Inputs'!$B$52=\"IEE/True-up\"),U72,$D$80*U72)","v":31.023000000000025},{"$f":"IF(OR('Project Inputs'!S$80=\"Actual\",'Capital Cont Inputs'!$B$52=\"IEE/True-up\"),V72,$D$80*V72)","v":31.751999999999981},{"$f":"IF(OR('Project Inputs'!T$80=\"Actual\",'Capital Cont Inputs'!$B$52=\"IEE/True-up\"),W72,$D$80*W72)","v":32.480999999999995},{"$f":"IF(OR('Project Inputs'!U$80=\"Actual\",'Capital Cont Inputs'!$B$52=\"IEE/True-up\"),X72,$D$80*X72)","v":33.210000000000008},{"$f":"IF(OR('Project Inputs'!V$80=\"Actual\",'Capital Cont Inputs'!$B$52=\"IEE/True-up\"),Y72,$D$80*Y72)","v":33.939000000000021},{"$f":"IF(OR('Project Inputs'!W$80=\"Actual\",'Capital Cont Inputs'!$B$52=\"IEE/True-up\"),Z72,$D$80*Z72)","v":34.668000000000006},{"$f":"IF(OR('Project Inputs'!X$80=\"Actual\",'Capital Cont Inputs'!$B$52=\"IEE/True-up\"),AA72,$D$80*AA72)","v":35.396999999999991},{"$f":"IF(OR('Project Inputs'!Y$80=\"Actual\",'Capital Cont Inputs'!$B$52=\"IEE/True-up\"),AB72,$D$80*AB72)","v":36.126000000000005},{"$f":"IF(OR('Project Inputs'!Z$80=\"Actual\",'Capital Cont Inputs'!$B$52=\"IEE/True-up\"),AC72,$D$80*AC72)","v":36.855000000000018},{"$f":"IF(OR('Project Inputs'!AA$80=\"Actual\",'Capital Cont Inputs'!$B$52=\"IEE/True-up\"),AD72,$D$80*AD72)","v":37.664999999999992}]
[null,null,"Load adjustments (MW / month)",null,null,{"$f":"F73","v":0},{"$f":"G73","v":0},0,0,0,0,0,0,0,0,0,0,0,0,0,0,0,0,0,0,0,0,0,0,0]
[null,null,"Total load (MW / project year)",null,null,{"$f":"SUM(F81:F82)","v":0},{"$f":"SUM(G81:G82)","v":2.230416666666649},0,0,5.1048333333333247,14.174999999999997,16.766999999999996,19.359000000000009,21.950999999999993,24.705000000000013,27.459000000000003,28.188000000000017,28.836000000000013,29.564999999999998,30.294000000000011,31.023000000000025,31.751999999999981,32.480999999999995,33.210000000000008,33.939000000000021,34.668000000000006,35.396999999999991,36.126000000000005,36.855000000000018,37.664999999999992]

{"sheet":"NPV Calc","index":5,"n_rows":181,"n_cols":30,"rows_kept":181,"cut":false,"hidden":false,"merged":[]}
[]
[null,"Capital Contribution flag (select Yes to include in calculation of NPV):","No"]
[]
[null,null,null,"Project Year:",{"$f":"'Capital Cont Inputs'!B16","v":0},{"$f":"'Capital Cont Inputs'!C16","v":1},{"$f":"'Capital Cont Inputs'!D16","v":2},{"$f":"'Capital Cont Inputs'!E16","v":3},{"$f":"'Capital Cont Inputs'!F16","v":4},{"$f":"'Capital Cont Inputs'!G16","v":5},{"$f":"'Capital Cont Inputs'!H16","v":6},{"$f":"'Capital Cont Inputs'!I16","v":7},{"$f":"'Capital Cont Inputs'!J16","v":8},{"$f":"'Capital Cont Inputs'!K16","v":9},{"$f":"'Capital Cont Inputs'!L16","v":10},{"$f":"'Capital Cont Inputs'!M16","v":11},{"$f":"'Capital Cont Inputs'!N16","v":12},{"$f":"'Capital Cont Inputs'!O16","v":13},{"$f":"'Capital Cont Inputs'!P16","v":14},{"$f":"'Capital Cont Inputs'!Q16","v":15},{"$f":"'Capital Cont Inputs'!R16","v":16},{"$f":"'Capital Cont Inputs'!S16","v":17},{"$f":"'Capital Cont Inputs'!T16","v":18},{"$f":"'Capital Cont Inputs'!U16","v":19},{"$f":"'Capital Cont Inputs'!V16","v":20},{"$f":"'Capital Cont Inputs'!W16","v":21},{"$f":"'Capital Cont Inputs'!X16","v":22},{"$f":"'Capital Cont Inputs'!Y16","v":23},{"$f":"'Capital Cont Inputs'!Z16","v":24},{"$f":"'Capital Cont Inputs'!AA16","v":25}]
[null,null,null,"Year Ended:",{"$f":"'Capital Cont Inputs'!B15","v":2009},{"$f":"'Capital Cont Inputs'!C15","v":2010},{"$f":"'Capital Cont Inputs'!D15","v":2011},{"$f":"'Capital Cont Inputs'!E15","v":2012},{"$f":"'Capital Cont Inputs'!F15","v":2013},{"$f":"'Capital Cont Inputs'!G15","v":2014},{"$f":"'Capital Cont Inputs'!H15","v":2015},{"$f":"'Capital Cont Inputs'!I15","v":2016},{"$f":"'Capital Cont Inputs'!J15","v":2017},{"$f":"'Capital Cont Inputs'!K15","v":2018},{"$f":"'Capital Cont Inputs'!L15","v":2019},{"$f":"'Capital Cont Inputs'!M15","v":2020},{"$f":"'Capital Cont Inputs'!N15","v":2021},{"$f":"'Capital Cont Inputs'!O15","v":2022},{"$f":"'Capital Cont Inputs'!P15","v":2023},{"$f":"'Capital Cont Inputs'!Q15","v":2024},{"$f":"'Capital Cont Inputs'!R15","v":2025},{"$f":"'Capital Cont Inputs'!S15","v":2026},{"$f":"'Capital Cont Inputs'!T15","v":2027},{"$f":"'Capital Cont Inputs'!U15","v":2028},{"$f":"'Capital Cont Inputs'!V15","v":2029},{"$f":"'Capital Cont Inputs'!W15","v":2030},{"$f":"'Capital Cont Inputs'!X15","v":2031},{"$f":"'Capital Cont Inputs'!Y15","v":2032},{"$f":"'Capital Cont Inputs'!Z15","v":2033},{"$f":"'Capital Cont Inputs'!AA15","v":2034}]
[]
["Discount","Calculation of Net Present Value:","Undiscounted","Cum. NPV at "]
["Method",null,"Cash Flow","IS Date"]
[null,"Incremental revenues:"]
[null,{"$f":"CONCATENATE('Project Inputs'!B28,\" - \",\"Load Forecast (MW)\")","v":"1st true-up - Load Forecast (MW)"},null,null,null,{"$f":"'Prelim Calc'!F81","v":0},{"$f":"'Prelim Calc'!G81","v":2.230416666666649},{"$f":"'Prelim Calc'!H81","v":0},{"$f":"'Prelim Calc'!I81","v":0},{"$f":"'Prelim Calc'!J81","v":5.1048333333333247},{"$f":"'Prelim Calc'!K81","v":14.174999999999997},{"$f":"'Prelim Calc'!L81","v":16.766999999999996},{"$f":"'Prelim Calc'!M81","v":19.359000000000009},{"$f":"'Prelim Calc'!N81","v":21.950999999999993},{"$f":"'Prelim Calc'!O81","v":24.705000000000013},{"$f":"'Prelim Calc'!P81","v":27.459000000000003},{"$f":"'Prelim Calc'!Q81","v":28.188000000000017},{"$f":"'Prelim Calc'!R81","v":28.836000000000013},{"$f":"'Prelim Calc'!S81","v":29.564999999999998},{"$f":"'Prelim Calc'!T81","v":30.294000000000011},{"$f":"'Prelim Calc'!U81","v":31.023000000000025},{"$f":"'Prelim Calc'!V81","v":31.751999999999981},{"$f":"'Prelim Calc'!W81","v":32.480999999999995},{"$f":"'Prelim Calc'!X81","v":33.210000000000008},{"$f":"'Prelim Calc'!Y81","v":33.939000000000021},{"$f":"'Prelim Calc'!Z81","v":34.668000000000006},{"$f":"'Prelim Calc'!AA81","v":35.396999999999991},{"$f":"'Prelim Calc'!AB81","v":36.126000000000005},{"$f":"'Prelim Calc'!AC81","v":36.855000000000018},{"$f":"'Prelim Calc'!AD81","v":37.664999999999992}]
[null,"Load adjustments (MW)",null,null,null,{"$f":"'Prelim Calc'!F82","v":0},{"$f":"'Prelim Calc'!G82","v":0},{"$f":"'Prelim Calc'!H82","v":0},{"$f":"'Prelim Calc'!I82","v":0},{"$f":"'Prelim Calc'!J82","v":0},{"$f":"'Prelim Calc'!K82","v":0},{"$f":"'Prelim Calc'!L82","v":0},{"$f":"'Prelim Calc'!M82","v":0},{"$f":"'Prelim Calc'!N82","v":0},{"$f":"'Prelim Calc'!O82","v":0},{"$f":"'Prelim Calc'!P82","v":0},{"$f":"'Prelim Calc'!Q82","v":0},{"$f":"'Prelim Calc'!R82","v":0},{"$f":"'Prelim Calc'!S82","v":0},{"$f":"'Prelim Calc'!T82","v":0},{"$f":"'Prelim Calc'!U82","v":0},{"$f":"'Prelim Calc'!V82","v":0},{"$f":"'Prelim Calc'!W82","v":0},{"$f":"'Prelim Calc'!X82","v":0},{"$f":"'Prelim Calc'!Y82","v":0},{"$f":"'Prelim Calc'!Z82","v":0},{"$f":"'Prelim Calc'!AA82","v":0},{"$f":"'Prelim Calc'!AB82","v":0},{"$f":"'Prelim Calc'!AC82","v":0},{"$f":"'Prelim Calc'!AD82","v":0}]
[null,"Total load (MW)",null,null,null,{"$f":"SUM(F10:F11)","v":0},{"$f":"SUM(G10:G11)","v":2.230416666666649},0,0,5.1048333333333247,14.174999999999997,16.766999999999996,19.359000000000009,21.950999999999993,24.705000000000013,27.459000000000003,28.188000000000017,28.836000000000013,29.564999999999998,30.294000000000011,31.023000000000025,31.751999999999981,32.480999999999995,33.210000000000008,33.939000000000021,34.668000000000006,35.396999999999991,36.126000000000005,36.855000000000018,37.664999999999992]
[]
[null,{"$f":"CONCATENATE(\"Tariff Applied\",\" - \",'Project Inputs'!B17, \" $/kW/Month\")","v":"Tariff Applied - Transformation $/kW/Month"},null,null,null,{"$f":"IF('Project Inputs'!B17=\"Line\",'Standard Inputs'!B6,IF('Project Inputs'!B17=\"Network\",'Standard Inputs'!B7,'Standard Inputs'!B8))","v":1.61},{"$f":"IF(ISNUMBER(G5),F14,0)","v":1.61},1.61,1.61,1.61,1.61,1.61,1.61,1.61,1.61,1.61,1.61,1.61,1.61,1.61,1.61,1.61,1.61,1.61,1.61,1.61,1.61,1.61,1.61,1.61]
[null,"Total incremental revenue (monthly)",null,null,null,{"$f":"(F12)*F14","v":0},{"$f":"(G12)*G14","v":3.590970833333305},0,0,8.2187816666666524,22.821749999999998,26.994869999999995,31.167990000000017,35.341109999999993,39.775050000000022,44.208990000000007,45.382680000000029,46.425960000000025,47.599649999999997,48.773340000000019,49.947030000000041,51.12071999999997,52.294409999999992,53.468100000000014,54.641790000000036,55.815480000000015,56.989169999999987,58.162860000000009,59.336550000000031,60.640649999999994]
[]
["M","Total incremental revenue - $k",{"$f":"SUM(E17:AD17)","v":11432.614830000002},{"$f":"SUMPRODUCT(E17:AD17,$E$50:$AD$50)","v":4939.1481250228608},null,{"$f":"F15*12","v":0},43.09164999999966,0,0,98.625379999999836,273.86099999999999,323.93843999999996,374.01588000000021,424.09331999999995,477.30060000000026,530.50788000000011,544.59216000000038,557.11152000000027,571.19579999999996,585.28008000000023,599.36436000000049,613.44863999999961,627.53291999999988,641.61720000000014,655.7014800000004,669.78576000000021,683.87003999999979,697.95432000000005,712.03860000000032,727.68779999999992]
[]
[null,"Incremental costs:"]
["M","Removal costs",{"$f":"SUM(E20:AD20)","v":0},{"$f":"SUMPRODUCT(E20:AD20,$E$50:$AD$50)","v":0},{"$f":"-'Prelim Calc'!E10","v":0}]
["M","OM&A costs",{"$f":"SUM(E21:AD21)","v":-1280},{"$f":"SUMPRODUCT(E21:AD21,$E$50:$AD$50)","v":-646.18675261741748},null,{"$f":"IF(ISNUMBER(F5),-'Project Inputs'!C70,0)","v":-42},{"$f":"IF(ISNUMBER(G5),-'Project Inputs'!D70,0)","v":-42},{"$f":"IF(ISNUMBER(H5),-'Project Inputs'!E70,0)","v":-42},{"$f":"IF(ISNUMBER(I5),-'Project Inputs'!F70,0)","v":-42},{"$f":"IF(ISNUMBER(J5),-'Project Inputs'!G70,0)","v":-42},{"$f":"IF(ISNUMBER(K5),-'Project Inputs'!H70,0)","v":-42},{"$f":"IF(ISNUMBER(L5),-'Project Inputs'!I70,0)","v":-42},{"$f":"IF(ISNUMBER(M5),-'Project Inputs'!J70,0)","v":-42},{"$f":"IF(ISNUMBER(N5),-'Project Inputs'!K70,0)","v":-42},{"$f":"IF(ISNUMBER(O5),-'Project Inputs'!L70,0)","v":-42},{"$f":"IF(ISNUMBER(P5),-'Project Inputs'!M70,0)","v":-42},{"$f":"IF(ISNUMBER(Q5),-'Project Inputs'!N70,0)","v":-42},{"$f":"IF(ISNUMBER(R5),-'Project Inputs'!O70,0)","v":-42},{"$f":"IF(ISNUMBER(S5),-'Project Inputs'!P70,0)","v":-42},{"$f":"IF(ISNUMBER(T5),-'Project Inputs'!Q70,0)","v":-42},{"$f":"IF(ISNUMBER(U5),-'Project Inputs'!R70,0)","v":-65},{"$f":"IF(ISNUMBER(V5),-'Project Inputs'!S70,0)","v":-65},{"$f":"IF(ISNUMBER(W5),-'Project Inputs'!T70,0)","v":-65},{"$f":"IF(ISNUMBER(X5),-'Project Inputs'!U70,0)","v":-65},{"$f":"IF(ISNUMBER(Y5),-'Project Inputs'!V70,0)","v":-65},{"$f":"IF(ISNUMBER(Z5),-'Project Inputs'!W70,0)","v":-65},{"$f":"IF(ISNUMBER(AA5),-'Project Inputs'!X70,0)","v":-65},{"$f":"IF(ISNUMBER(AB5),-'Project Inputs'!Y70,0)","v":-65},{"$f":"IF(ISNUMBER(AC5),-'Project Inputs'!Z70,0)","v":-65},{"$f":"IF(ISNUMBER(AD5),-'Project Inputs'!AA70,0)","v":-65}]
["M","Ontario capital tax",{"$f":"SUM(E22:AD22)","v":-224.32966827897036},{"$f":"SUMPRODUCT(E22:AD22,$E$50:$AD$50)","v":-147.13132902629388},null,{"$f":"-F181","v":-19.636265734447125},{"$f":"-G181","v":-18.118881501817079},-16.722888007797437,-15.438573993299366,-14.257005099961139,-13.169961718089972,-12.169881806768498,-11.249808288352742,-10.403340651410247,-9.6245904254231487,-8.9081402175150206,-8.2490060262395435,-7.6426025702661029,-7.0847113907705381,-6.5714515056346192,-6.099252411309573,-5.664829244530531,-5.2651599310938115,-4.8974641627320308,-4.5591840558391921,-4.2479663574977806,-3.9616460750236815,-3.6982314151475109,-3.4558899280614335,-3.2329357599422424]
["M","Municipal tax ",-1418.9288120432932,{"$f":"SUMPRODUCT(E23:AD23,$E$50:$AD$50)","v":-769.00214874142716},null,{"$f":"-'Prelim Calc'!F29","v":-56.757152481731723},{"$f":"-'Prelim Calc'!G29","v":-56.757152481731723},{"$f":"-'Prelim Calc'!H29","v":-56.757152481731723},{"$f":"-'Prelim Calc'!I29","v":-56.757152481731723},{"$f":"-'Prelim Calc'!J29","v":-56.757152481731723},{"$f":"-'Prelim Calc'!K29","v":-56.757152481731723},{"$f":"-'Prelim Calc'!L29","v":-56.757152481731723},{"$f":"-'Prelim Calc'!M29","v":-56.757152481731723},{"$f":"-'Prelim Calc'!N29","v":-56.757152481731723},{"$f":"-'Prelim Calc'!O29","v":-56.757152481731723},{"$f":"-'Prelim Calc'!P29","v":-56.757152481731723},{"$f":"-'Prelim Calc'!Q29","v":-56.757152481731723},{"$f":"-'Prelim Calc'!R29","v":-56.757152481731723},{"$f":"-'Prelim Calc'!S29","v":-56.757152481731723},{"$f":"-'Prelim Calc'!T29","v":-56.757152481731723},{"$f":"-'Prelim Calc'!U29","v":-56.757152481731723},{"$f":"-'Prelim Calc'!V29","v":-56.757152481731723},{"$f":"-'Prelim Calc'!W29","v":-56.757152481731723},{"$f":"-'Prelim Calc'!X29","v":-56.757152481731723},{"$f":"-'Prelim Calc'!Y29","v":-56.757152481731723},{"$f":"-'Prelim Calc'!Z29","v":-56.757152481731723},{"$f":"-'Prelim Calc'!AA29","v":-56.757152481731723},{"$f":"-'Prelim Calc'!AB29","v":-56.757152481731723},{"$f":"-'Prelim Calc'!AC29","v":-56.757152481731723},{"$f":"-'Prelim Calc'!AD29","v":-56.757152481731723}]
[null,"Total incremental removal costs, OM&A costs, and municpal taxes - $k",{"$f":"SUM(E24:AD24)","v":-2923.258480322263},{"$f":"SUM(D20:D23)","v":-1562.3202303851385},{"$f":"SUM(E20:E23)","v":0},-118.39341821617884,-116.87603398354881,-115.48004048952916,-114.19572647503108,-113.01415758169287,-111.92711419982169,-110.92703428850022,-110.00696077008446,-109.16049313314197,-108.38174290715487,-107.66529269924675,-107.00615850797126,-106.39975505199783,-105.84186387250226,-105.32860398736634,-127.8564048930413,-127.42198172626226,-127.02231241282553,-126.65461664446376,-126.31633653757092,-126.0051188392295,-125.7187985567554,-125.45538389687924,-125.21304240979316,-124.99008824167396]
[]
[null,"Taxes:"]
["M","Income tax provision",{"$f":"SUM(E27:AD27)","v":-290.69327586134591},{"$f":"SUMPRODUCT(E27:AD27,$E$50:$AD$50)","v":531.8898653713228},{"$f":"-'NPV Calc'!E96","v":0},{"$f":"-'NPV Calc'!F96","v":157.32932240127772},{"$f":"-'NPV Calc'!G96","v":250.6394210482959},{"$f":"-'NPV Calc'!H96","v":246.53373378469468},{"$f":"-'NPV Calc'!I96","v":229.47565497218159},{"$f":"-'NPV Calc'!J96","v":180.74272016466966},{"$f":"-'NPV Calc'!K96","v":107.60082955775857},{"$f":"-'NPV Calc'!L96","v":77.541965883400437},{"$f":"-'NPV Calc'!M96","v":48.545735910990828},{"$f":"-'NPV Calc'!N96","v":20.527128944374191},{"$f":"-'NPV Calc'!O96","v":-7.6405612569133341},{"$f":"-'NPV Calc'!P96","v":-34.980791346097703},{"$f":"-'NPV Calc'!Q96","v":-48.453553132147455},{"$f":"-'NPV Calc'!R96","v":-60.701704479313086},{"$f":"-'NPV Calc'!S96","v":-72.829770766705437},{"$f":"-'NPV Calc'!T96","v":-84.365050455106555},{"$f":"-'NPV Calc'!U96","v":-87.649966472435594},{"$f":"-'NPV Calc'!V96","v":-98.138147912377931},{"$f":"-'NPV Calc'!W96","v":-108.16473354112526},{"$f":"-'NPV Calc'!X96","v":-117.76665102357279},{"$f":"-'NPV Calc'!Y96","v":-126.97787381142454},{"$f":"-'NPV Calc'!Z96","v":-135.82965748024802},{"$f":"-'NPV Calc'!AA96","v":-144.35075715956549},{"$f":"-'NPV Calc'!AB96","v":-152.56762756853783},{"$f":"-'NPV Calc'!AC96","v":-160.50460704879234},{"$f":"-'NPV Calc'!AD96","v":-168.70833507462632}]
["M","CCA recapture",0,{"$f":"SUMPRODUCT(E28:AD28,$E$50:$AD$50)","v":0},{"$f":"'NPV Calc'!E75","v":0},{"$f":"'NPV Calc'!F75","v":0},{"$f":"'NPV Calc'!G75","v":0},{"$f":"'NPV Calc'!H75","v":0},{"$f":"'NPV Calc'!I75","v":0},{"$f":"'NPV Calc'!J75","v":0},{"$f":"'NPV Calc'!K75","v":0},{"$f":"'NPV Calc'!L75","v":0},{"$f":"'NPV Calc'!M75","v":0},{"$f":"'NPV Calc'!N75","v":0},{"$f":"'NPV Calc'!O75","v":0},{"$f":"'NPV Calc'!P75","v":0},{"$f":"'NPV Calc'!Q75","v":0},{"$f":"'NPV Calc'!R75","v":0},{"$f":"'NPV Calc'!S75","v":0},{"$f":"'NPV Calc'!T75","v":0},{"$f":"'NPV Calc'!U75","v":0},{"$f":"'NPV Calc'!V75","v":0},{"$f":"'NPV Calc'!W75","v":0},{"$f":"'NPV Calc'!X75","v":0},{"$f":"'NPV Calc'!Y75","v":0},{"$f":"'NPV Calc'!Z75","v":0},{"$f":"'NPV Calc'!AA75","v":0},{"$f":"'NPV Calc'!AB75","v":0},{"$f":"'NPV Calc'!AC75","v":0},{"$f":"'NPV Calc'!AD75","v":0}]
["F","CCA tax shield adjustment",223.22217233862804,{"$f":"SUMPRODUCT(E29:AD29,$E$51:$AD$51)","v":56.076431486452229},{"$f":"E112","v":0},0,0,0,0,0,0,0,0,0,0,0,0,0,0,0,0,0,0,0,0,0,0,0,0,223.22217233862804]
[null,"Total incremental taxes - $k",{"$f":"SUM(E30:AD30)","v":-67.471103522717868},{"$f":"SUM(D27:D29)","v":587.96629685777498},0,157.32932240127772,250.6394210482959,246.53373378469468,229.47565497218159,180.74272016466966,107.60082955775857,77.541965883400437,48.545735910990828,20.527128944374191,-7.6405612569133341,-34.980791346097703,-48.453553132147455,-60.701704479313086,-72.829770766705437,-84.365050455106555,-87.649966472435594,-98.138147912377931,-108.16473354112526,-117.76665102357279,-126.97787381142454,-135.82965748024802,-144.35075715956549,-152.56762756853783,-160.50460704879234,54.513837264001722]
[]
[null,"Capital expenditures:"]
["F","Capital before overheads & AFUDC",{"$f":"SUM(E33:AD33)","v":-9078.4755654556775},{"$f":"SUMPRODUCT(E33:AD33,$E$51:$AD$51)","v":-9078.4755654556775},{"$f":"-('Project Inputs'!B34+'Project Inputs'!B38+'Project Inputs'!B49+'Project Inputs'!B55+'Project Inputs'!B61)","v":-9078.4755654556775}]
["F","Up-front overheads",0,{"$f":"SUMPRODUCT(E34:AD34,$E$51:$AD$51)","v":0},{"$f":"-('Project Inputs'!B39+'Project Inputs'!B50+'Project Inputs'!B56+'Project Inputs'!B62)","v":0}]
["F","Up-front AFUDC",0,{"$f":"SUMPRODUCT(E35:AD35,$E$51:$AD$51)","v":0},{"$f":"-('Project Inputs'!B40+'Project Inputs'!B51+'Project Inputs'!B57+'Project Inputs'!B63)","v":0}]
[null,"Total up-front capital expenditures - $k",{"$f":"SUM(E36:AD36)","v":-9078.4755654556775},{"$f":"SUM(D33:D35)","v":-9078.4755654556775},{"$f":"SUM(E33:E35)","v":-9078.4755654556775},0,0,0,0,0,0,0,0,0,0,0,0,0,0,0,0,0,0,0,0,0,0,0,0,0]
[]
["M","Ongoing capital expenditures",{"$f":"SUM(E38:AD38)","v":0},{"$f":"SUMPRODUCT(E38:AD38,$E$50:$AD$50)","v":0}]
[null,"Total ongoing capital expenditures - $k",0,{"$f":"SUM(D38:D38)","v":0},{"$f":"SUM(E38:E38)","v":0},{"$f":"SUM(F38:F38)","v":0},0,0,0,0,0,0,0,0,0,0,0,0,0,0,0,0,0,0,0,0,0,0,0,0]
[]
["F","Previous capital contribution/(credit)",{"$f":"SUM(E41:AD41)","v":0},{"$f":"SUMPRODUCT(E41:AD41,$E$51:$AD$51)","v":0},{"$f":"IF($C$2=\"Yes\",IF(Stage='Standard Inputs'!E54,\"\",'Capital Cont Inputs'!B17),0)","v":0},{"$f":"IF($C$2=\"Yes\",'Capital Cont Inputs'!C17,0)","v":0},{"$f":"IF($C$2=\"Yes\",'Capital Cont Inputs'!D17,0)","v":0},{"$f":"IF($C$2=\"Yes\",'Capital Cont Inputs'!E17,0)","v":0},{"$f":"IF($C$2=\"Yes\",'Capital Cont Inputs'!F17,0)","v":0},{"$f":"IF($C$2=\"Yes\",'Capital Cont Inputs'!G17,0)","v":0},{"$f":"IF($C$2=\"Yes\",'Capital Cont Inputs'!H17,0)","v":0},{"$f":"IF($C$2=\"Yes\",'Capital Cont Inputs'!I17,0)","v":0},{"$f":"IF($C$2=\"Yes\",'Capital Cont Inputs'!J17,0)","v":0},{"$f":"IF($C$2=\"Yes\",'Capital Cont Inputs'!K17,0)","v":0},{"$f":"IF($C$2=\"Yes\",'Capital Cont Inputs'!L17,0)","v":0},{"$f":"IF($C$2=\"Yes\",'Capital Cont Inputs'!M17,0)","v":0},{"$f":"IF($C$2=\"Yes\",'Capital Cont Inputs'!N17,0)","v":0},{"$f":"IF($C$2=\"Yes\",'Capital Cont Inputs'!O17,0)","v":0},{"$f":"IF($C$2=\"Yes\",'Capital Cont Inputs'!P17,0)","v":0},{"$f":"IF($C$2=\"Yes\",'Capital Cont Inputs'!Q17,0)","v":0},{"$f":"IF($C$2=\"Yes\",'Capital Cont Inputs'!R17,0)","v":0},{"$f":"IF($C$2=\"Yes\",'Capital Cont Inputs'!S17,0)","v":0},{"$f":"IF($C$2=\"Yes\",'Capital Cont Inputs'!T17,0)","v":0},{"$f":"IF($C$2=\"Yes\",'Capital Cont Inputs'!U17,0)","v":0},{"$f":"IF($C$2=\"Yes\",'Capital Cont Inputs'!V17,0)","v":0},{"$f":"IF($C$2=\"Yes\",'Capital Cont Inputs'!W17,0)","v":0},{"$f":"IF($C$2=\"Yes\",'Capital Cont Inputs'!X17,0)","v":0},{"$f":"IF($C$2=\"Yes\",'Capital Cont Inputs'!Y17,0)","v":0},{"$f":"IF($C$2=\"Yes\",'Capital Cont Inputs'!Z17,0)","v":0},{"$f":"IF($C$2=\"Yes\",'Capital Cont Inputs'!AA17,0)","v":0}]
["F","Current capital contribution/(credit)",{"$f":"SUM(E42:AD42)","v":0},{"$f":"SUMPRODUCT(E42:AD42,$E$51:$AD$51)","v":0},{"$f":"IF($C$2=\"Yes\",'Capital Cont Inputs'!B18,0)","v":0},{"$f":"IF($C$2=\"Yes\",'Capital Cont Inputs'!C18,0)","v":0},{"$f":"IF($C$2=\"Yes\",'Capital Cont Inputs'!D18,0)","v":0},{"$f":"IF($C$2=\"Yes\",'Capital Cont Inputs'!E18,0)","v":0},{"$f":"IF($C$2=\"Yes\",'Capital Cont Inputs'!F18,0)","v":0},{"$f":"IF($C$2=\"Yes\",'Capital Cont Inputs'!G18,0)","v":0},{"$f":"IF($C$2=\"Yes\",'Capital Cont Inputs'!H18,0)","v":0},{"$f":"IF($C$2=\"Yes\",'Capital Cont Inputs'!I18,0)","v":0},{"$f":"IF($C$2=\"Yes\",'Capital Cont Inputs'!J18,0)","v":0},{"$f":"IF($C$2=\"Yes\",'Capital Cont Inputs'!K18,0)","v":0},{"$f":"IF($C$2=\"Yes\",'Capital Cont Inputs'!L18,0)","v":0},{"$f":"IF($C$2=\"Yes\",'Capital Cont Inputs'!M18,0)","v":0},{"$f":"IF($C$2=\"Yes\",'Capital Cont Inputs'!N18,0)","v":0},{"$f":"IF($C$2=\"Yes\",'Capital Cont Inputs'!O18,0)","v":0},{"$f":"IF($C$2=\"Yes\",'Capital Cont Inputs'!P18,0)","v":0},{"$f":"IF($C$2=\"Yes\",'Capital Cont Inputs'!Q18,0)","v":0},{"$f":"IF($C$2=\"Yes\",'Capital Cont Inputs'!R18,0)","v":0},{"$f":"IF($C$2=\"Yes\",'Capital Cont Inputs'!S18,0)","v":0},{"$f":"IF($C$2=\"Yes\",'Capital Cont Inputs'!T18,0)","v":0},{"$f":"IF($C$2=\"Yes\",'Capital Cont Inputs'!U18,0)","v":0},{"$f":"IF($C$2=\"Yes\",'Capital Cont Inputs'!V18,0)","v":0},{"$f":"IF($C$2=\"Yes\",'Capital Cont Inputs'!W18,0)","v":0},{"$f":"IF($C$2=\"Yes\",'Capital Cont Inputs'!X18,0)","v":0},{"$f":"IF($C$2=\"Yes\",'Capital Cont Inputs'!Y18,0)","v":0},{"$f":"IF($C$2=\"Yes\",'Capital Cont Inputs'!Z18,0)","v":0},{"$f":"IF($C$2=\"Yes\",'Capital Cont Inputs'!AA18,0)","v":0}]
[null,"Total capital contributions - $k",{"$f":"SUM(E43:AD43)","v":0},{"$f":"SUM(D41:D42)","v":0},{"$f":"SUM(E41:E42)","v":0},{"$f":"SUM(F41:F42)","v":0},0,0,0,0,0,0,0,0,0,0,0,0,0,0,0,0,0,0,0,0,0,0,0,0]
[]
["F","Change in working capital- $k",{"$f":"SUM(E45:AD45)","v":0},{"$f":"SUMPRODUCT(E45:AD45,$E$51:$AD$51)","v":-1.6006090947398783},{"$f":"-'Prelim Calc'!D48","v":0},{"$f":"-'Prelim Calc'!F48","v":-2.0424657534246577},{"$f":"-'Prelim Calc'!G48","v":0},{"$f":"-'Prelim Calc'!H48","v":0},{"$f":"-'Prelim Calc'!I48","v":0},{"$f":"-'Prelim Calc'!J48","v":0},{"$f":"-'Prelim Calc'!K48","v":0},{"$f":"-'Prelim Calc'!L48","v":0},{"$f":"-'Prelim Calc'!M48","v":0},{"$f":"-'Prelim Calc'!N48","v":0},{"$f":"-'Prelim Calc'!O48","v":0},{"$f":"-'Prelim Calc'!P48","v":0},{"$f":"-'Prelim Calc'!Q48","v":0},{"$f":"-'Prelim Calc'!R48","v":0},{"$f":"-'Prelim Calc'!S48","v":0},{"$f":"-'Prelim Calc'!T48","v":0},{"$f":"-'Prelim Calc'!U48","v":-1.1184931506849316},{"$f":"-'Prelim Calc'!V48","v":0},{"$f":"-'Prelim Calc'!W48","v":0},{"$f":"-'Prelim Calc'!X48","v":0},{"$f":"-'Prelim Calc'!Y48","v":0},{"$f":"-'Prelim Calc'!Z48","v":0},{"$f":"-'Prelim Calc'!AA48","v":0},{"$f":"-'Prelim Calc'!AB48","v":0},{"$f":"-'Prelim Calc'!AC48","v":0},{"$f":"-'Prelim Calc'!AD48","v":3.1609589041095894}]
["M","Proceeds: sale of depreciable property (less CCA recapture) - $k",0,{"$f":"SUMPRODUCT(E46:AD46,$E$50:$AD$50)","v":0},{"$f":"'NPV Calc'!E127+'NPV Calc'!E141+'NPV Calc'!E155+'NPV Calc'!E169-'NPV Calc'!E75","v":0},{"$f":"'NPV Calc'!F127+'NPV Calc'!F141+'NPV Calc'!F155+'NPV Calc'!F169-'NPV Calc'!F75","v":0},{"$f":"'NPV Calc'!G127+'NPV Calc'!G141+'NPV Calc'!G155+'NPV Calc'!G169-'NPV Calc'!G75","v":0},{"$f":"'NPV Calc'!H127+'NPV Calc'!H141+'NPV Calc'!H155+'NPV Calc'!H169-'NPV Calc'!H75","v":0},{"$f":"'NPV Calc'!I127+'NPV Calc'!I141+'NPV Calc'!I155+'NPV Calc'!I169-'NPV Calc'!I75","v":0},{"$f":"'NPV Calc'!J127+'NPV Calc'!J141+'NPV Calc'!J155+'NPV Calc'!J169-'NPV Calc'!J75","v":0},{"$f":"'NPV Calc'!K127+'NPV Calc'!K141+'NPV Calc'!K155+'NPV Calc'!K169-'NPV Calc'!K75","v":0},{"$f":"'NPV Calc'!L127+'NPV Calc'!L141+'NPV Calc'!L155+'NPV Calc'!L169-'NPV Calc'!L75","v":0},{"$f":"'NPV Calc'!M127+'NPV Calc'!M141+'NPV Calc'!M155+'NPV Calc'!M169-'NPV Calc'!M75","v":0},{"$f":"'NPV Calc'!N127+'NPV Calc'!N141+'NPV Calc'!N155+'NPV Calc'!N169-'NPV Calc'!N75","v":0},{"$f":"'NPV Calc'!O127+'NPV Calc'!O141+'NPV Calc'!O155+'NPV Calc'!O169-'NPV Calc'!O75","v":0},{"$f":"'NPV Calc'!P127+'NPV Calc'!P141+'NPV Calc'!P155+'NPV Calc'!P169-'NPV Calc'!P75","v":0},{"$f":"'NPV Calc'!Q127+'NPV Calc'!Q141+'NPV Calc'!Q155+'NPV Calc'!Q169-'NPV Calc'!Q75","v":0},{"$f":"'NPV Calc'!R127+'NPV Calc'!R141+'NPV Calc'!R155+'NPV Calc'!R169-'NPV Calc'!R75","v":0},{"$f":"'NPV Calc'!S127+'NPV Calc'!S141+'NPV Calc'!S155+'NPV Calc'!S169-'NPV Calc'!S75","v":0},{"$f":"'NPV Calc'!T127+'NPV Calc'!T141+'NPV Calc'!T155+'NPV Calc'!T169-'NPV Calc'!T75","v":0},{"$f":"'NPV Calc'!U127+'NPV Calc'!U141+'NPV Calc'!U155+'NPV Calc'!U169-'NPV Calc'!U75","v":0},{"$f":"'NPV Calc'!V127+'NPV Calc'!V141+'NPV Calc'!V155+'NPV Calc'!V169-'NPV Calc'!V75","v":0},{"$f":"'NPV Calc'!W127+'NPV Calc'!W141+'NPV Calc'!W155+'NPV Calc'!W169-'NPV Calc'!W75","v":0},{"$f":"'NPV Calc'!X127+'NPV Calc'!X141+'NPV Calc'!X155+'NPV Calc'!X169-'NPV Calc'!X75","v":0},{"$f":"'NPV Calc'!Y127+'NPV Calc'!Y141+'NPV Calc'!Y155+'NPV Calc'!Y169-'NPV Calc'!Y75","v":0},{"$f":"'NPV Calc'!Z127+'NPV Calc'!Z141+'NPV Calc'!Z155+'NPV Calc'!Z169-'NPV Calc'!Z75","v":0},{"$f":"'NPV Calc'!AA127+'NPV Calc'!AA141+'NPV Calc'!AA155+'NPV Calc'!AA169-'NPV Calc'!AA75","v":0},{"$f":"'NPV Calc'!AB127+'NPV Calc'!AB141+'NPV Calc'!AB155+'NPV Calc'!AB169-'NPV Calc'!AB75","v":0},{"$f":"'NPV Calc'!AC127+'NPV Calc'!AC141+'NPV Calc'!AC155+'NPV Calc'!AC169-'NPV Calc'!AC75","v":0},{"$f":"'NPV Calc'!AD127+'NPV Calc'!AD141+'NPV Calc'!AD155+'NPV Calc'!AD169-'NPV Calc'!AD75","v":0}]
["M","Proceeds: sale of non-depreciable property (less taxable portion of cap gain) - $k",0,{"$f":"SUMPRODUCT(E47:AD47,$E$50:$AD$50)","v":0},{"$f":"'NPV Calc'!E118-'NPV Calc'!E76","v":0},{"$f":"'NPV Calc'!F118-'NPV Calc'!F76","v":0},{"$f":"'NPV Calc'!G118-'NPV Calc'!G76","v":0},{"$f":"'NPV Calc'!H118-'NPV Calc'!H76","v":0},{"$f":"'NPV Calc'!I118-'NPV Calc'!I76","v":0},{"$f":"'NPV Calc'!J118-'NPV Calc'!J76","v":0},{"$f":"'NPV Calc'!K118-'NPV Calc'!K76","v":0},{"$f":"'NPV Calc'!L118-'NPV Calc'!L76","v":0},{"$f":"'NPV Calc'!M118-'NPV Calc'!M76","v":0},{"$f":"'NPV Calc'!N118-'NPV Calc'!N76","v":0},{"$f":"'NPV Calc'!O118-'NPV Calc'!O76","v":0},{"$f":"'NPV Calc'!P118-'NPV Calc'!P76","v":0},{"$f":"'NPV Calc'!Q118-'NPV Calc'!Q76","v":0},{"$f":"'NPV Calc'!R118-'NPV Calc'!R76","v":0},{"$f":"'NPV Calc'!S118-'NPV Calc'!S76","v":0},{"$f":"'NPV Calc'!T118-'NPV Calc'!T76","v":0},{"$f":"'NPV Calc'!U118-'NPV Calc'!U76","v":0},{"$f":"'NPV Calc'!V118-'NPV Calc'!V76","v":0},{"$f":"'NPV Calc'!W118-'NPV Calc'!W76","v":0},{"$f":"'NPV Calc'!X118-'NPV Calc'!X76","v":0},{"$f":"'NPV Calc'!Y118-'NPV Calc'!Y76","v":0},{"$f":"'NPV Calc'!Z118-'NPV Calc'!Z76","v":0},{"$f":"'NPV Calc'!AA118-'NPV Calc'!AA76","v":0},{"$f":"'NPV Calc'!AB118-'NPV Calc'!AB76","v":0},{"$f":"'NPV Calc'!AC118-'NPV Calc'!AC76","v":0},{"$f":"'NPV Calc'!AD118-'NPV Calc'!AD76","v":0}]
[]
[null,{"$f":"\"Present value factor for discounting: \"&ROUND('Standard Inputs'!B12*100,2)&\"%\"","v":"Present value factor for discounting: 5.68%"}]
[null,"Present value factor - mid-year",null,null,{"$f":"IF(E4=0,1,IF(E4=1,B50/(1+'Standard Inputs'!$B$12)^0.5,B50/(1+'Standard Inputs'!$B$12)))","v":1},{"$f":"IF(F4=0,1,IF(F4=1,E50/(1+'Standard Inputs'!$B$12)^0.5,E50/(1+'Standard Inputs'!$B$12)))","v":0.97274915176265586},{"$f":"IF(G4=0,1,IF(G4=1,F50/(1+'Standard Inputs'!$B$12)^0.5,F50/(1+'Standard Inputs'!$B$12)))","v":0.92045504475914042},{"$f":"IF(H4=0,1,IF(H4=1,G50/(1+'Standard Inputs'!$B$12)^0.5,G50/(1+'Standard Inputs'!$B$12)))","v":0.87097222124257512},{"$f":"IF(I4=0,1,IF(I4=1,H50/(1+'Standard Inputs'!$B$12)^0.5,H50/(1+'Standard Inputs'!$B$12)))","v":0.82414954917730887},{"$f":"IF(J4=0,1,IF(J4=1,I50/(1+'Standard Inputs'!$B$12)^0.5,I50/(1+'Standard Inputs'!$B$12)))","v":0.77984402124805619},{"$f":"IF(K4=0,1,IF(K4=1,J50/(1+'Standard Inputs'!$B$12)^0.5,J50/(1+'Standard Inputs'!$B$12)))","v":0.73792031808234226},{"$f":"IF(L4=0,1,IF(L4=1,K50/(1+'Standard Inputs'!$B$12)^0.5,K50/(1+'Standard Inputs'!$B$12)))","v":0.69825039495371066},{"$f":"IF(M4=0,1,IF(M4=1,L50/(1+'Standard Inputs'!$B$12)^0.5,L50/(1+'Standard Inputs'!$B$12)))","v":0.6607130907033899},{"$f":"IF(N4=0,1,IF(N4=1,M50/(1+'Standard Inputs'!$B$12)^0.5,M50/(1+'Standard Inputs'!$B$12)))","v":0.62519375768597418},{"$f":"IF(O4=0,1,IF(O4=1,N50/(1+'Standard Inputs'!$B$12)^0.5,N50/(1+'Standard Inputs'!$B$12)))","v":0.59158391160888679},{"$f":"IF(P4=0,1,IF(P4=1,O50/(1+'Standard Inputs'!$B$12)^0.5,O50/(1+'Standard Inputs'!$B$12)))","v":0.55978090019615456},{"$f":"IF(Q4=0,1,IF(Q4=1,P50/(1+'Standard Inputs'!$B$12)^0.5,P50/(1+'Standard Inputs'!$B$12)))","v":0.52968758966451568},{"$f":"IF(R4=0,1,IF(R4=1,Q50/(1+'Standard Inputs'!$B$12)^0.5,Q50/(1+'Standard Inputs'!$B$12)))","v":0.50121206805428575},{"$f":"IF(S4=0,1,IF(S4=1,R50/(1+'Standard Inputs'!$B$12)^0.5,R50/(1+'Standard Inputs'!$B$12)))","v":0.47426736450888574},{"$f":"IF(T4=0,1,IF(T4=1,S50/(1+'Standard Inputs'!$B$12)^0.5,S50/(1+'Standard Inputs'!$B$12)))","v":0.44877118364564683},{"$f":"IF(U4=0,1,IF(U4=1,T50/(1+'Standard Inputs'!$B$12)^0.5,T50/(1+'Standard Inputs'!$B$12)))","v":0.424645654206598},{"$f":"IF(V4=0,1,IF(V4=1,U50/(1+'Standard Inputs'!$B$12)^0.5,U50/(1+'Standard Inputs'!$B$12)))","v":0.4018170912215584},{"$f":"IF(W4=0,1,IF(W4=1,V50/(1+'Standard Inputs'!$B$12)^0.5,V50/(1+'Standard Inputs'!$B$12)))","v":0.38021577095712455},{"$f":"IF(X4=0,1,IF(X4=1,W50/(1+'Standard Inputs'!$B$12)^0.5,W50/(1+'Standard Inputs'!$B$12)))","v":0.359775717964195},{"$f":"IF(Y4=0,1,IF(Y4=1,X50/(1+'Standard Inputs'!$B$12)^0.5,X50/(1+'Standard Inputs'!$B$12)))","v":0.34043450357362542},{"$f":"IF(Z4=0,1,IF(Z4=1,Y50/(1+'Standard Inputs'!$B$12)^0.5,Y50/(1+'Standard Inputs'!$B$12)))","v":0.32213305522457403},{"$f":"IF(AA4=0,1,IF(AA4=1,Z50/(1+'Standard Inputs'!$B$12)^0.5,Z50/(1+'Standard Inputs'!$B$12)))","v":0.30481547604318049},{"$f":"IF(AB4=0,1,IF(AB4=1,AA50/(1+'Standard Inputs'!$B$12)^0.5,AA50/(1+'Standard Inputs'!$B$12)))","v":0.28842887412053103},{"$f":"IF(AC4=0,1,IF(AC4=1,AB50/(1+'Standard Inputs'!$B$12)^0.5,AB50/(1+'Standard Inputs'!$B$12)))","v":0.27292320096848421},{"$f":"IF(AD4=0,1,IF(AD4=1,AC50/(1+'Standard Inputs'!$B$12)^0.5,AC50/(1+'Standard Inputs'!$B$12)))","v":0.2582510986599641}]
[null,"Present value factor - full-year",null,null,{"$f":"IF(E4=0,1,B51/(1+'Standard Inputs'!$B$12))","v":1},{"$f":"IF(F4=0,1,E51/(1+'Standard Inputs'!$B$12))","v":0.94624091225496665},{"$f":"IF(G4=0,1,F51/(1+'Standard Inputs'!$B$12))","v":0.89537186402511149},{"$f":"IF(H4=0,1,G51/(1+'Standard Inputs'!$B$12))","v":0.84723748942255139},{"$f":"IF(I4=0,1,H51/(1+'Standard Inputs'!$B$12))","v":0.8016907748878026},{"$f":"IF(J4=0,1,I51/(1+'Standard Inputs'!$B$12))","v":0.75859261017622537},{"$f":"IF(K4=0,1,J51/(1+'Standard Inputs'!$B$12))","v":0.71781136348302776},{"$f":"IF(L4=0,1,K51/(1+'Standard Inputs'!$B$12))","v":0.67922247940916158},{"$f":"IF(M4=0,1,L51/(1+'Standard Inputs'!$B$12))","v":0.64270809854020527},{"$f":"IF(N4=0,1,M51/(1+'Standard Inputs'!$B$12))","v":0.60815669747633883},{"$f":"IF(O4=0,1,N51/(1+'Standard Inputs'!$B$12))","v":0.57546274821397858},{"$f":"IF(P4=0,1,O51/(1+'Standard Inputs'!$B$12))","v":0.54452639583874529},{"$f":"IF(Q4=0,1,P51/(1+'Standard Inputs'!$B$12))","v":0.51525315354536338},{"$f":"IF(R4=0,1,Q51/(1+'Standard Inputs'!$B$12))","v":0.48755361405301301},{"$f":"IF(S4=0,1,R51/(1+'Standard Inputs'!$B$12))","v":0.46134317653472895},{"$f":"IF(T4=0,1,S51/(1+'Standard Inputs'!$B$12))","v":0.43654178822682604},{"$f":"IF(U4=0,1,T51/(1+'Standard Inputs'!$B$12))","v":0.41307369992916632},{"$f":"IF(V4=0,1,U51/(1+'Standard Inputs'!$B$12))","v":0.39086723464950868},{"$f":"IF(W4=0,1,V51/(1+'Standard Inputs'!$B$12))","v":0.36985456868532718},{"$f":"IF(X4=0,1,W51/(1+'Standard Inputs'!$B$12))","v":0.34997152447447122},{"$f":"IF(Y4=0,1,X51/(1+'Standard Inputs'!$B$12))","v":0.33115737458198502},{"$f":"IF(Z4=0,1,Y51/(1+'Standard Inputs'!$B$12))","v":0.31335465622441722},{"$f":"IF(AA4=0,1,Z51/(1+'Standard Inputs'!$B$12))","v":0.29650899576513401},{"$f":"IF(AB4=0,1,AA51/(1+'Standard Inputs'!$B$12))","v":0.28056894264460441},{"$f":"IF(AC4=0,1,AB51/(1+'Standard Inputs'!$B$12))","v":0.26548581223844187},{"$f":"IF(AD4=0,1,AC51/(1+'Standard Inputs'!$B$12))","v":0.25121353716325401}]
[]
[null,"Accumulated Net Present Value - $k",null,{"$f":"D17+D24+D30+D36+D39+SUM(D45:D47)+D43","v":-5115.2819830549206}]
[]
[null,"Present value of capital contributions (for reporting) - $k",null,null,{"$f":"E43*E51","v":0},0,0,0,0,0,0,0,0,0,0,0,0,0,0,0,0,0,0,0,0,0,0,0,0,0]
[]
[null,"Calculation of Income Taxes",null,{"$f":"D4","v":"Project Year:"},{"$f":"'Capital Cont Inputs'!B16","v":0},{"$f":"'Capital Cont Inputs'!C16","v":1},{"$f":"'Capital Cont Inputs'!D16","v":2},{"$f":"'Capital Cont Inputs'!E16","v":3},{"$f":"'Capital Cont Inputs'!F16","v":4},{"$f":"'Capital Cont Inputs'!G16","v":5},{"$f":"'Capital Cont Inputs'!H16","v":6},{"$f":"'Capital Cont Inputs'!I16","v":7},{"$f":"'Capital Cont Inputs'!J16","v":8},{"$f":"'Capital Cont Inputs'!K16","v":9},{"$f":"'Capital Cont Inputs'!L16","v":10},{"$f":"'Capital Cont Inputs'!M16","v":11},{"$f":"'Capital Cont Inputs'!N16","v":12},{"$f":"'Capital Cont Inputs'!O16","v":13},{"$f":"'Capital Cont Inputs'!P16","v":14},{"$f":"'Capital Cont Inputs'!Q16","v":15},{"$f":"'Capital Cont Inputs'!R16","v":16},{"$f":"'Capital Cont Inputs'!S16","v":17},{"$f":"'Capital Cont Inputs'!T16","v":18},{"$f":"'Capital Cont Inputs'!U16","v":19},{"$f":"'Capital Cont Inputs'!V16","v":20},{"$f":"'Capital Cont Inputs'!W16","v":21},{"$f":"'Capital Cont Inputs'!X16","v":22},{"$f":"'Capital Cont Inputs'!Y16","v":23},{"$f":"'Capital Cont Inputs'!Z16","v":24},{"$f":"'Capital Cont Inputs'!AA16","v":25}]
[null,null,null,{"$f":"D5","v":"Year Ended:"},{"$f":"'Capital Cont Inputs'!B15","v":2009},{"$f":"'Capital Cont Inputs'!C15","v":2010},{"$f":"'Capital Cont Inputs'!D15","v":2011},{"$f":"'Capital Cont Inputs'!E15","v":2012},{"$f":"'Capital Cont Inputs'!F15","v":2013},{"$f":"'Capital Cont Inputs'!G15","v":2014},{"$f":"'Capital Cont Inputs'!H15","v":2015},{"$f":"'Capital Cont Inputs'!I15","v":2016},{"$f":"'Capital Cont Inputs'!J15","v":2017},{"$f":"'Capital Cont Inputs'!K15","v":2018},{"$f":"'Capital Cont Inputs'!L15","v":2019},{"$f":"'Capital Cont Inputs'!M15","v":2020},{"$f":"'Capital Cont Inputs'!N15","v":2021},{"$f":"'Capital Cont Inputs'!O15","v":2022},{"$f":"'Capital Cont Inputs'!P15","v":2023},{"$f":"'Capital Cont Inputs'!Q15","v":2024},{"$f":"'Capital Cont Inputs'!R15","v":2025},{"$f":"'Capital Cont Inputs'!S15","v":2026},{"$f":"'Capital Cont Inputs'!T15","v":2027},{"$f":"'Capital Cont Inputs'!U15","v":2028},{"$f":"'Capital Cont Inputs'!V15","v":2029},{"$f":"'Capital Cont Inputs'!W15","v":2030},{"$f":"'Capital Cont Inputs'!X15","v":2031},{"$f":"'Capital Cont Inputs'!Y15","v":2032},{"$f":"'Capital Cont Inputs'!Z15","v":2033},{"$f":"'Capital Cont Inputs'!AA15","v":2034}]
[null,"Class Allocation of Initial Capital Contributions:","% Split"]
[null,{"$f":"'Project Inputs'!A33","v":"Land costs"},{"$f":"'Project Inputs'!B34/SUM('Project Inputs'!B34+'Project Inputs'!B38+'Project Inputs'!B39+'Project Inputs'!B40+'Project Inputs'!B49+'Project Inputs'!B50+'Project Inputs'!B51+'Project Inputs'!B55+'Project Inputs'!B56+'Project Inputs'!B57+'Project Inputs'!B61+'Project Inputs'!B62+'Project Inputs'!B63)","v":3.2749640582928875E-2}]
[null,{"$f":"'Project Inputs'!A37","v":"Class 47 costs"},{"$f":"SUM('Project Inputs'!B38:B40)/SUM('Project Inputs'!B34+'Project Inputs'!B38+'Project Inputs'!B39+'Project Inputs'!B40+'Project Inputs'!B49+'Project Inputs'!B50+'Project Inputs'!B51+'Project Inputs'!B55+'Project Inputs'!B56+'Project Inputs'!B57+'Project Inputs'!B61+'Project Inputs'!B62+'Project Inputs'!B63)","v":0.96725035941707127}]
[null,{"$f":"'Project Inputs'!A48","v":"Decision Support defined costs (1)"},{"$f":"SUM('Project Inputs'!B49:B51)/SUM('Project Inputs'!B34+'Project Inputs'!B38+'Project Inputs'!B39+'Project Inputs'!B40+'Project Inputs'!B49+'Project Inputs'!B50+'Project Inputs'!B51+'Project Inputs'!B55+'Project Inputs'!B56+'Project Inputs'!B57+'Project Inputs'!B61+'Project Inputs'!B62+'Project Inputs'!B63)","v":0}]
[null,{"$f":"'Project Inputs'!A54","v":"Decision Support defined costs (2)"},{"$f":"SUM('Project Inputs'!B55:B57)/SUM('Project Inputs'!B34+'Project Inputs'!B38+'Project Inputs'!B39+'Project Inputs'!B40+'Project Inputs'!B49+'Project Inputs'!B50+'Project Inputs'!B51+'Project Inputs'!B55+'Project Inputs'!B56+'Project Inputs'!B57+'Project Inputs'!B61+'Project Inputs'!B62+'Project Inputs'!B63)","v":0}]
[null,{"$f":"'Project Inputs'!A60","v":"Decision Support defined costs (3)"},{"$f":"SUM('Project Inputs'!B61:B63)/SUM('Project Inputs'!B34+'Project Inputs'!B38+'Project Inputs'!B39+'Project Inputs'!B40+'Project Inputs'!B49+'Project Inputs'!B50+'Project Inputs'!B51+'Project Inputs'!B55+'Project Inputs'!B56+'Project Inputs'!B57+'Project Inputs'!B61+'Project Inputs'!B62+'Project Inputs'!B63)","v":0}]
[null,"Total up-front capital before capital contributions",{"$f":"SUM(C60:C64)","v":1.0000000000000002}]
[]
[null,{"$f":"\"Class \"&'Standard Inputs'!B30&\" Allocation of True-up Capital Contributions:\"","v":"Class 47 Allocation of True-up Capital Contributions:"},1]
[]
[null,"Calculation income tax provision - $k:"]
[null,"Total incremental revenue",null,null,{"$f":"E17","v":0},0,43.09164999999966,0,0,98.625379999999836,273.86099999999999,323.93843999999996,374.01588000000021,424.09331999999995,477.30060000000026,530.50788000000011,544.59216000000038,557.11152000000027,571.19579999999996,585.28008000000023,599.36436000000049,613.44863999999961,627.53291999999988,641.61720000000014,655.7014800000004,669.78576000000021,683.87003999999979,697.95432000000005,712.03860000000032,727.68779999999992]
[null,"Total incremental costs",null,null,{"$f":"E24","v":0},-118.39341821617884,-116.87603398354881,-115.48004048952916,-114.19572647503108,-113.01415758169287,-111.92711419982169,-110.92703428850022,-110.00696077008446,-109.16049313314197,-108.38174290715487,-107.66529269924675,-107.00615850797126,-106.39975505199783,-105.84186387250226,-105.32860398736634,-127.8564048930413,-127.42198172626226,-127.02231241282553,-126.65461664446376,-126.31633653757092,-126.0051188392295,-125.7187985567554,-125.45538389687924,-125.21304240979316,-124.99008824167396]
[null,"Net income before CCA",null,null,{"$f":"E70+E71","v":0},{"$f":"F70+F71","v":-118.39341821617884},-73.784383983549148,-115.48004048952916,-114.19572647503108,-14.388777581693034,161.9338858001783,213.01140571149972,264.00891922991576,314.93282686685797,368.91885709284537,422.84258730075339,437.58600149202914,450.71176494800244,465.35393612749772,479.95147601263386,471.50795510695917,486.02665827373733,500.51060758717438,514.96258335553637,529.38514346242948,543.78064116077076,558.15124144324443,572.49893610312085,586.82555759020715,602.69771175832602]
[]
[null,"CCA claim",null,null,{"$f":"E109","v":0},{"$f":"F109","v":351.24635014584413},674.39299228002074,620.44155289761909,570.8062286658095,525.14173037254477,483.1303919427412,444.4799605873219,408.92156374033613,376.20783864110928,346.1112115498205,318.42231462583487,292.9485294557681,269.51264709930666,247.9516353313621,228.11550450485313,209.86626414446488,193.0769630129077,177.63080597187511,163.42034149412507,150.34671417459506,138.31897704062746,127.25345887737727,117.0731821671871,107.70732759381214,99.090741386307172]
[null,"CCA recapture",null,null,{"$f":"IF((E125+E126-E127)<0,-(E125+E126-E127),0)+IF((E139+E140-E141)<0,-(E139+E140-E141),0)+IF((E153+E154-E155)<0,-(E153+E154-E155),0)+IF((E167+E168-E169)<0,-(E167+E168-E169),0)","v":0},{"$f":"IF((F125+F126-F127)<0,-(F125+F126-F127),0)+IF((F139+F140-F141)<0,-(F139+F140-F141),0)+IF((F153+F154-F155)<0,-(F153+F154-F155),0)+IF((F167+F168-F169)<0,-(F167+F168-F169),0)","v":0},0,{"$f":"IF((H125+H126-H127)<0,-(H125+H126-H127),0)+IF((H139+H140-H141)<0,-(H139+H140-H141),0)+IF((H153+H154-H155)<0,-(H153+H154-H155),0)+IF((H167+H168-H169)<0,-(H167+H168-H169),0)","v":0},0,0,{"$f":"IF((K125+K126-K127)<0,-(K125+K126-K127),0)+IF((K139+K140-K141)<0,-(K139+K140-K141),0)+IF((K153+K154-K155)<0,-(K153+K154-K155),0)+IF((K167+K168-K169)<0,-(K167+K168-K169),0)","v":0},0,0,0,0,0,0,0,0,0,0,0,0,0,0,0,0,0,0,0]
[null,"Taxable portion of capital gain: 1/2 of (proceeds - ACB)",null,null,{"$f":"IF(E118-E116<=0,0,E118-E116)*1/2","v":0},0,0,0,0,0,0,0,0,0,0,0,0,0,0,0,0,0,0,0,0,0,0,0,0,0]
[]
[null,"Taxable income / (loss) before income tax",null,null,{"$f":"E72-E74+E75+E76","v":0},-469.63976836202301,-748.17737626356984,-735.92159338714828,-685.00195514084055,-539.53050795423781,-321.1965061425629,-231.46855487582218,-144.91264451042036,-61.275011774251311,22.807645543024876,104.42027267491852,144.63747203626104,181.19911784869578,217.40230079613562,251.83597150778073,261.64169096249429,292.94969526082963,322.87980161529924,351.5422418614113,379.03842928783445,405.46166412014327,430.89778256586715,455.42575393593376,479.11822999639503,503.60697037201885]
[]
[null,"Income tax rate",null,null,{"$f":"'Standard Inputs'!B19","v":0.33500000000000002},{"$f":"E80","v":0.33500000000000002},0.33500000000000002,0.33500000000000002,0.33500000000000002,0.33500000000000002,0.33500000000000002,0.33500000000000002,0.33500000000000002,0.33500000000000002,0.33500000000000002,0.33500000000000002,0.33500000000000002,0.33500000000000002,0.33500000000000002,0.33500000000000002,0.33500000000000002,0.33500000000000002,0.33500000000000002,0.33500000000000002,0.33500000000000002,0.33500000000000002,0.33500000000000002,0.33500000000000002,0.33500000000000002,0.33500000000000002]
[]
[null,"Income tax provision, before Large Corporation Tax (LCT)",null,null,{"$f":"IF(ISNUMBER(E57),E78*E80,0)","v":0},-157.32932240127772,-250.6394210482959,-246.53373378469468,-229.47565497218159,-180.74272016466966,-107.60082955775857,-77.541965883400437,-48.545735910990828,-20.527128944374191,7.6405612569133341,34.980791346097703,48.453553132147455,60.701704479313086,72.829770766705437,84.365050455106555,87.649966472435594,98.138147912377931,108.16473354112526,117.76665102357279,126.97787381142454,135.82965748024802,144.35075715956549,152.56762756853783,160.50460704879234,168.70833507462632]
[]
[null,"Total Taxable Capital at end of year - Based on UCC, end of year",null,null,{"$f":"E110","v":0},{"$f":"F110","v":8727.2292153098333},8052.8362230298135,7432.3946701321947,6861.5884414663851,6336.4467110938403,5853.3163191510994,5408.8363585637771,4999.9147948234413,4623.7069561823319,4277.595744632511,3959.1734300066764,3666.2249005509084,3396.7122534516016,3148.7606181202395,2920.6451136153864,2710.7788494709216,2517.7018864580141,2340.0710804861387,2176.6507389920139,2026.3040248174188,1887.9850477767914,1760.7315888994142,1643.6584067322271,1535.951079138415,1436.8603377521079]
[]
[null,"LCT rate",null,null,{"$f":"'Standard Inputs'!$B$21","v":0},{"$f":"'Standard Inputs'!$B$21","v":0},{"$f":"'Standard Inputs'!$B$21","v":0},{"$f":"'Standard Inputs'!$B$21","v":0},{"$f":"'Standard Inputs'!$B$21","v":0},{"$f":"'Standard Inputs'!$B$21","v":0},{"$f":"'Standard Inputs'!$B$21","v":0},{"$f":"'Standard Inputs'!$B$21","v":0},{"$f":"'Standard Inputs'!$B$21","v":0},{"$f":"'Standard Inputs'!$B$21","v":0},{"$f":"'Standard Inputs'!$B$21","v":0},{"$f":"'Standard Inputs'!$B$21","v":0},{"$f":"'Standard Inputs'!$B$21","v":0},{"$f":"'Standard Inputs'!$B$21","v":0},{"$f":"'Standard Inputs'!$B$21","v":0},{"$f":"'Standard Inputs'!$B$21","v":0},{"$f":"'Standard Inputs'!$B$21","v":0},{"$f":"'Standard Inputs'!$B$21","v":0},{"$f":"'Standard Inputs'!$B$21","v":0},{"$f":"'Standard Inputs'!$B$21","v":0},{"$f":"'Standard Inputs'!$B$21","v":0},{"$f":"'Standard Inputs'!$B$21","v":0},{"$f":"'Standard Inputs'!$B$21","v":0},{"$f":"'Standard Inputs'!$B$21","v":0},{"$f":"'Standard Inputs'!$B$21","v":0},{"$f":"'Standard Inputs'!$B$21","v":0}]
[]
[null,"Federal LCT",null,null,{"$f":"-E84*E86","v":0},{"$f":"-F84*F86","v":0},0,0,0,0,0,0,0,0,0,0,0,0,0,0,0,0,0,0,0,0,0,0,0,0]
[]
[null,"Surtax",null,null,{"$f":"'Standard Inputs'!$B$18","v":0},{"$f":"'Standard Inputs'!$B$18","v":0},{"$f":"'Standard Inputs'!$B$18","v":0},{"$f":"'Standard Inputs'!$B$18","v":0},{"$f":"'Standard Inputs'!$B$18","v":0},{"$f":"'Standard Inputs'!$B$18","v":0},{"$f":"'Standard Inputs'!$B$18","v":0},{"$f":"'Standard Inputs'!$B$18","v":0},{"$f":"'Standard Inputs'!$B$18","v":0},{"$f":"'Standard Inputs'!$B$18","v":0},{"$f":"'Standard Inputs'!$B$18","v":0},{"$f":"'Standard Inputs'!$B$18","v":0},{"$f":"'Standard Inputs'!$B$18","v":0},{"$f":"'Standard Inputs'!$B$18","v":0},{"$f":"'Standard Inputs'!$B$18","v":0},{"$f":"'Standard Inputs'!$B$18","v":0},{"$f":"'Standard Inputs'!$B$18","v":0},{"$f":"'Standard Inputs'!$B$18","v":0},{"$f":"'Standard Inputs'!$B$18","v":0},{"$f":"'Standard Inputs'!$B$18","v":0},{"$f":"'Standard Inputs'!$B$18","v":0},{"$f":"'Standard Inputs'!$B$18","v":0},{"$f":"'Standard Inputs'!$B$18","v":0},{"$f":"'Standard Inputs'!$B$18","v":0},{"$f":"'Standard Inputs'!$B$18","v":0},{"$f":"'Standard Inputs'!$B$18","v":0}]
[]
[null,"Less: Surtax portion of income tax payable",null,null,{"$f":"-(E90*E78)","v":0},{"$f":"-(F90*F78)","v":0},0,0,0,0,0,0,0,0,0,0,0,0,0,0,0,0,0,0,0,0,0,0,0,0]
[]
[null,"Net LCT",null,null,{"$f":"IF(E92>=0,E88,IF(E88<=E92,E88-E92,0))","v":0},{"$f":"IF(F92>=0,F88,IF(F88<=F92,F88-F92,0))","v":0},0,0,0,0,0,0,0,0,0,0,0,0,0,0,0,0,0,0,0,0,0,0,0,0]
[]
[null,"Total income tax provision",null,null,{"$f":"E82-E94","v":0},{"$f":"F82-F94","v":-157.32932240127772},-250.6394210482959,-246.53373378469468,-229.47565497218159,-180.74272016466966,-107.60082955775857,-77.541965883400437,-48.545735910990828,-20.527128944374191,7.6405612569133341,34.980791346097703,48.453553132147455,60.701704479313086,72.829770766705437,84.365050455106555,87.649966472435594,98.138147912377931,108.16473354112526,117.76665102357279,126.97787381142454,135.82965748024802,144.35075715956549,152.56762756853783,160.50460704879234,168.70833507462632]
[]
[null,"PV of CCA claim",null,null,{"$f":"E74*E50","v":0},341.67458916409868,620.74843189435717,540.38735747843202,470.4296960225268,409.52863873888782,356.51173249763428,310.35830802910726,270.17983023414075,235.20279231095375,204.75382438033373,178.246729923793,155.17120046319019,135.08299121942838,117.59536861427343,102.37166496456682,89.118797033520991,77.581623659738995,67.538033838331899,58.794670691002771,51.183209003954026,44.557114669635034,38.788823645849043,33.767286122189603,29.395828614664357,25.590292830044202]
[]
[null,"UCC Continuity - $k:"]
[]
[null,"Total:"]
[null,"Opening UCC",null,null,{"$f":"E116+E125+E139+E153+E167","v":0},{"$f":"F116+F125+F139+F153+F167","v":0},8727.2292153098333,8052.8362230298135,7432.3946701321947,6861.5884414663851,6336.4467110938403,5853.3163191510994,5408.8363585637771,4999.9147948234413,4623.7069561823319,4277.595744632511,3959.1734300066764,3666.2249005509084,3396.7122534516016,3148.7606181202395,2920.6451136153864,2710.7788494709216,2517.7018864580141,2340.0710804861387,2176.6507389920139,2026.3040248174188,1887.9850477767914,1760.7315888994142,1643.6584067322271,1535.951079138415]
[null,"Additions",null,null,{"$f":"E117+E126+E140+E154+E168","v":0},{"$f":"F117+F126+F140+F154+F168","v":9078.4755654556775},0,0,0,0,0,0,0,0,0,0,0,0,0,0,0,0,0,0,0,0,0,0,0,0]
[null,"Procceeds from disposal",null,null,{"$f":"E118+E127+E141+E155+E169","v":0},{"$f":"F118+F127+F141+F155+F169","v":0},0,0,0,0,0,0,0,0,0,0,0,0,0,0,0,0,0,0,0,0,0,0,0,0]
[]
[null,"UCC for CCA",null,null,{"$f":"E120+E129+E143+E157+E171","v":0},{"$f":"F120+F129+F143+F157+F171","v":4687.8961886326269},8727.2292153098333,8052.8362230298135,7432.3946701321947,6861.5884414663851,6336.4467110938403,5853.3163191510994,5408.8363585637771,4999.9147948234413,4623.7069561823319,4277.595744632511,3959.1734300066764,3666.2249005509084,3396.7122534516016,3148.7606181202395,2920.6451136153864,2710.7788494709216,2517.7018864580141,2340.0710804861387,2176.6507389920139,2026.3040248174188,1887.9850477767914,1760.7315888994142,1643.6584067322271,1535.951079138415]
[]
[null,"CCA claim",null,null,{"$f":"E131+E145+E159+E173","v":0},{"$f":"F131+F145+F159+F173","v":351.24635014584413},674.39299228002074,620.44155289761909,570.8062286658095,525.14173037254477,483.1303919427412,444.4799605873219,408.92156374033613,376.20783864110928,346.1112115498205,318.42231462583487,292.9485294557681,269.51264709930666,247.9516353313621,228.11550450485313,209.86626414446488,193.0769630129077,177.63080597187511,163.42034149412507,150.34671417459506,138.31897704062746,127.25345887737727,117.0731821671871,107.70732759381214,99.090741386307172]
[null,"Ending UCC",null,null,{"$f":"E120+E132+E146+E160+E174","v":0},{"$f":"F120+F132+F146+F160+F174","v":8727.2292153098333},8052.8362230298135,7432.3946701321947,6861.5884414663851,6336.4467110938403,5853.3163191510994,5408.8363585637771,4999.9147948234413,4623.7069561823319,4277.595744632511,3959.1734300066764,3666.2249005509084,3396.7122534516016,3148.7606181202395,2920.6451136153864,2710.7788494709216,2517.7018864580141,2340.0710804861387,2176.6507389920139,2026.3040248174188,1887.9850477767914,1760.7315888994142,1643.6584067322271,1535.951079138415,1436.8603377521079]
[]
[null,"CCA tax shield adjustment",null,null,{"$f":"E134+E148+E162+E176","v":0},{"$f":"F134+F148+F162+F176","v":0},0,0,0,0,0,0,0,0,0,0,0,0,0,0,0,0,0,0,0,0,0,0,0,223.22217233862804]
[]
[null,"Detail by Class of Asset:"]
[null,{"$f":"'Project Inputs'!A33&\" - $k:\"","v":"Land costs - $k:"}]
[null,"Opening UCC",null,null,0,{"$f":"IF(ISNUMBER(F$57),E120,0)","v":0},297.31681180957543,297.31681180957543,297.31681180957543,297.31681180957543,297.31681180957543,297.31681180957543,297.31681180957543,297.31681180957543,297.31681180957543,297.31681180957543,297.31681180957543,297.31681180957543,297.31681180957543,297.31681180957543,297.31681180957543,297.31681180957543,297.31681180957543,297.31681180957543,297.31681180957543,297.31681180957543,297.31681180957543,297.31681180957543,297.31681180957543,297.31681180957543]
[null,"Additions",null,null,null,{"$f":"-(F$43*'NPV Calc'!$C$60)-((E43)*'NPV Calc'!$C$60)+'Project Inputs'!$B$34","v":297.31681180957543}]
[null,"Procceeds from disposal"]
[]
[null,"Ending UCC",null,null,{"$f":"IF(E116+E117-E118<0,0,E116+E117-E118)","v":0},297.31681180957543,297.31681180957543,297.31681180957543,297.31681180957543,297.31681180957543,297.31681180957543,297.31681180957543,297.31681180957543,297.31681180957543,297.31681180957543,297.31681180957543,297.31681180957543,297.31681180957543,297.31681180957543,297.31681180957543,297.31681180957543,297.31681180957543,297.31681180957543,297.31681180957543,297.31681180957543,297.31681180957543,297.31681180957543,297.31681180957543,297.31681180957543,297.31681180957543]
[]
[null,{"$f":"'Project Inputs'!A37&\" - $k:\"","v":"Class 47 costs - $k:"}]
[null,"CCA rate",null,null,{"$f":"'Standard Inputs'!$C$30","v":0.08},{"$f":"E123","v":0.08},0.08,0.08,0.08,0.08,0.08,0.08,0.08,0.08,0.08,0.08,0.08,0.08,0.08,0.08,0.08,0.08,0.08,0.08,0.08,0.08,0.08,0.08,0.08,0.08]
[]
[null,"Opening UCC",null,null,0,{"$f":"IF(ISNUMBER(F$57),E132,0)","v":0},8429.9124035002587,7755.519411220238,7135.0778583226192,6564.2716296568096,6039.1298992842649,5555.9995073415239,5111.5195467542017,4702.5979830138658,4326.3901443727564,3980.278932822936,3661.8566181971009,3368.9080887413329,3099.3954416420261,2851.4438063106641,2623.328301805811,2413.4620376613461,2220.3850746484386,2042.7542686765635,1879.3339271824384,1728.9872130078434,1590.6682359672159,1463.4147770898387,1346.3415949226517,1238.6342673288395]
[null,"Additions",null,null,null,{"$f":"'Project Inputs'!$B$38+'Project Inputs'!$B$39+'Project Inputs'!$B$40-((E43)*'NPV Calc'!$C$61)-(F$43*'NPV Calc'!$C$61)-F39","v":8781.1587536461029},{"$f":"IF(ISNUMBER(G5),-(G$43*'NPV Calc'!$C$67)-G39,0)","v":0},{"$f":"IF(ISNUMBER(H5),-(H$43*'NPV Calc'!$C$67)-H39,0)","v":0},{"$f":"IF(ISNUMBER(I5),-(I$43*'NPV Calc'!$C$67)-I39,0)","v":0},{"$f":"IF(ISNUMBER(J5),-(J$43*'NPV Calc'!$C$67)-J39,0)","v":0},{"$f":"IF(ISNUMBER(K5),-(K$43*'NPV Calc'!$C$67)-K39,0)","v":0},{"$f":"IF(ISNUMBER(L5),-(L$43*'NPV Calc'!$C$67)-L39,0)","v":0},{"$f":"IF(ISNUMBER(M5),-(M$43*'NPV Calc'!$C$67)-M39,0)","v":0},{"$f":"IF(ISNUMBER(N5),-(N$43*'NPV Calc'!$C$67)-N39,0)","v":0},{"$f":"IF(ISNUMBER(O5),-(O$43*'NPV Calc'!$C$67)-O39,0)","v":0},{"$f":"IF(ISNUMBER(P5),-(P$43*'NPV Calc'!$C$67)-P39,0)","v":0},{"$f":"IF(ISNUMBER(Q5),-(Q$43*'NPV Calc'!$C$67)-Q39,0)","v":0},{"$f":"IF(ISNUMBER(R5),-(R$43*'NPV Calc'!$C$67)-R39,0)","v":0},{"$f":"IF(ISNUMBER(S5),-(S$43*'NPV Calc'!$C$67)-S39,0)","v":0},{"$f":"IF(ISNUMBER(T5),-(T$43*'NPV Calc'!$C$67)-T39,0)","v":0},{"$f":"IF(ISNUMBER(U5),-(U$43*'NPV Calc'!$C$67)-U39,0)","v":0},{"$f":"IF(ISNUMBER(V5),-(V$43*'NPV Calc'!$C$67)-V39,0)","v":0},{"$f":"IF(ISNUMBER(W5),-(W$43*'NPV Calc'!$C$67)-W39,0)","v":0},{"$f":"IF(ISNUMBER(X5),-(X$43*'NPV Calc'!$C$67)-X39,0)","v":0},{"$f":"IF(ISNUMBER(Y5),-(Y$43*'NPV Calc'!$C$67)-Y39,0)","v":0},{"$f":"IF(ISNUMBER(Z5),-(Z$43*'NPV Calc'!$C$67)-Z39,0)","v":0},{"$f":"IF(ISNUMBER(AA5),-(AA$43*'NPV Calc'!$C$67)-AA39,0)","v":0},{"$f":"IF(ISNUMBER(AB5),-(AB$43*'NPV Calc'!$C$67)-AB39,0)","v":0},{"$f":"IF(ISNUMBER(AC5),-(AC$43*'NPV Calc'!$C$67)-AC39,0)","v":0},{"$f":"IF(ISNUMBER(AD5),-(AD$43*'NPV Calc'!$C$67)-AD39,0)","v":0}]
[null,"Procceeds from disposal"]
[]
[null,"UCC for CCA",null,null,{"$f":"IF(E125+E126<0,0,E125+(E126)*0.5)","v":0},{"$f":"IF(F125+F126<0,0,F125+(F126)*0.5)","v":4390.5793768230515},8429.9124035002587,7755.519411220238,7135.0778583226192,6564.2716296568096,6039.1298992842649,5555.9995073415239,5111.5195467542017,4702.5979830138658,4326.3901443727564,3980.278932822936,3661.8566181971009,3368.9080887413329,3099.3954416420261,2851.4438063106641,2623.328301805811,2413.4620376613461,2220.3850746484386,2042.7542686765635,1879.3339271824384,1728.9872130078434,1590.6682359672159,1463.4147770898387,1346.3415949226517,1238.6342673288395]
[]
[null,"CCA claim",null,null,{"$f":"IF(E129<0,0,E129*E123)","v":0},351.24635014584413,674.39299228002074,620.44155289761909,570.8062286658095,525.14173037254477,483.1303919427412,444.4799605873219,408.92156374033613,376.20783864110928,346.1112115498205,318.42231462583487,292.9485294557681,269.51264709930666,247.9516353313621,228.11550450485313,209.86626414446488,193.0769630129077,177.63080597187511,163.42034149412507,150.34671417459506,138.31897704062746,127.25345887737727,117.0731821671871,107.70732759381214,99.090741386307172]
[null,"Ending UCC",null,null,{"$f":"IF((E125+E126-E127-E131)<0,0,E125+E126-E127-E131)","v":0},8429.9124035002587,7755.519411220238,7135.0778583226192,6564.2716296568096,6039.1298992842649,5555.9995073415239,5111.5195467542017,4702.5979830138658,4326.3901443727564,3980.278932822936,3661.8566181971009,3368.9080887413329,3099.3954416420261,2851.4438063106641,2623.328301805811,2413.4620376613461,2220.3850746484386,2042.7542686765635,1879.3339271824384,1728.9872130078434,1590.6682359672159,1463.4147770898387,1346.3415949226517,1238.6342673288395,1139.5435259425324]
[]
[null,"CCA tax shield adjustment",null,null,{"$f":"IF(E$58='Capital Cont Inputs'!$B$10,E132*E$80*E123/('Standard Inputs'!$B$12+'NPV Calc'!E123),0)","v":0},{"$f":"IF(F$58='Capital Cont Inputs'!$B$10,F132*F$80*F123/('Standard Inputs'!$B$12+'NPV Calc'!F123),0)","v":0},{"$f":"IF(G$58='Capital Cont Inputs'!$B$10,G132*G$80*G123/('Standard Inputs'!$B$12+'NPV Calc'!G123),0)","v":0},{"$f":"IF(H$58='Capital Cont Inputs'!$B$10,H132*H$80*H123/('Standard Inputs'!$B$12+'NPV Calc'!H123),0)","v":0},{"$f":"IF(I$58='Capital Cont Inputs'!$B$10,I132*I$80*I123/('Standard Inputs'!$B$12+'NPV Calc'!I123),0)","v":0},{"$f":"IF(J$58='Capital Cont Inputs'!$B$10,J132*J$80*J123/('Standard Inputs'!$B$12+'NPV Calc'!J123),0)","v":0},{"$f":"IF(K$58='Capital Cont Inputs'!$B$10,K132*K$80*K123/('Standard Inputs'!$B$12+'NPV Calc'!K123),0)","v":0},{"$f":"IF(L$58='Capital Cont Inputs'!$B$10,L132*L$80*L123/('Standard Inputs'!$B$12+'NPV Calc'!L123),0)","v":0},{"$f":"IF(M$58='Capital Cont Inputs'!$B$10,M132*M$80*M123/('Standard Inputs'!$B$12+'NPV Calc'!M123),0)","v":0},{"$f":"IF(N$58='Capital Cont Inputs'!$B$10,N132*N$80*N123/('Standard Inputs'!$B$12+'NPV Calc'!N123),0)","v":0},{"$f":"IF(O$58='Capital Cont Inputs'!$B$10,O132*O$80*O123/('Standard Inputs'!$B$12+'NPV Calc'!O123),0)","v":0},{"$f":"IF(P$58='Capital Cont Inputs'!$B$10,P132*P$80*P123/('Standard Inputs'!$B$12+'NPV Calc'!P123),0)","v":0},{"$f":"IF(Q$58='Capital Cont Inputs'!$B$10,Q132*Q$80*Q123/('Standard Inputs'!$B$12+'NPV Calc'!Q123),0)","v":0},{"$f":"IF(R$58='Capital Cont Inputs'!$B$10,R132*R$80*R123/('Standard Inputs'!$B$12+'NPV Calc'!R123),0)","v":0},{"$f":"IF(S$58='Capital Cont Inputs'!$B$10,S132*S$80*S123/('Standard Inputs'!$B$12+'NPV Calc'!S123),0)","v":0},{"$f":"IF(T$58='Capital Cont Inputs'!$B$10,T132*T$80*T123/('Standard Inputs'!$B$12+'NPV Calc'!T123),0)","v":0},{"$f":"IF(U$58='Capital Cont Inputs'!$B$10,U132*U$80*U123/('Standard Inputs'!$B$12+'NPV Calc'!U123),0)","v":0},{"$f":"IF(V$58='Capital Cont Inputs'!$B$10,V132*V$80*V123/('Standard Inputs'!$B$12+'NPV Calc'!V123),0)","v":0},{"$f":"IF(W$58='Capital Cont Inputs'!$B$10,W132*W$80*W123/('Standard Inputs'!$B$12+'NPV Calc'!W123),0)","v":0},{"$f":"IF(X$58='Capital Cont Inputs'!$B$10,X132*X$80*X123/('Standard Inputs'!$B$12+'NPV Calc'!X123),0)","v":0},{"$f":"IF(Y$58='Capital Cont Inputs'!$B$10,Y132*Y$80*Y123/('Standard Inputs'!$B$12+'NPV Calc'!Y123),0)","v":0},{"$f":"IF(Z$58='Capital Cont Inputs'!$B$10,Z132*Z$80*Z123/('Standard Inputs'!$B$12+'NPV Calc'!Z123),0)","v":0},{"$f":"IF(AA$58='Capital Cont Inputs'!$B$10,AA132*AA$80*AA123/('Standard Inputs'!$B$12+'NPV Calc'!AA123),0)","v":0},{"$f":"IF(AB$58='Capital Cont Inputs'!$B$10,AB132*AB$80*AB123/('Standard Inputs'!$B$12+'NPV Calc'!AB123),0)","v":0},{"$f":"IF(AC$58='Capital Cont Inputs'!$B$10,AC132*AC$80*AC123/('Standard Inputs'!$B$12+'NPV Calc'!AC123),0)","v":0},{"$f":"IF(AD$58='Capital Cont Inputs'!$B$10,AD132*AD$80*AD123/('Standard Inputs'!$B$12+'NPV Calc'!AD123),0)","v":223.22217233862804}]
[]
[null,{"$f":"'Project Inputs'!A48&\" - $k:\"","v":"Decision Support defined costs (1) - $k:"}]
[null,"CCA rate",null,null,{"$f":"'Standard Inputs'!C31","v":0},{"$f":"E137","v":0},0,0,0,0,0,0,0,0,0,0,0,0,0,0,0,0,0,0,0,0,0,0,0,0]
[]
[null,"Opening UCC",null,null,0,{"$f":"IF(ISNUMBER(F$57),E146,0)","v":0},0,0,0,0,0,0,0,0,0,0,0,0,0,0,0,0,0,0,0,0,0,0,0,0]
[null,"Additions",null,null,null,{"$f":"SUM('Project Inputs'!$B$49:$B$51)-((E43)*'NPV Calc'!$C$62)-(F$43*'NPV Calc'!$C$62)","v":0}]
[null,"Procceeds from disposal"]
[]
[null,"UCC for CCA",null,null,{"$f":"IF(E139+E140<0,0,E139+(E140)*0.5)","v":0},{"$f":"IF(F139+F140<0,0,F139+(F140)*0.5)","v":0},0,0,0,0,0,0,0,0,0,0,0,0,0,0,0,0,0,0,0,0,0,0,0,0]
[]
[null,"CCA claim",null,null,{"$f":"IF(E143<0,0,E143*E137)","v":0},0,0,0,0,0,0,0,0,0,0,0,0,0,0,0,0,0,0,0,0,0,0,0,0,0]
[null,"Ending UCC",null,null,{"$f":"IF((E139+E140-E141-E145)<0,0,E139+E140-E141-E145)","v":0},0,0,0,0,0,0,0,0,0,0,0,0,0,0,0,0,0,0,0,0,0,0,0,0,0]
[]
[null,"CCA tax shield adjustment",null,null,{"$f":"IF(E$58='Capital Cont Inputs'!$B$10,E146*E$80*E137/('Standard Inputs'!$B$12+'NPV Calc'!E137),0)","v":0},{"$f":"IF(F$58='Capital Cont Inputs'!$B$10,F146*F$80*F137/('Standard Inputs'!$B$12+'NPV Calc'!F137),0)","v":0},{"$f":"IF(G$58='Capital Cont Inputs'!$B$10,G146*G$80*G137/('Standard Inputs'!$B$12+'NPV Calc'!G137),0)","v":0},{"$f":"IF(H$58='Capital Cont Inputs'!$B$10,H146*H$80*H137/('Standard Inputs'!$B$12+'NPV Calc'!H137),0)","v":0},{"$f":"IF(I$58='Capital Cont Inputs'!$B$10,I146*I$80*I137/('Standard Inputs'!$B$12+'NPV Calc'!I137),0)","v":0},{"$f":"IF(J$58='Capital Cont Inputs'!$B$10,J146*J$80*J137/('Standard Inputs'!$B$12+'NPV Calc'!J137),0)","v":0},{"$f":"IF(K$58='Capital Cont Inputs'!$B$10,K146*K$80*K137/('Standard Inputs'!$B$12+'NPV Calc'!K137),0)","v":0},{"$f":"IF(L$58='Capital Cont Inputs'!$B$10,L146*L$80*L137/('Standard Inputs'!$B$12+'NPV Calc'!L137),0)","v":0},{"$f":"IF(M$58='Capital Cont Inputs'!$B$10,M146*M$80*M137/('Standard Inputs'!$B$12+'NPV Calc'!M137),0)","v":0},{"$f":"IF(N$58='Capital Cont Inputs'!$B$10,N146*N$80*N137/('Standard Inputs'!$B$12+'NPV Calc'!N137),0)","v":0},{"$f":"IF(O$58='Capital Cont Inputs'!$B$10,O146*O$80*O137/('Standard Inputs'!$B$12+'NPV Calc'!O137),0)","v":0},{"$f":"IF(P$58='Capital Cont Inputs'!$B$10,P146*P$80*P137/('Standard Inputs'!$B$12+'NPV Calc'!P137),0)","v":0},{"$f":"IF(Q$58='Capital Cont Inputs'!$B$10,Q146*Q$80*Q137/('Standard Inputs'!$B$12+'NPV Calc'!Q137),0)","v":0},{"$f":"IF(R$58='Capital Cont Inputs'!$B$10,R146*R$80*R137/('Standard Inputs'!$B$12+'NPV Calc'!R137),0)","v":0},{"$f":"IF(S$58='Capital Cont Inputs'!$B$10,S146*S$80*S137/('Standard Inputs'!$B$12+'NPV Calc'!S137),0)","v":0},{"$f":"IF(T$58='Capital Cont Inputs'!$B$10,T146*T$80*T137/('Standard Inputs'!$B$12+'NPV Calc'!T137),0)","v":0},{"$f":"IF(U$58='Capital Cont Inputs'!$B$10,U146*U$80*U137/('Standard Inputs'!$B$12+'NPV Calc'!U137),0)","v":0},{"$f":"IF(V$58='Capital Cont Inputs'!$B$10,V146*V$80*V137/('Standard Inputs'!$B$12+'NPV Calc'!V137),0)","v":0},{"$f":"IF(W$58='Capital Cont Inputs'!$B$10,W146*W$80*W137/('Standard Inputs'!$B$12+'NPV Calc'!W137),0)","v":0},{"$f":"IF(X$58='Capital Cont Inputs'!$B$10,X146*X$80*X137/('Standard Inputs'!$B$12+'NPV Calc'!X137),0)","v":0},{"$f":"IF(Y$58='Capital Cont Inputs'!$B$10,Y146*Y$80*Y137/('Standard Inputs'!$B$12+'NPV Calc'!Y137),0)","v":0},{"$f":"IF(Z$58='Capital Cont Inputs'!$B$10,Z146*Z$80*Z137/('Standard Inputs'!$B$12+'NPV Calc'!Z137),0)","v":0},{"$f":"IF(AA$58='Capital Cont Inputs'!$B$10,AA146*AA$80*AA137/('Standard Inputs'!$B$12+'NPV Calc'!AA137),0)","v":0},{"$f":"IF(AB$58='Capital Cont Inputs'!$B$10,AB146*AB$80*AB137/('Standard Inputs'!$B$12+'NPV Calc'!AB137),0)","v":0},{"$f":"IF(AC$58='Capital Cont Inputs'!$B$10,AC146*AC$80*AC137/('Standard Inputs'!$B$12+'NPV Calc'!AC137),0)","v":0},{"$f":"IF(AD$58='Capital Cont Inputs'!$B$10,AD146*AD$80*AD137/('Standard Inputs'!$B$12+'NPV Calc'!AD137),0)","v":0}]
[]
[null,{"$f":"'Project Inputs'!A54&\" - $k:\"","v":"Decision Support defined costs (2) - $k:"}]
[null,"CCA rate",null,null,{"$f":"'Standard Inputs'!C32","v":0},{"$f":"E151","v":0},0,0,0,0,0,0,0,0,0,0,0,0,0,0,0,0,0,0,0,0,0,0,0,0]
[]
[null,"Opening UCC",null,null,0,{"$f":"IF(ISNUMBER(F$57),E160,0)","v":0},0,0,0,0,0,0,0,0,0,0,0,0,0,0,0,0,0,0,0,0,0,0,0,0]
[null,"Additions",null,null,null,{"$f":"SUM('Project Inputs'!$B$55:$B$57)-((E43)*'NPV Calc'!$C$63)-(F$43*'NPV Calc'!$C$63)","v":0}]
[null,"Procceeds from disposal"]
[]
[null,"UCC for CCA",null,null,{"$f":"IF(E153+E154<0,0,E153+(E154)*0.5)","v":0},{"$f":"IF(F153+F154<0,0,F153+(F154)*0.5)","v":0},0,0,0,0,0,0,0,0,0,0,0,0,0,0,0,0,0,0,0,0,0,0,0,0]
[]
[null,"CCA claim",null,null,{"$f":"IF(E157<0,0,E157*E151)","v":0},0,0,0,0,0,0,0,0,0,0,0,0,0,0,0,0,0,0,0,0,0,0,0,0,0]
[null,"Ending UCC",null,null,{"$f":"IF((E153+E154-E155-E159)<0,0,E153+E154-E155-E159)","v":0},0,0,0,0,0,0,0,0,0,0,0,0,0,0,0,0,0,0,0,0,0,0,0,0,0]
[]
[null,"CCA tax shield adjustment",null,null,{"$f":"IF(E$58='Capital Cont Inputs'!$B$10,E160*E$80*E151/('Standard Inputs'!$B$12+'NPV Calc'!E151),0)","v":0},{"$f":"IF(F$58='Capital Cont Inputs'!$B$10,F160*F$80*F151/('Standard Inputs'!$B$12+'NPV Calc'!F151),0)","v":0},{"$f":"IF(G$58='Capital Cont Inputs'!$B$10,G160*G$80*G151/('Standard Inputs'!$B$12+'NPV Calc'!G151),0)","v":0},{"$f":"IF(H$58='Capital Cont Inputs'!$B$10,H160*H$80*H151/('Standard Inputs'!$B$12+'NPV Calc'!H151),0)","v":0},{"$f":"IF(I$58='Capital Cont Inputs'!$B$10,I160*I$80*I151/('Standard Inputs'!$B$12+'NPV Calc'!I151),0)","v":0},{"$f":"IF(J$58='Capital Cont Inputs'!$B$10,J160*J$80*J151/('Standard Inputs'!$B$12+'NPV Calc'!J151),0)","v":0},{"$f":"IF(K$58='Capital Cont Inputs'!$B$10,K160*K$80*K151/('Standard Inputs'!$B$12+'NPV Calc'!K151),0)","v":0},{"$f":"IF(L$58='Capital Cont Inputs'!$B$10,L160*L$80*L151/('Standard Inputs'!$B$12+'NPV Calc'!L151),0)","v":0},{"$f":"IF(M$58='Capital Cont Inputs'!$B$10,M160*M$80*M151/('Standard Inputs'!$B$12+'NPV Calc'!M151),0)","v":0},{"$f":"IF(N$58='Capital Cont Inputs'!$B$10,N160*N$80*N151/('Standard Inputs'!$B$12+'NPV Calc'!N151),0)","v":0},{"$f":"IF(O$58='Capital Cont Inputs'!$B$10,O160*O$80*O151/('Standard Inputs'!$B$12+'NPV Calc'!O151),0)","v":0},{"$f":"IF(P$58='Capital Cont Inputs'!$B$10,P160*P$80*P151/('Standard Inputs'!$B$12+'NPV Calc'!P151),0)","v":0},{"$f":"IF(Q$58='Capital Cont Inputs'!$B$10,Q160*Q$80*Q151/('Standard Inputs'!$B$12+'NPV Calc'!Q151),0)","v":0},{"$f":"IF(R$58='Capital Cont Inputs'!$B$10,R160*R$80*R151/('Standard Inputs'!$B$12+'NPV Calc'!R151),0)","v":0},{"$f":"IF(S$58='Capital Cont Inputs'!$B$10,S160*S$80*S151/('Standard Inputs'!$B$12+'NPV Calc'!S151),0)","v":0},{"$f":"IF(T$58='Capital Cont Inputs'!$B$10,T160*T$80*T151/('Standard Inputs'!$B$12+'NPV Calc'!T151),0)","v":0},{"$f":"IF(U$58='Capital Cont Inputs'!$B$10,U160*U$80*U151/('Standard Inputs'!$B$12+'NPV Calc'!U151),0)","v":0},{"$f":"IF(V$58='Capital Cont Inputs'!$B$10,V160*V$80*V151/('Standard Inputs'!$B$12+'NPV Calc'!V151),0)","v":0},{"$f":"IF(W$58='Capital Cont Inputs'!$B$10,W160*W$80*W151/('Standard Inputs'!$B$12+'NPV Calc'!W151),0)","v":0},{"$f":"IF(X$58='Capital Cont Inputs'!$B$10,X160*X$80*X151/('Standard Inputs'!$B$12+'NPV Calc'!X151),0)","v":0},{"$f":"IF(Y$58='Capital Cont Inputs'!$B$10,Y160*Y$80*Y151/('Standard Inputs'!$B$12+'NPV Calc'!Y151),0)","v":0},{"$f":"IF(Z$58='Capital Cont Inputs'!$B$10,Z160*Z$80*Z151/('Standard Inputs'!$B$12+'NPV Calc'!Z151),0)","v":0},{"$f":"IF(AA$58='Capital Cont Inputs'!$B$10,AA160*AA$80*AA151/('Standard Inputs'!$B$12+'NPV Calc'!AA151),0)","v":0},{"$f":"IF(AB$58='Capital Cont Inputs'!$B$10,AB160*AB$80*AB151/('Standard Inputs'!$B$12+'NPV Calc'!AB151),0)","v":0},{"$f":"IF(AC$58='Capital Cont Inputs'!$B$10,AC160*AC$80*AC151/('Standard Inputs'!$B$12+'NPV Calc'!AC151),0)","v":0},{"$f":"IF(AD$58='Capital Cont Inputs'!$B$10,AD160*AD$80*AD151/('Standard Inputs'!$B$12+'NPV Calc'!AD151),0)","v":0}]
[]
[null,{"$f":"'Project Inputs'!A60&\" - $k:\"","v":"Decision Support defined costs (3) - $k:"}]
[null,"CCA rate",null,null,{"$f":"'Standard Inputs'!C33","v":0},{"$f":"E165","v":0},0,0,0,0,0,0,0,0,0,0,0,0,0,0,0,0,0,0,0,0,0,0,0,0]
[]
[null,"Opening UCC",null,null,0,{"$f":"IF(ISNUMBER(F$57),E174,0)","v":0},0,0,0,0,0,0,0,0,0,0,0,0,0,0,0,0,0,0,0,0,0,0,0,0]
[null,"Additions",null,null,null,{"$f":"SUM('Project Inputs'!$B$61:$B$63)-((E43)*'NPV Calc'!$C$64)-(F$43*'NPV Calc'!$C$64)","v":0}]
[null,"Procceeds from disposal"]
[]
[null,"UCC for CCA",null,null,{"$f":"IF(E167+E168<0,0,E167+(E168)*0.5)","v":0},{"$f":"IF(F167+F168<0,0,F167+(F168)*0.5)","v":0},0,0,0,0,0,0,0,0,0,0,0,0,0,0,0,0,0,0,0,0,0,0,0,0]
[]
[null,"CCA claim",null,null,{"$f":"IF(E171<0,0,E171*E165)","v":0},0,0,0,0,0,0,0,0,0,0,0,0,0,0,0,0,0,0,0,0,0,0,0,0,0]
[null,"Ending UCC",null,null,{"$f":"IF((E167+E168-E169-E173)<0,0,E167+E168-E169-E173)","v":0},0,0,0,0,0,0,0,0,0,0,0,0,0,0,0,0,0,0,0,0,0,0,0,0,0]
[]
[null,"CCA tax shield adjustment",null,null,{"$f":"IF(E$58='Capital Cont Inputs'!$B$10,E174*E$80*E165/('Standard Inputs'!$B$12+'NPV Calc'!E165),0)","v":0},{"$f":"IF(F$58='Capital Cont Inputs'!$B$10,F174*F$80*F165/('Standard Inputs'!$B$12+'NPV Calc'!F165),0)","v":0},{"$f":"IF(G$58='Capital Cont Inputs'!$B$10,G174*G$80*G165/('Standard Inputs'!$B$12+'NPV Calc'!G165),0)","v":0},{"$f":"IF(H$58='Capital Cont Inputs'!$B$10,H174*H$80*H165/('Standard Inputs'!$B$12+'NPV Calc'!H165),0)","v":0},{"$f":"IF(I$58='Capital Cont Inputs'!$B$10,I174*I$80*I165/('Standard Inputs'!$B$12+'NPV Calc'!I165),0)","v":0},{"$f":"IF(J$58='Capital Cont Inputs'!$B$10,J174*J$80*J165/('Standard Inputs'!$B$12+'NPV Calc'!J165),0)","v":0},{"$f":"IF(K$58='Capital Cont Inputs'!$B$10,K174*K$80*K165/('Standard Inputs'!$B$12+'NPV Calc'!K165),0)","v":0},{"$f":"IF(L$58='Capital Cont Inputs'!$B$10,L174*L$80*L165/('Standard Inputs'!$B$12+'NPV Calc'!L165),0)","v":0},{"$f":"IF(M$58='Capital Cont Inputs'!$B$10,M174*M$80*M165/('Standard Inputs'!$B$12+'NPV Calc'!M165),0)","v":0},{"$f":"IF(N$58='Capital Cont Inputs'!$B$10,N174*N$80*N165/('Standard Inputs'!$B$12+'NPV Calc'!N165),0)","v":0},{"$f":"IF(O$58='Capital Cont Inputs'!$B$10,O174*O$80*O165/('Standard Inputs'!$B$12+'NPV Calc'!O165),0)","v":0},{"$f":"IF(P$58='Capital Cont Inputs'!$B$10,P174*P$80*P165/('Standard Inputs'!$B$12+'NPV Calc'!P165),0)","v":0},{"$f":"IF(Q$58='Capital Cont Inputs'!$B$10,Q174*Q$80*Q165/('Standard Inputs'!$B$12+'NPV Calc'!Q165),0)","v":0},{"$f":"IF(R$58='Capital Cont Inputs'!$B$10,R174*R$80*R165/('Standard Inputs'!$B$12+'NPV Calc'!R165),0)","v":0},{"$f":"IF(S$58='Capital Cont Inputs'!$B$10,S174*S$80*S165/('Standard Inputs'!$B$12+'NPV Calc'!S165),0)","v":0},{"$f":"IF(T$58='Capital Cont Inputs'!$B$10,T174*T$80*T165/('Standard Inputs'!$B$12+'NPV Calc'!T165),0)","v":0},{"$f":"IF(U$58='Capital Cont Inputs'!$B$10,U174*U$80*U165/('Standard Inputs'!$B$12+'NPV Calc'!U165),0)","v":0},{"$f":"IF(V$58='Capital Cont Inputs'!$B$10,V174*V$80*V165/('Standard Inputs'!$B$12+'NPV Calc'!V165),0)","v":0},{"$f":"IF(W$58='Capital Cont Inputs'!$B$10,W174*W$80*W165/('Standard Inputs'!$B$12+'NPV Calc'!W165),0)","v":0},{"$f":"IF(X$58='Capital Cont Inputs'!$B$10,X174*X$80*X165/('Standard Inputs'!$B$12+'NPV Calc'!X165),0)","v":0},{"$f":"IF(Y$58='Capital Cont Inputs'!$B$10,Y174*Y$80*Y165/('Standard Inputs'!$B$12+'NPV Calc'!Y165),0)","v":0},{"$f":"IF(Z$58='Capital Cont Inputs'!$B$10,Z174*Z$80*Z165/('Standard Inputs'!$B$12+'NPV Calc'!Z165),0)","v":0},{"$f":"IF(AA$58='Capital Cont Inputs'!$B$10,AA174*AA$80*AA165/('Standard Inputs'!$B$12+'NPV Calc'!AA165),0)","v":0},{"$f":"IF(AB$58='Capital Cont Inputs'!$B$10,AB174*AB$80*AB165/('Standard Inputs'!$B$12+'NPV Calc'!AB165),0)","v":0},{"$f":"IF(AC$58='Capital Cont Inputs'!$B$10,AC174*AC$80*AC165/('Standard Inputs'!$B$12+'NPV Calc'!AC165),0)","v":0},{"$f":"IF(AD$58='Capital Cont Inputs'!$B$10,AD174*AD$80*AD165/('Standard Inputs'!$B$12+'NPV Calc'!AD165),0)","v":0}]
[]
[null,"Ontario Capital Tax:"]
[null,"Ending UCC",null,null,{"$f":"E110","v":0},8727.2292153098333,8052.8362230298135,7432.3946701321947,6861.5884414663851,6336.4467110938403,5853.3163191510994,5408.8363585637771,4999.9147948234413,4623.7069561823319,4277.595744632511,3959.1734300066764,3666.2249005509084,3396.7122534516016,3148.7606181202395,2920.6451136153864,2710.7788494709216,2517.7018864580141,2340.0710804861387,2176.6507389920139,2026.3040248174188,1887.9850477767914,1760.7315888994142,1643.6584067322271,1535.951079138415,1436.8603377521079]
[null,"Ontario Capital Tax Rate (OCT)",null,null,{"$f":"'Standard Inputs'!$B$22","v":2.2499999999999998E-3},{"$f":"'Standard Inputs'!$B$22","v":2.2499999999999998E-3},{"$f":"'Standard Inputs'!$B$22","v":2.2499999999999998E-3},{"$f":"'Standard Inputs'!$B$22","v":2.2499999999999998E-3},{"$f":"'Standard Inputs'!$B$22","v":2.2499999999999998E-3},{"$f":"'Standard Inputs'!$B$22","v":2.2499999999999998E-3},{"$f":"'Standard Inputs'!$B$22","v":2.2499999999999998E-3},{"$f":"'Standard Inputs'!$B$22","v":2.2499999999999998E-3},{"$f":"'Standard Inputs'!$B$22","v":2.2499999999999998E-3},{"$f":"'Standard Inputs'!$B$22","v":2.2499999999999998E-3},{"$f":"'Standard Inputs'!$B$22","v":2.2499999999999998E-3},{"$f":"'Standard Inputs'!$B$22","v":2.2499999999999998E-3},{"$f":"'Standard Inputs'!$B$22","v":2.2499999999999998E-3},{"$f":"'Standard Inputs'!$B$22","v":2.2499999999999998E-3},{"$f":"'Standard Inputs'!$B$22","v":2.2499999999999998E-3},{"$f":"'Standard Inputs'!$B$22","v":2.2499999999999998E-3},{"$f":"'Standard Inputs'!$B$22","v":2.2499999999999998E-3},{"$f":"'Standard Inputs'!$B$22","v":2.2499999999999998E-3},{"$f":"'Standard Inputs'!$B$22","v":2.2499999999999998E-3},{"$f":"'Standard Inputs'!$B$22","v":2.2499999999999998E-3},{"$f":"'Standard Inputs'!$B$22","v":2.2499999999999998E-3},{"$f":"'Standard Inputs'!$B$22","v":2.2499999999999998E-3},{"$f":"'Standard Inputs'!$B$22","v":2.2499999999999998E-3},{"$f":"'Standard Inputs'!$B$22","v":2.2499999999999998E-3},{"$f":"'Standard Inputs'!$B$22","v":2.2499999999999998E-3},{"$f":"'Standard Inputs'!$B$22","v":2.2499999999999998E-3}]
[null,"Total Ontario Capital Tax",null,null,{"$f":"E179*E180","v":0},{"$f":"F179*F180","v":19.636265734447125},18.118881501817079,16.722888007797437,15.438573993299366,14.257005099961139,13.169961718089972,12.169881806768498,11.249808288352742,10.403340651410247,9.6245904254231487,8.9081402175150206,8.2490060262395435,7.6426025702661029,7.0847113907705381,6.5714515056346192,6.099252411309573,5.664829244530531,5.2651599310938115,4.8974641627320308,4.5591840558391921,4.2479663574977806,3.9616460750236815,3.6982314151475109,3.4558899280614335,3.2329357599422424]

{"sheet":"Standard Report","index":6,"n_rows":98,"n_cols":34,"rows_kept":98,"cut":false,"hidden":false,"merged":[[90,31,90,32],[61,2,61,12],[62,2,62,12],[1,8,1,20],[4,9,4,19],[5,9,5,19],[2,8,2,20]]}
["`"]
[null,null,null,null,"Date:","2015-09-02",null,null,{"$f":"IF('Capital Cont Inputs'!B52=\"Revenue Guarantee\",\"SUMMARY OF REVENUE GUARANTEE\",\"SUMMARY OF CONTRIBUTION CALCULATIONS\")","v":"SUMMARY OF CONTRIBUTION CALCULATIONS"}]
[null,null,null,null,"Project #",{"$f":"'Project Inputs'!B7","v":0},null,null,{"$f":"'Project Inputs'!B17&\" Pool\"&\" - \"&'Project Inputs'!B28","v":"Transformation Pool - 1st true-up"}]
[]
[null,null,null,null,null,null,null,null,null,{"$f":"IF(AND('Capital Cont Inputs'!B31=\"Yes\",'Capital Cont Inputs'!B52=\"Revenue Guarantee\"),\"Warning - the revenue guarantee has not been calculated, therefore the revenue guarantee report is not available for review.\",IF(AND('Capital Cont Inputs'!B45=\"Revenue Guarantee\",'Capital Cont Inputs'!B52=\"Revenue Guarantee\",ROUND(NPVStandardReport,6)<>0),\"WARNING - the NPV has changed since the last run of the Revenue Guarantee. Please re-run before reporting.\",IF(AND('Capital Cont Inputs'!B45=\"Revenue Guarantee\",'Capital Cont Inputs'!B52=\"IEE/True-up\",NPVStandardReport<>NPVBeforeCC),\"Warning - the NPV has changed since the last run of the Revenue Guarantee. Please re-run before reporting.\",IF(AND((ROUND('NPV Calc'!D53,6)<>ROUND('Standard Report'!F96,6)),'Capital Cont Inputs'!B31=\"Yes\"),\"WARNING - the NPV has changed since the last run of the IEE calculation. Please re-run before reporting.\",\"\"))))","v":""}]
[null,null,null,null,null,null,null,null,null,{"$f":"IF('NPV Calc'!C2=\"Yes\",\"WARNING - The detailed report is set to include capital contributions. Therefore, the report is not correct.\",\"\")","v":""}]
[]
[null,null,null,null,"Facility Name:",null,{"$f":"'Project Inputs'!B9","v":"Holland TS"}]
[null,null,null,null,"Description:",null,{"$f":"'Project Inputs'!B11","v":"Capital Contribution, Transformation Pool, Newmarket Hydro"}]
[null,null,null,null,"Customer:",null,{"$f":"Customer","v":"Newmarket Hydro"}]
[]
[null,null,null,null,null,null,null,null,"In-Service"]
[null,null,null,null,null,null,null,null,"Date","<-------","Project year ended - annualized from In-Service Date       -------->"]
[null,null,null,null,null,null,"Month",null,{"$f":"IF(ISNUMBER(I15),'Project Inputs'!$B$15,\"\")","v":"2009-05-01"},{"$f":"IF(ISNUMBER(J15),'Project Inputs'!$B$15,\"\")","v":"2009-05-01"},{"$f":"IF(ISNUMBER(K15),'Project Inputs'!$B$15,\"\")","v":"2009-05-01"},{"$f":"IF(ISNUMBER(L15),'Project Inputs'!$B$15,\"\")","v":"2009-05-01"},{"$f":"IF(ISNUMBER(M15),'Project Inputs'!$B$15,\"\")","v":"2009-05-01"},{"$f":"IF(ISNUMBER(N15),'Project Inputs'!$B$15,\"\")","v":"2009-05-01"},{"$f":"IF(ISNUMBER(O15),'Project Inputs'!$B$15,\"\")","v":"2009-05-01"},{"$f":"IF(ISNUMBER(P15),'Project Inputs'!$B$15,\"\")","v":"2009-05-01"},{"$f":"IF(ISNUMBER(Q15),'Project Inputs'!$B$15,\"\")","v":"2009-05-01"},{"$f":"IF(ISNUMBER(R15),'Project Inputs'!$B$15,\"\")","v":"2009-05-01"},{"$f":"IF(ISNUMBER(S15),'Project Inputs'!$B$15,\"\")","v":"2009-05-01"},{"$f":"IF(ISNUMBER(T15),'Project Inputs'!$B$15,\"\")","v":"2009-05-01"},{"$f":"IF(ISNUMBER(U15),'Project Inputs'!$B$15,\"\")","v":"2009-05-01"},{"$f":"IF(ISNUMBER(V15),'Project Inputs'!$B$15,\"\")","v":"2009-05-01"},{"$f":"IF(ISNUMBER(W15),'Project Inputs'!$B$15,\"\")","v":"2009-05-01"},{"$f":"IF(ISNUMBER(X15),'Project Inputs'!$B$15,\"\")","v":"2009-05-01"},{"$f":"IF(ISNUMBER(Y15),'Project Inputs'!$B$15,\"\")","v":"2009-05-01"},{"$f":"IF(ISNUMBER(Z15),'Project Inputs'!$B$15,\"\")","v":"2009-05-01"},{"$f":"IF(ISNUMBER(AA15),'Project Inputs'!$B$15,\"\")","v":"2009-05-01"},{"$f":"IF(ISNUMBER(AB15),'Project Inputs'!$B$15,\"\")","v":"2009-05-01"},{"$f":"IF(ISNUMBER(AC15),'Project Inputs'!$B$15,\"\")","v":"2009-05-01"},{"$f":"IF(ISNUMBER(AD15),'Project Inputs'!$B$15,\"\")","v":"2009-05-01"},{"$f":"IF(ISNUMBER(AE15),'Project Inputs'!$B$15,\"\")","v":"2009-05-01"},{"$f":"IF(ISNUMBER(AF15),'Project Inputs'!$B$15,\"\")","v":"2009-05-01"},{"$f":"IF(ISNUMBER(AG15),'Project Inputs'!$B$15,\"\")","v":"2009-05-01"},{"$f":"IF(ISNUMBER(AH15),'Project Inputs'!$B$15,\"\")","v":"2009-05-01"}]
[null,null,null,null,null,null,"Year",null,{"$f":"'Capital Cont Inputs'!B15","v":2009},{"$f":"'Capital Cont Inputs'!C15","v":2010},{"$f":"'Capital Cont Inputs'!D15","v":2011},{"$f":"'Capital Cont Inputs'!E15","v":2012},{"$f":"'Capital Cont Inputs'!F15","v":2013},{"$f":"'Capital Cont Inputs'!G15","v":2014},{"$f":"'Capital Cont Inputs'!H15","v":2015},{"$f":"'Capital Cont Inputs'!I15","v":2016},{"$f":"'Capital Cont Inputs'!J15","v":2017},{"$f":"'Capital Cont Inputs'!K15","v":2018},{"$f":"'Capital Cont Inputs'!L15","v":2019},{"$f":"'Capital Cont Inputs'!M15","v":2020},{"$f":"'Capital Cont Inputs'!N15","v":2021},{"$f":"'Capital Cont Inputs'!O15","v":2022},{"$f":"'Capital Cont Inputs'!P15","v":2023},{"$f":"'Capital Cont Inputs'!Q15","v":2024},{"$f":"'Capital Cont Inputs'!R15","v":2025},{"$f":"'Capital Cont Inputs'!S15","v":2026},{"$f":"'Capital Cont Inputs'!T15","v":2027},{"$f":"'Capital Cont Inputs'!U15","v":2028},{"$f":"'Capital Cont Inputs'!V15","v":2029},{"$f":"'Capital Cont Inputs'!W15","v":2030},{"$f":"'Capital Cont Inputs'!X15","v":2031},{"$f":"'Capital Cont Inputs'!Y15","v":2032},{"$f":"'Capital Cont Inputs'!Z15","v":2033},{"$f":"'Capital Cont Inputs'!AA15","v":2034}]
[null,null,null,null,null,null,null,null,null,{"$f":"IF(ISNA('Capital Cont Inputs'!C14),\"\",'Capital Cont Inputs'!C14)","v":""},{"$f":"IF(ISNA('Capital Cont Inputs'!D14),\"\",'Capital Cont Inputs'!D14)","v":""},{"$f":"IF(ISNA('Capital Cont Inputs'!E14),\"\",'Capital Cont Inputs'!E14)","v":""},{"$f":"IF(ISNA('Capital Cont Inputs'!F14),\"\",'Capital Cont Inputs'!F14)","v":""},{"$f":"IF(ISNA('Capital Cont Inputs'!G14),\"\",'Capital Cont Inputs'!G14)","v":"1st true-up"},{"$f":"IF(ISNA('Capital Cont Inputs'!H14),\"\",'Capital Cont Inputs'!H14)","v":""},{"$f":"IF(ISNA('Capital Cont Inputs'!I14),\"\",'Capital Cont Inputs'!I14)","v":""},{"$f":"IF(ISNA('Capital Cont Inputs'!J14),\"\",'Capital Cont Inputs'!J14)","v":""},{"$f":"IF(ISNA('Capital Cont Inputs'!K14),\"\",'Capital Cont Inputs'!K14)","v":""},{"$f":"IF(ISNA('Capital Cont Inputs'!L14),\"\",'Capital Cont Inputs'!L14)","v":"2nd true-up"},{"$f":"IF(ISNA('Capital Cont Inputs'!M14),\"\",'Capital Cont Inputs'!M14)","v":""},{"$f":"IF(ISNA('Capital Cont Inputs'!N14),\"\",'Capital Cont Inputs'!N14)","v":""},{"$f":"IF(ISNA('Capital Cont Inputs'!O14),\"\",'Capital Cont Inputs'!O14)","v":""},{"$f":"IF(ISNA('Capital Cont Inputs'!P14),\"\",'Capital Cont Inputs'!P14)","v":""},{"$f":"IF(ISNA('Capital Cont Inputs'!Q14),\"\",'Capital Cont Inputs'!Q14)","v":"3rd true-up"},{"$f":"IF(ISNA('Capital Cont Inputs'!R14),\"\",'Capital Cont Inputs'!R14)","v":""},{"$f":"IF(ISNA('Capital Cont Inputs'!S14),\"\",'Capital Cont Inputs'!S14)","v":""},{"$f":"IF(ISNA('Capital Cont Inputs'!T14),\"\",'Capital Cont Inputs'!T14)","v":""},{"$f":"IF(ISNA('Capital Cont Inputs'!U14),\"\",'Capital Cont Inputs'!U14)","v":""},{"$f":"IF(ISNA('Capital Cont Inputs'!V14),\"\",'Capital Cont Inputs'!V14)","v":""},{"$f":"IF(ISNA('Capital Cont Inputs'!W14),\"\",'Capital Cont Inputs'!W14)","v":""},{"$f":"IF(ISNA('Capital Cont Inputs'!X14),\"\",'Capital Cont Inputs'!X14)","v":""},{"$f":"IF(ISNA('Capital Cont Inputs'!Y14),\"\",'Capital Cont Inputs'!Y14)","v":""},{"$f":"IF(ISNA('Capital Cont Inputs'!Z14),\"\",'Capital Cont Inputs'!Z14)","v":""},{"$f":"IF(ISNA('Capital Cont Inputs'!AA14),\"\",'Capital Cont Inputs'!AA14)","v":""}]
[null,null,null,null,null,null,null,null,{"$f":"'Capital Cont Inputs'!B16","v":0},{"$f":"'Capital Cont Inputs'!C16","v":1},{"$f":"'Capital Cont Inputs'!D16","v":2},{"$f":"'Capital Cont Inputs'!E16","v":3},{"$f":"'Capital Cont Inputs'!F16","v":4},{"$f":"'Capital Cont Inputs'!G16","v":5},{"$f":"'Capital Cont Inputs'!H16","v":6},{"$f":"'Capital Cont Inputs'!I16","v":7},{"$f":"'Capital Cont Inputs'!J16","v":8},{"$f":"'Capital Cont Inputs'!K16","v":9},{"$f":"'Capital Cont Inputs'!L16","v":10},{"$f":"'Capital Cont Inputs'!M16","v":11},{"$f":"'Capital Cont Inputs'!N16","v":12},{"$f":"'Capital Cont Inputs'!O16","v":13},{"$f":"'Capital Cont Inputs'!P16","v":14},{"$f":"'Capital Cont Inputs'!Q16","v":15},{"$f":"'Capital Cont Inputs'!R16","v":16},{"$f":"'Capital Cont Inputs'!S16","v":17},{"$f":"'Capital Cont Inputs'!T16","v":18},{"$f":"'Capital Cont Inputs'!U16","v":19},{"$f":"'Capital Cont Inputs'!V16","v":20},{"$f":"'Capital Cont Inputs'!W16","v":21},{"$f":"'Capital Cont Inputs'!X16","v":22},{"$f":"'Capital Cont Inputs'!Y16","v":23},{"$f":"'Capital Cont Inputs'!Z16","v":24},{"$f":"'Capital Cont Inputs'!AA16","v":25}]
[null,null,"Revenue & Expense Forecast"]
[null,null,null,null,"Load Forecast (MW)",null,null,null,null,{"$f":"'NPV Calc'!F10","v":0},{"$f":"'NPV Calc'!G10","v":2.230416666666649},{"$f":"'NPV Calc'!H10","v":0},{"$f":"'NPV Calc'!I10","v":0},{"$f":"'NPV Calc'!J10","v":5.1048333333333247},{"$f":"'NPV Calc'!K10","v":14.174999999999997},{"$f":"'NPV Calc'!L10","v":16.766999999999996},{"$f":"'NPV Calc'!M10","v":19.359000000000009},{"$f":"'NPV Calc'!N10","v":21.950999999999993},{"$f":"'NPV Calc'!O10","v":24.705000000000013},{"$f":"'NPV Calc'!P10","v":27.459000000000003},{"$f":"'NPV Calc'!Q10","v":28.188000000000017},{"$f":"'NPV Calc'!R10","v":28.836000000000013},{"$f":"'NPV Calc'!S10","v":29.564999999999998},{"$f":"'NPV Calc'!T10","v":30.294000000000011},{"$f":"'NPV Calc'!U10","v":31.023000000000025},{"$f":"'NPV Calc'!V10","v":31.751999999999981},{"$f":"'NPV Calc'!W10","v":32.480999999999995},{"$f":"'NPV Calc'!X10","v":33.210000000000008},{"$f":"'NPV Calc'!Y10","v":33.939000000000021},{"$f":"'NPV Calc'!Z10","v":34.668000000000006},{"$f":"'NPV Calc'!AA10","v":35.396999999999991},{"$f":"'NPV Calc'!AB10","v":36.126000000000005},{"$f":"'NPV Calc'!AC10","v":36.855000000000018},{"$f":"'NPV Calc'!AD10","v":37.664999999999992}]
[null,null,null,null,"Load adjustments (MW)",null,null,null,null,{"$f":"'NPV Calc'!F11","v":0},{"$f":"'NPV Calc'!G11","v":0},{"$f":"'NPV Calc'!H11","v":0},{"$f":"'NPV Calc'!I11","v":0},{"$f":"'NPV Calc'!J11","v":0},{"$f":"'NPV Calc'!K11","v":0},{"$f":"'NPV Calc'!L11","v":0},{"$f":"'NPV Calc'!M11","v":0},{"$f":"'NPV Calc'!N11","v":0},{"$f":"'NPV Calc'!O11","v":0},{"$f":"'NPV Calc'!P11","v":0},{"$f":"'NPV Calc'!Q11","v":0},{"$f":"'NPV Calc'!R11","v":0},{"$f":"'NPV Calc'!S11","v":0},{"$f":"'NPV Calc'!T11","v":0},{"$f":"'NPV Calc'!U11","v":0},{"$f":"'NPV Calc'!V11","v":0},{"$f":"'NPV Calc'!W11","v":0},{"$f":"'NPV Calc'!X11","v":0},{"$f":"'NPV Calc'!Y11","v":0},{"$f":"'NPV Calc'!Z11","v":0},{"$f":"'NPV Calc'!AA11","v":0},{"$f":"'NPV Calc'!AB11","v":0},{"$f":"'NPV Calc'!AC11","v":0},{"$f":"'NPV Calc'!AD11","v":0}]
[null,null,null,null,null,null,null,null,null,{"$f":"J19+J20","v":0},{"$f":"K19+K20","v":2.230416666666649},0,0,5.1048333333333247,14.174999999999997,16.766999999999996,19.359000000000009,21.950999999999993,24.705000000000013,27.459000000000003,28.188000000000017,28.836000000000013,29.564999999999998,30.294000000000011,31.023000000000025,31.751999999999981,32.480999999999995,33.210000000000008,33.939000000000021,34.668000000000006,35.396999999999991,36.126000000000005,36.855000000000018,37.664999999999992]
[null,null,null,null,"Tariff Applied ($/kW/Month)",null,null,null,null,{"$f":"'NPV Calc'!F14","v":1.61},{"$f":"'NPV Calc'!G14","v":1.61},{"$f":"'NPV Calc'!H14","v":1.61},{"$f":"'NPV Calc'!I14","v":1.61},{"$f":"'NPV Calc'!J14","v":1.61},{"$f":"'NPV Calc'!K14","v":1.61},{"$f":"'NPV Calc'!L14","v":1.61},{"$f":"'NPV Calc'!M14","v":1.61},{"$f":"'NPV Calc'!N14","v":1.61},{"$f":"'NPV Calc'!O14","v":1.61},{"$f":"'NPV Calc'!P14","v":1.61},{"$f":"'NPV Calc'!Q14","v":1.61},{"$f":"'NPV Calc'!R14","v":1.61},{"$f":"'NPV Calc'!S14","v":1.61},{"$f":"'NPV Calc'!T14","v":1.61},{"$f":"'NPV Calc'!U14","v":1.61},{"$f":"'NPV Calc'!V14","v":1.61},{"$f":"'NPV Calc'!W14","v":1.61},{"$f":"'NPV Calc'!X14","v":1.61},{"$f":"'NPV Calc'!Y14","v":1.61},{"$f":"'NPV Calc'!Z14","v":1.61},{"$f":"'NPV Calc'!AA14","v":1.61},{"$f":"'NPV Calc'!AB14","v":1.61},{"$f":"'NPV Calc'!AC14","v":1.61},{"$f":"'NPV Calc'!AD14","v":1.61}]
[null,null,"Incremental Revenue - $k",null,null,null,null,null,null,{"$f":"J21*J22*12","v":0},{"$f":"K21*K22*12","v":43.09164999999966},0,0,98.625379999999836,273.86099999999999,323.93843999999996,374.01588000000021,424.09331999999995,477.30060000000026,530.50788000000011,544.59216000000038,557.11152000000027,571.19579999999996,585.28008000000023,599.36436000000049,613.44863999999961,627.53291999999988,641.61720000000014,655.7014800000004,669.78576000000021,683.87003999999979,697.95432000000005,712.03860000000032,727.68779999999992]
[null,null,null,null,"Removal Costs - $k",null,null,null,{"$f":"'NPV Calc'!E20","v":0}]
[null,null,null,null,"On-going OM&A Costs - $k",null,null,null,{"$f":"'NPV Calc'!E21","v":0},{"$f":"'NPV Calc'!F21","v":-42},{"$f":"'NPV Calc'!G21","v":-42},{"$f":"'NPV Calc'!H21","v":-42},{"$f":"'NPV Calc'!I21","v":-42},{"$f":"'NPV Calc'!J21","v":-42},{"$f":"'NPV Calc'!K21","v":-42},{"$f":"'NPV Calc'!L21","v":-42},{"$f":"'NPV Calc'!M21","v":-42},{"$f":"'NPV Calc'!N21","v":-42},{"$f":"'NPV Calc'!O21","v":-42},{"$f":"'NPV Calc'!P21","v":-42},{"$f":"'NPV Calc'!Q21","v":-42},{"$f":"'NPV Calc'!R21","v":-42},{"$f":"'NPV Calc'!S21","v":-42},{"$f":"'NPV Calc'!T21","v":-42},{"$f":"'NPV Calc'!U21","v":-65},{"$f":"'NPV Calc'!V21","v":-65},{"$f":"'NPV Calc'!W21","v":-65},{"$f":"'NPV Calc'!X21","v":-65},{"$f":"'NPV Calc'!Y21","v":-65},{"$f":"'NPV Calc'!Z21","v":-65},{"$f":"'NPV Calc'!AA21","v":-65},{"$f":"'NPV Calc'!AB21","v":-65},{"$f":"'NPV Calc'!AC21","v":-65},{"$f":"'NPV Calc'!AD21","v":-65}]
[null,null,null,null,"Ontario Capital Tax and Municipal Tax - $K",null,null,null,null,{"$f":"'NPV Calc'!F23+'NPV Calc'!F22","v":-76.393418216178844},{"$f":"'NPV Calc'!G23+'NPV Calc'!G22","v":-74.876033983548808},{"$f":"'NPV Calc'!H23+'NPV Calc'!H22","v":-73.480040489529159},{"$f":"'NPV Calc'!I23+'NPV Calc'!I22","v":-72.195726475031094},{"$f":"'NPV Calc'!J23+'NPV Calc'!J22","v":-71.014157581692857},{"$f":"'NPV Calc'!K23+'NPV Calc'!K22","v":-69.927114199821688},{"$f":"'NPV Calc'!L23+'NPV Calc'!L22","v":-68.927034288500224},{"$f":"'NPV Calc'!M23+'NPV Calc'!M22","v":-68.006960770084461},{"$f":"'NPV Calc'!N23+'NPV Calc'!N22","v":-67.160493133141969},{"$f":"'NPV Calc'!O23+'NPV Calc'!O22","v":-66.381742907154873},{"$f":"'NPV Calc'!P23+'NPV Calc'!P22","v":-65.665292699246748},{"$f":"'NPV Calc'!Q23+'NPV Calc'!Q22","v":-65.006158507971264},{"$f":"'NPV Calc'!R23+'NPV Calc'!R22","v":-64.399755051997829},{"$f":"'NPV Calc'!S23+'NPV Calc'!S22","v":-63.841863872502259},{"$f":"'NPV Calc'!T23+'NPV Calc'!T22","v":-63.328603987366343},{"$f":"'NPV Calc'!U23+'NPV Calc'!U22","v":-62.856404893041294},{"$f":"'NPV Calc'!V23+'NPV Calc'!V22","v":-62.421981726262253},{"$f":"'NPV Calc'!W23+'NPV Calc'!W22","v":-62.022312412825535},{"$f":"'NPV Calc'!X23+'NPV Calc'!X22","v":-61.654616644463751},{"$f":"'NPV Calc'!Y23+'NPV Calc'!Y22","v":-61.316336537570912},{"$f":"'NPV Calc'!Z23+'NPV Calc'!Z22","v":-61.005118839229503},{"$f":"'NPV Calc'!AA23+'NPV Calc'!AA22","v":-60.718798556755402},{"$f":"'NPV Calc'!AB23+'NPV Calc'!AB22","v":-60.455383896879233},{"$f":"'NPV Calc'!AC23+'NPV Calc'!AC22","v":-60.213042409793154},{"$f":"'NPV Calc'!AD23+'NPV Calc'!AD22","v":-59.990088241673966}]
[null,null,"Net Revenue/(Costs) before taxes - $k",null,null,null,null,null,{"$f":"SUM(I23:I26)","v":0},-118.39341821617884,-73.784383983549148,-115.48004048952916,-114.19572647503109,-14.38877758169302,161.9338858001783,213.01140571149972,264.00891922991576,314.93282686685797,368.91885709284537,422.84258730075339,437.58600149202914,450.71176494800244,465.35393612749772,479.95147601263386,471.50795510695917,486.02665827373738,500.51060758717432,514.96258335553637,529.38514346242948,543.78064116077076,558.15124144324443,572.49893610312085,586.82555759020715,602.69771175832591]
[null,null,null,null,"Income Taxes - $k",null,null,null,{"$f":"'NPV Calc'!E27","v":0},{"$f":"'NPV Calc'!F27","v":157.32932240127772},{"$f":"'NPV Calc'!G27","v":250.6394210482959},{"$f":"'NPV Calc'!H27","v":246.53373378469468},{"$f":"'NPV Calc'!I27","v":229.47565497218159},{"$f":"'NPV Calc'!J27","v":180.74272016466966},{"$f":"'NPV Calc'!K27","v":107.60082955775857},{"$f":"'NPV Calc'!L27","v":77.541965883400437},{"$f":"'NPV Calc'!M27","v":48.545735910990828},{"$f":"'NPV Calc'!N27","v":20.527128944374191},{"$f":"'NPV Calc'!O27","v":-7.6405612569133341},{"$f":"'NPV Calc'!P27","v":-34.980791346097703},{"$f":"'NPV Calc'!Q27","v":-48.453553132147455},{"$f":"'NPV Calc'!R27","v":-60.701704479313086},{"$f":"'NPV Calc'!S27","v":-72.829770766705437},{"$f":"'NPV Calc'!T27","v":-84.365050455106555},{"$f":"'NPV Calc'!U27","v":-87.649966472435594},{"$f":"'NPV Calc'!V27","v":-98.138147912377931},{"$f":"'NPV Calc'!W27","v":-108.16473354112526},{"$f":"'NPV Calc'!X27","v":-117.76665102357279},{"$f":"'NPV Calc'!Y27","v":-126.97787381142454},{"$f":"'NPV Calc'!Z27","v":-135.82965748024802},{"$f":"'NPV Calc'!AA27","v":-144.35075715956549},{"$f":"'NPV Calc'!AB27","v":-152.56762756853783},{"$f":"'NPV Calc'!AC27","v":-160.50460704879234},{"$f":"'NPV Calc'!AD27","v":-168.70833507462632}]
[null,null,"Operating Cash Flow (after taxes) - $k",null,null,null,null,null,{"$f":"SUM(I27:I28)","v":0},{"$f":"SUM(J27:J28)","v":38.935904185098877},176.85503706474674,131.05369329516552,115.27992849715049,166.35394258297663,269.53471535793688,290.55337159490017,312.55465514090656,335.45995581123213,361.27829583593206,387.86179595465569,389.13244835988166,390.01006046868935,392.52416536079227,395.58642555752732,383.85798863452356,387.88851036135947,392.34587404604906,397.1959323319636,402.40726965100492,407.95098368052277,413.80048428367894,419.93130853458302,426.32095054141485,433.98937668369956]
[null,null,null,null,null,null,"Cumulative PV @"]
[null,null,null,null,null,null,{"$f":"'Standard Inputs'!B12","v":5.681332E-2}]
[null,null,"PV Operating Cash Flow (after taxes) - $k               (A)",null,null,null,{"$f":"SUM(I32:AH32)","v":3908.717760009044},null,{"$f":"I29*'NPV Calc'!E50","v":0},{"$f":"J29*'NPV Calc'!F50","v":37.874867769166976},{"$f":"K29*'NPV Calc'!G50","v":162.78711105731091},{"$f":"L29*'NPV Calc'!H50","v":114.14412635133348},{"$f":"M29*'NPV Calc'!I50","v":95.007901100118985},{"$f":"N29*'NPV Calc'!J50","v":129.73012753437675},{"$f":"O29*'NPV Calc'!K50","v":198.89514289116235},{"$f":"P29*'NPV Calc'!L50","v":202.87900647127131},{"$f":"Q29*'NPV Calc'!M50","v":206.50895221188054},{"$f":"R29*'NPV Calc'!N50","v":209.72747032679507},{"$f":"S29*'NPV Calc'!O50","v":213.72642743001327},{"$f":"T29*'NPV Calc'!P50","v":217.11762529119437},{"$f":"U29*'NPV Calc'!Q50","v":206.11862863199732},{"$f":"V29*'NPV Calc'!R50","v":195.47774896948883},{"$f":"W29*'NPV Calc'!S50","v":186.161401411713},{"$f":"X29*'NPV Calc'!T50","v":177.52778843160209},{"$f":"Y29*'NPV Calc'!U50","v":163.00362670613612},{"$f":"Z29*'NPV Calc'!V50","v":155.86023295166478},{"$f":"AA29*'NPV Calc'!W50","v":149.17608898226544},{"$f":"AB29*'NPV Calc'!X50","v":142.90145172719002},{"$f":"AC29*'NPV Calc'!Y50","v":136.99331907805788},{"$f":"AD29*'NPV Calc'!Z50","v":131.41449675487715},{"$f":"AE29*'NPV Calc'!AA50","v":126.13279160382822},{"$f":"AF29*'NPV Calc'!AB50","v":121.12031452859112},{"$f":"AG29*'NPV Calc'!AC50","v":116.35287846168978},{"$f":"AH29*'NPV Calc'!AD50","v":112.07823333531842}]
[]
[null,null,"Capital Expenditures - $k"]
[null,null,null,null,"Capital cost before overheads & AFUDC - $k",null,null,null,{"$f":"'NPV Calc'!D33","v":-9078.4755654556775}]
[null,null,null,null,"               - Overheads - $k",null,null,null,{"$f":"'NPV Calc'!E34","v":0}]
[null,null,null,null,"               - AFUDC - $k",null,null,null,{"$f":"'NPV Calc'!E35","v":0}]
[null,null,null,null,"Total upfront capital expenditures - $k",null,null,null,{"$f":"SUM(I35:I37)","v":-9078.4755654556775}]
[null,null,null,null,"On-going capital expenditures - $k",null,null,null,null,{"$f":"'NPV Calc'!F39","v":0},{"$f":"'NPV Calc'!G39","v":0},{"$f":"'NPV Calc'!H39","v":0},{"$f":"'NPV Calc'!I39","v":0},{"$f":"'NPV Calc'!J39","v":0},{"$f":"'NPV Calc'!K39","v":0},{"$f":"'NPV Calc'!L39","v":0},{"$f":"'NPV Calc'!M39","v":0},{"$f":"'NPV Calc'!N39","v":0},{"$f":"'NPV Calc'!O39","v":0},{"$f":"'NPV Calc'!P39","v":0},{"$f":"'NPV Calc'!Q39","v":0},{"$f":"'NPV Calc'!R39","v":0},{"$f":"'NPV Calc'!S39","v":0},{"$f":"'NPV Calc'!T39","v":0},{"$f":"'NPV Calc'!U39","v":0},{"$f":"'NPV Calc'!V39","v":0},{"$f":"'NPV Calc'!W39","v":0},{"$f":"'NPV Calc'!X39","v":0},{"$f":"'NPV Calc'!Y39","v":0},{"$f":"'NPV Calc'!Z39","v":0},{"$f":"'NPV Calc'!AA39","v":0},{"$f":"'NPV Calc'!AB39","v":0},{"$f":"'NPV Calc'!AC39","v":0},{"$f":"'NPV Calc'!AD39","v":0}]
[null,null,null,null,"PV On-going capital expenditures - $k",null,null,null,{"$f":"'NPV Calc'!D39","v":0}]
[null,null,null,null,"Total capital expenditures - $k",null,null,null,{"$f":"I38+I40","v":-9078.4755654556775}]
[]
[null,null,"Capital Contributions - $k"]
[null,null,null,null,"Previous capital contribution/(credit)",null,null,null,{"$f":"'NPV Calc'!E41","v":0},{"$f":"IF(J15>=True_up_year,\"\",'NPV Calc'!F41)","v":0},{"$f":"IF(K15>=True_up_year,\"\",'NPV Calc'!G41)","v":0},{"$f":"IF(L15>=True_up_year,\"\",'NPV Calc'!H41)","v":0},{"$f":"IF(M15>=True_up_year,\"\",'NPV Calc'!I41)","v":0},{"$f":"IF(N15>=True_up_year,\"\",'NPV Calc'!J41)","v":""},{"$f":"IF(O15>=True_up_year,\"\",'NPV Calc'!K41)","v":""},{"$f":"IF(P15>=True_up_year,\"\",'NPV Calc'!L41)","v":""},{"$f":"IF(Q15>=True_up_year,\"\",'NPV Calc'!M41)","v":""},{"$f":"IF(R15>=True_up_year,\"\",'NPV Calc'!N41)","v":""},{"$f":"IF(S15>=True_up_year,\"\",'NPV Calc'!O41)","v":""},{"$f":"IF(T15>=True_up_year,\"\",'NPV Calc'!P41)","v":""},{"$f":"IF(U15>=True_up_year,\"\",'NPV Calc'!Q41)","v":""},{"$f":"IF(V15>=True_up_year,\"\",'NPV Calc'!R41)","v":""},{"$f":"IF(W15>=True_up_year,\"\",'NPV Calc'!S41)","v":""},{"$f":"IF(X15>=True_up_year,\"\",'NPV Calc'!T41)","v":""},{"$f":"IF(Y15>=True_up_year,\"\",'NPV Calc'!U41)","v":""},{"$f":"IF(Z15>=True_up_year,\"\",'NPV Calc'!V41)","v":""},{"$f":"IF(AA15>=True_up_year,\"\",'NPV Calc'!W41)","v":""},{"$f":"IF(AB15>=True_up_year,\"\",'NPV Calc'!X41)","v":""},{"$f":"IF(AC15>=True_up_year,\"\",'NPV Calc'!Y41)","v":""},{"$f":"IF(AD15>=True_up_year,\"\",'NPV Calc'!Z41)","v":""},{"$f":"IF(AE15>=True_up_year,\"\",'NPV Calc'!AA41)","v":""},{"$f":"IF(AF15>=True_up_year,\"\",'NPV Calc'!AB41)","v":""},{"$f":"IF(AG15>=True_up_year,\"\",'NPV Calc'!AC41)","v":""},{"$f":"IF(AH15>=True_up_year,\"\",'NPV Calc'!AD41)","v":""}]
[null,null,null,null,"Current capital contribution/(credit)",null,null,null,{"$f":"IF(I15=True_up_year,'NPV Calc'!E42,\"\")","v":""},{"$f":"IF(J15=True_up_year,'NPV Calc'!F42,\"\")","v":""},{"$f":"IF(K15=True_up_year,'NPV Calc'!G42,\"\")","v":""},{"$f":"IF(L15=True_up_year,'NPV Calc'!H42,\"\")","v":""},{"$f":"IF(M15=True_up_year,'NPV Calc'!I42,\"\")","v":""},{"$f":"IF(N15=True_up_year,'NPV Calc'!J42,\"\")","v":0},{"$f":"IF(O15=True_up_year,'NPV Calc'!K42,\"\")","v":""},{"$f":"IF(P15=True_up_year,'NPV Calc'!L42,\"\")","v":""},{"$f":"IF(Q15=True_up_year,'NPV Calc'!M42,\"\")","v":""},{"$f":"IF(R15=True_up_year,'NPV Calc'!N42,\"\")","v":""},{"$f":"IF(S15=True_up_year,'NPV Calc'!O42,\"\")","v":""},{"$f":"IF(T15=True_up_year,'NPV Calc'!P42,\"\")","v":""},{"$f":"IF(U15=True_up_year,'NPV Calc'!Q42,\"\")","v":""},{"$f":"IF(V15=True_up_year,'NPV Calc'!R42,\"\")","v":""},{"$f":"IF(W15=True_up_year,'NPV Calc'!S42,\"\")","v":""},{"$f":"IF(X15=True_up_year,'NPV Calc'!T42,\"\")","v":""},{"$f":"IF(Y15=True_up_year,'NPV Calc'!U42,\"\")","v":""},{"$f":"IF(Z15=True_up_year,'NPV Calc'!V42,\"\")","v":""},{"$f":"IF(AA15=True_up_year,'NPV Calc'!W42,\"\")","v":""},{"$f":"IF(AB15=True_up_year,'NPV Calc'!X42,\"\")","v":""},{"$f":"IF(AC15=True_up_year,'NPV Calc'!Y42,\"\")","v":""},{"$f":"IF(AD15=True_up_year,'NPV Calc'!Z42,\"\")","v":""},{"$f":"IF(AE15=True_up_year,'NPV Calc'!AA42,\"\")","v":""},{"$f":"IF(AF15=True_up_year,'NPV Calc'!AB42,\"\")","v":""},{"$f":"IF(AG15=True_up_year,'NPV Calc'!AC42,\"\")","v":""},{"$f":"IF(AH15=True_up_year,'NPV Calc'!AD42,\"\")","v":""}]
[null,null,null,null,"PV of annual capital contribution",null,null,null,{"$f":"IF(AND(I45=\"\",I44=\"\"),\"\",'NPV Calc'!E55)","v":0},{"$f":"IF(AND(J45=\"\",J44=\"\"),\"\",'NPV Calc'!F55)","v":0},{"$f":"IF(AND(K45=\"\",K44=\"\"),\"\",'NPV Calc'!G55)","v":0},{"$f":"IF(AND(L45=\"\",L44=\"\"),\"\",'NPV Calc'!H55)","v":0},{"$f":"IF(AND(M45=\"\",M44=\"\"),\"\",'NPV Calc'!I55)","v":0},{"$f":"IF(AND(N45=\"\",N44=\"\"),\"\",'NPV Calc'!J55)","v":0},{"$f":"IF(AND(O45=\"\",O44=\"\"),\"\",'NPV Calc'!K55)","v":""},{"$f":"IF(AND(P45=\"\",P44=\"\"),\"\",'NPV Calc'!L55)","v":""},{"$f":"IF(AND(Q45=\"\",Q44=\"\"),\"\",'NPV Calc'!M55)","v":""},{"$f":"IF(AND(R45=\"\",R44=\"\"),\"\",'NPV Calc'!N55)","v":""},{"$f":"IF(AND(S45=\"\",S44=\"\"),\"\",'NPV Calc'!O55)","v":""},{"$f":"IF(AND(T45=\"\",T44=\"\"),\"\",'NPV Calc'!P55)","v":""},{"$f":"IF(AND(U45=\"\",U44=\"\"),\"\",'NPV Calc'!Q55)","v":""},{"$f":"IF(AND(V45=\"\",V44=\"\"),\"\",'NPV Calc'!R55)","v":""},{"$f":"IF(AND(W45=\"\",W44=\"\"),\"\",'NPV Calc'!S55)","v":""},{"$f":"IF(AND(X45=\"\",X44=\"\"),\"\",'NPV Calc'!T55)","v":""},{"$f":"IF(AND(Y45=\"\",Y44=\"\"),\"\",'NPV Calc'!U55)","v":""},{"$f":"IF(AND(Z45=\"\",Z44=\"\"),\"\",'NPV Calc'!V55)","v":""},{"$f":"IF(AND(AA45=\"\",AA44=\"\"),\"\",'NPV Calc'!W55)","v":""},{"$f":"IF(AND(AB45=\"\",AB44=\"\"),\"\",'NPV Calc'!X55)","v":""},{"$f":"IF(AND(AC45=\"\",AC44=\"\"),\"\",'NPV Calc'!Y55)","v":""},{"$f":"IF(AND(AD45=\"\",AD44=\"\"),\"\",'NPV Calc'!Z55)","v":""},{"$f":"IF(AND(AE45=\"\",AE44=\"\"),\"\",'NPV Calc'!AA55)","v":""},{"$f":"IF(AND(AF45=\"\",AF44=\"\"),\"\",'NPV Calc'!AB55)","v":""},{"$f":"IF(AND(AG45=\"\",AG44=\"\"),\"\",'NPV Calc'!AC55)","v":""},{"$f":"IF(AND(AH45=\"\",AH44=\"\"),\"\",'NPV Calc'!AD55)","v":""}]
[null,null,null,null,"Total PV",null,null,null,{"$f":"'NPV Calc'!D43","v":0}]
[]
[]
[null,null,"PV Proceeds on disposal of assets - $k",null,null,null,null,null,{"$f":"'NPV Calc'!D28+'NPV Calc'!D46+'NPV Calc'!D47","v":0}]
[]
[null,null,"PV CCA Residual Tax Shield - $k",null,null,null,null,null,{"$f":"'NPV Calc'!D29","v":56.076431486452229}]
[]
[null,null,"PV Working Capital - $k",null,null,null,null,null,{"$f":"'NPV Calc'!D45","v":-1.6006090947398783}]
[]
[null,null,"PV Capital (after taxes) - $k                                       (B)",null,null,null,{"$f":"+I56","v":-9023.9997430639651},null,{"$f":"I41+I47+I50+I52+I54","v":-9023.9997430639651}]
[]
[]
[null,null,"Cumulative PV Cash Flow (after taxes) - $k   (A) + (B)",null,null,null,{"$f":"G32+G56","v":-5115.2819830549215},null,{"$f":"I56+I32","v":-9023.9997430639651},{"$f":"IF(ISNUMBER(J17),I59+J32,0)","v":-8986.1248752947977},-8823.3377642374871,-8709.1936378861537,-8614.1857367860339,-8484.4556092516577,-8285.5604663604954,-8082.6814598892242,-7876.1725076773437,-7666.4450373505488,-7452.7186099205355,-7235.6009846293409,-7029.4823559973438,-6834.0046070278549,-6647.8432056161419,-6470.3154171845399,-6307.311790478404,-6151.4515575267396,-6002.2754685444743,-5859.3740168172844,-5722.3806977392269,-5590.9662009843496,-5464.8334093805215,-5343.7130948519307,-5227.3602163902406,-5115.2819830549224]
[]
[]
[]
[null,null,"Discounted Cash Flow Summary",null,null,null,null,null,null,null,null,null,null,null,"Capital Contributions",null,null,null,null,null,null,null,null,null,null,"Other Assumptions",null,null,null,"Notes:"]
[null,null,null,null,null,null,null,null,null,null,null,null,null,null,null,null,null,null,"PV of",null,"Previous",null,"Current"]
[null,null,"Economic Study Horizon - Years:",null,null,null,{"$f":"IF(ISNUMBER('Project Inputs'!B21),'Project Inputs'!B21,'Project Inputs'!E19)","v":25},null,null,null,null,null,null,null,null,null,"Date",null,"Cont",null,"Cont Payments",null,"Cont / (Credit)",null,null,"In-Service Date:",null,null,{"$f":"'Project Inputs'!B15","v":"2009-05-01"}]
[null,null,null,null,null,null,null,null,null,null,null,null,null,null,null,null,null,null,"$k",null,"$k",null,"$k"]
[null,null,"Discount Rate - %",null,null,null,{"$f":"'Standard Inputs'!B12","v":5.681332E-2},null,null,null,null,null,null,null,"Initial economic evaluation",null,{"$f":"YEAR(AC65)","v":2009},null,{"$f":"'Report After Cont $k'!I46","v":0},null,{"$f":"IF(AND(RevGuarFlag=\"Yes\",Stage='Standard Inputs'!E55,'Capital Cont Inputs'!B27=\"No\"),IEECapCon,'Report After Cont $k'!I44)","v":0},null,{"$f":"IF(AND(RevGuarFlag=\"Yes\",Stage='Standard Inputs'!E55,'Capital Cont Inputs'!B27=\"No\"),'Capital Cont Inputs'!B18,IF(OR(Stage='Standard Inputs'!E54,Stage='Standard Inputs'!E55),'Report After Cont $k'!I45,\"\"))","v":""},null,null,"Municipal Tax",null,null,{"$f":"'Standard Inputs'!B25","v":6.2518373346398823E-3},"Transmission system average"]
[]
[null,null,null,null,null,null,"Before",null,null,"After",null,null,null,null,{"$f":"IF(ISNUMBER(Q69),'Standard Inputs'!E56,\"\")","v":"1st true-up"},null,{"$f":"IF(OR('Project Inputs'!B28='Standard Inputs'!E56,'Project Inputs'!B28='Standard Inputs'!E57,'Project Inputs'!B28='Standard Inputs'!E58,'Project Inputs'!B28='Standard Inputs'!E59,'Project Inputs'!B28='Standard Inputs'!E60),HLOOKUP('Standard Inputs'!E56,'Capital Cont Inputs'!$B$14:$AA$15,MATCH('Capital Cont Inputs'!$A$15,'Capital Cont Inputs'!$A$14:$A$18,0),0),\"\")","v":2014},null,{"$f":"IF(ISNA(HLOOKUP('Standard Inputs'!E56,'Report After Cont $k'!$I$16:$AH$59,MATCH('Report After Cont $k'!$E$46,'Report After Cont $k'!E16:E60,0),0)),\"\",HLOOKUP('Standard Inputs'!E56,'Report After Cont $k'!$I$16:$AH$59,MATCH('Report After Cont $k'!$E$46,'Report After Cont $k'!E16:E60,0),0))","v":6205.3626134131946},null,{"$f":"IF(ISNA(HLOOKUP('Standard Inputs'!E56,'Report After Cont $k'!$I$16:$AH$59,MATCH('Report After Cont $k'!$E$44,'Report After Cont $k'!E16:E60,0),0)),\"\",HLOOKUP('Standard Inputs'!E56,'Report After Cont $k'!$I$16:$AH$59,MATCH('Report After Cont $k'!$E$44,'Report After Cont $k'!E16:E60,0),0))","v":""},null,{"$f":"IF(ISNA(HLOOKUP('Standard Inputs'!E56,'Report After Cont $k'!$I$16:$AH$59,MATCH('Report After Cont $k'!$E$45,'Report After Cont $k'!E16:E60,0),0)),\"\",HLOOKUP('Standard Inputs'!E56,'Report After Cont $k'!$I$16:$AH$59,MATCH('Report After Cont $k'!$E$45,'Report After Cont $k'!E16:E60,0),0))","v":8180.0989492524241},null,null,"Federal Income Tax",null,null,{"$f":"'Standard Inputs'!B16","v":0.19500000000000001},{"$f":"\"Federal corporate income tax\"","v":"Federal corporate income tax"}]
[null,null,null,null,null,null,"Cont",null,null,"Cont",null,"Impact"]
[null,null,null,null,null,null,"$k",null,null,"$k",null,"$k",null,null,{"$f":"IF(ISNUMBER(Q71),'Standard Inputs'!E57,\"\")","v":""},null,{"$f":"IF(OR('Project Inputs'!B28='Standard Inputs'!E57,'Project Inputs'!B28='Standard Inputs'!E58,'Project Inputs'!B28='Standard Inputs'!E59,'Project Inputs'!B28='Standard Inputs'!E60),HLOOKUP('Standard Inputs'!E57,'Capital Cont Inputs'!$B$14:$AA$15,MATCH('Capital Cont Inputs'!$A$15,'Capital Cont Inputs'!$A$14:$A$18,0),0),\"\")","v":""},null,{"$f":"IF(ISNA(HLOOKUP('Standard Inputs'!E57,'Report After Cont $k'!$I$16:$AH$59,MATCH('Report After Cont $k'!$E$46,'Report After Cont $k'!E16:E60,0),0)),\"\",HLOOKUP('Standard Inputs'!E57,'Report After Cont $k'!$I$16:$AH$59,MATCH('Report After Cont $k'!$E$46,'Report After Cont $k'!E16:E60,0),0))","v":""},null,{"$f":"IF(ISNA(HLOOKUP('Standard Inputs'!E57,'Report After Cont $k'!$I$16:$AH$59,MATCH('Report After Cont $k'!$E$44,'Report After Cont $k'!E16:E60,0),0)),\"\",HLOOKUP('Standard Inputs'!E57,'Report After Cont $k'!$I$16:$AH$59,MATCH('Report After Cont $k'!$E$44,'Report After Cont $k'!E16:E60,0),0))","v":""},null,{"$f":"IF(ISNA(HLOOKUP('Standard Inputs'!E57,'Report After Cont $k'!$I$16:$AH$59,MATCH('Report After Cont $k'!$E$45,'Report After Cont $k'!E16:E60,0),0)),\"\",HLOOKUP('Standard Inputs'!E57,'Report After Cont $k'!$I$16:$AH$59,MATCH('Report After Cont $k'!$E$45,'Report After Cont $k'!E16:E60,0),0))","v":""},null,null,"Ontario Corporation Income Tax",null,null,{"$f":"'Standard Inputs'!B17","v":0.14000000000000001},{"$f":"\"Provincial corporate income tax\"","v":"Provincial corporate income tax"}]
[]
[null,null,"   PV Incremental Revenue",null,null,null,{"$f":"'NPV Calc'!D17","v":4939.1481250228608},null,null,{"$f":"'Report After Cont $k'!G73","v":4939.1481250228608},null,{"$f":"IF(J73-G73=0,\"\",J73-G73)","v":""},null,null,{"$f":"IF(ISNUMBER(Q73),'Standard Inputs'!E58,\"\")","v":""},null,{"$f":"IF(OR('Project Inputs'!B28='Standard Inputs'!E58,'Project Inputs'!B28='Standard Inputs'!E59,'Project Inputs'!B28='Standard Inputs'!E60),HLOOKUP('Standard Inputs'!E58,'Capital Cont Inputs'!$B$14:$AA$15,MATCH('Capital Cont Inputs'!$A$15,'Capital Cont Inputs'!$A$14:$A$18,0),0),\"\")","v":""},null,{"$f":"IF(ISNA(HLOOKUP('Standard Inputs'!E58,'Report After Cont $k'!$I$16:$AH$59,MATCH('Report After Cont $k'!$E$46,'Report After Cont $k'!E16:E60,0),0)),\"\",HLOOKUP('Standard Inputs'!E58,'Report After Cont $k'!$I$16:$AH$59,MATCH('Report After Cont $k'!$E$46,'Report After Cont $k'!E16:E60,0),0))","v":""},null,{"$f":"IF(ISNA(HLOOKUP('Standard Inputs'!E58,'Report After Cont $k'!$I$16:$AH$59,MATCH('Report After Cont $k'!$E$44,'Report After Cont $k'!E16:E60,0),0)),\"\",HLOOKUP('Standard Inputs'!E58,'Report After Cont $k'!$I$16:$AH$59,MATCH('Report After Cont $k'!$E$44,'Report After Cont $k'!E16:E60,0),0))","v":""},null,{"$f":"IF(ISNA(HLOOKUP('Standard Inputs'!E58,'Report After Cont $k'!$I$16:$AH$59,MATCH('Report After Cont $k'!$E$45,'Report After Cont $k'!E16:E60,0),0)),\"\",HLOOKUP('Standard Inputs'!E58,'Report After Cont $k'!$I$16:$AH$59,MATCH('Report After Cont $k'!$E$45,'Report After Cont $k'!E16:E60,0),0))","v":""},null,null,"Working cash net lag days",null,null,{"$f":"'Standard Inputs'!B40","v":17.75},{"$f":"'Standard Inputs'!B48","v":"As per Lead Lag study"}]
[null,null,"   PV OM&A Costs",null,null,null,{"$f":"'NPV Calc'!D21+'NPV Calc'!D20","v":-646.18675261741748},null,null,{"$f":"'Report After Cont $k'!G74","v":-646.18675261741748},null,{"$f":"IF(J74-G74=0,\"\",J74-G74)","v":""}]
[null,null,"   PV Ontario Capital Tax and Municipal Tax",null,null,null,{"$f":"'NPV Calc'!D23+'NPV Calc'!D22","v":-916.13347776772105},null,null,{"$f":"'Report After Cont $k'!G75","v":-329.33823987002938},null,586.79523789769166,null,null,{"$f":"IF(ISNUMBER(Q75),'Standard Inputs'!E59,\"\")","v":""},null,{"$f":"IF(OR('Project Inputs'!B28='Standard Inputs'!E59,'Project Inputs'!B28='Standard Inputs'!E60),HLOOKUP('Standard Inputs'!E59,'Capital Cont Inputs'!$B$14:$AA$15,MATCH('Capital Cont Inputs'!$A$15,'Capital Cont Inputs'!$A$14:$A$18,0),0),\"\")","v":""},null,{"$f":"IF(ISNA(HLOOKUP('Standard Inputs'!E59,'Report After Cont $k'!$I$16:$AH$59,MATCH('Report After Cont $k'!$E$46,'Report After Cont $k'!E16:E60,0),0)),\"\",HLOOKUP('Standard Inputs'!E59,'Report After Cont $k'!$I$16:$AH$59,MATCH('Report After Cont $k'!$E$46,'Report After Cont $k'!E16:E60,0),0))","v":""},null,{"$f":"IF(ISNA(HLOOKUP('Standard Inputs'!E59,'Report After Cont $k'!$I$16:$AH$59,MATCH('Report After Cont $k'!$E$44,'Report After Cont $k'!E16:E60,0),0)),\"\",HLOOKUP('Standard Inputs'!E59,'Report After Cont $k'!$I$16:$AH$59,MATCH('Report After Cont $k'!$E$44,'Report After Cont $k'!E16:E60,0),0))","v":""},null,{"$f":"IF(ISNA(HLOOKUP('Standard Inputs'!E59,'Report After Cont $k'!$I$16:$AH$59,MATCH('Report After Cont $k'!$E$45,'Report After Cont $k'!E16:E60,0),0)),\"\",HLOOKUP('Standard Inputs'!E59,'Report After Cont $k'!$I$16:$AH$59,MATCH('Report After Cont $k'!$E$45,'Report After Cont $k'!E16:E60,0),0))","v":""},null,null,{"$f":"\"CCA Rate for Class \"&'Standard Inputs'!B30&\" Assets\"","v":"CCA Rate for Class 47 Assets"},null,null,{"$f":"'Standard Inputs'!C30","v":0.08},{"$f":"+IF('NPV Calc'!F140=0,\"100% Class \"&'Standard Inputs'!B30&\" assets\"&IF('NPV Calc'!F117=0,\"\",\" except for Land\"),ROUND('NPV Calc'!F126/('NPV Calc'!F104-'NPV Calc'!F117)*100,1)&\"% Class \"&'Standard Inputs'!B30&\" assets\"&IF('NPV Calc'!F117=0,\"\",\" except for Land\"))","v":"100% Class 47 assets except for Land"}]
[null,null,"   PV Income Taxes",null,null,null,{"$f":"'NPV Calc'!D27-SUM('NPV Calc'!E98:AD98)*'Standard Inputs'!B19","v":-1131.2373447036371},null,null,{"$f":"'Report After Cont $k'!G76","v":-1749.944996375594},null,-618.70765167195691]
[null,null,"   PV CCA Tax Shield",null,null,null,{"$f":"'NPV Calc'!D29+SUM('NPV Calc'!E98:AD98)*'Standard Inputs'!B19","v":1719.203641561412},null,null,{"$f":"'Report After Cont $k'!G77","v":661.03542497740386},null,-1058.1682165840082,null,null,{"$f":"IF(ISNUMBER(Q77),'Standard Inputs'!E60,\"\")","v":""},null,{"$f":"IF('Project Inputs'!B28='Standard Inputs'!E60,HLOOKUP('Standard Inputs'!E60,'Capital Cont Inputs'!$B$14:$AA$15,MATCH('Capital Cont Inputs'!$A$15,'Capital Cont Inputs'!$A$14:$A$18,0),0),\"\")","v":""},null,{"$f":"IF(ISNA(HLOOKUP('Standard Inputs'!E60,'Report After Cont $k'!$I$16:$AH$59,MATCH('Report After Cont $k'!$E$46,'Report After Cont $k'!E16:E60,0),0)),\"\",HLOOKUP('Standard Inputs'!E60,'Report After Cont $k'!$I$16:$AH$59,MATCH('Report After Cont $k'!$E$46,'Report After Cont $k'!E16:E60,0),0))","v":""},null,{"$f":"IF(ISNA(HLOOKUP('Standard Inputs'!E60,'Report After Cont $k'!$I$16:$AH$59,MATCH('Report After Cont $k'!$E$44,'Report After Cont $k'!E16:E60,0),0)),\"\",HLOOKUP('Standard Inputs'!E60,'Report After Cont $k'!$I$16:$AH$59,MATCH('Report After Cont $k'!$E$44,'Report After Cont $k'!E16:E60,0),0))","v":""},null,{"$f":"IF(ISNA(HLOOKUP('Standard Inputs'!E60,'Report After Cont $k'!$I$16:$AH$59,MATCH('Report After Cont $k'!$E$45,'Report After Cont $k'!E16:E60,0),0)),\"\",HLOOKUP('Standard Inputs'!E60,'Report After Cont $k'!$I$16:$AH$59,MATCH('Report After Cont $k'!$E$45,'Report After Cont $k'!E16:E60,0),0))","v":""}]
[null,null,"   PV Capital - Upfront",null,null,{"$f":"SUM('NPV Calc'!D33:D35)","v":-9078.4755654556775},null,null,{"$f":"'Report After Cont $k'!F78","v":-9078.4755654556775},null,null,""]
[null,null,"  Add: PV Capital Contribution",null,null,{"$f":"'NPV Calc'!D43","v":0},{"$f":"SUM(F78:F79)","v":-9078.4755654556775},null,{"$f":"'Report After Cont $k'!F79","v":6205.3626134131946},{"$f":"'Report After Cont $k'!G79","v":-2873.1129520424829},null,6205.3626134131946,null,null,"Total",null,null,null,{"$f":"SUM(S67:S78)","v":6205.3626134131946},null,{"$f":"SUM(U67:U78)","v":0},null,{"$f":"SUM(W67:W78)","v":8180.0989492524241}]
[null,null,"   PV Capital - On-going",null,null,null,{"$f":"I40","v":0},null,null,{"$f":"'Report After Cont $k'!G80","v":0},null,""]
[null,null,"   PV Proceeds on disposal of assets",null,null,null,{"$f":"I50","v":0},null,null,{"$f":"'Report After Cont $k'!G81","v":0},null,""]
[null,null,"   PV Working Capital",null,null,null,{"$f":"I54","v":-1.6006090947398783},null,null,{"$f":"'Report After Cont $k'!G82","v":-1.6006090947398783},null,"",null,null,{"$f":"\"Contribution Required (before HST)\"","v":"Contribution Required (before HST)"},null,null,null,null,null,null,null,{"$f":"IF(W79<=0,\"N/A\",W79)","v":8180.0989492524241}]
[null,null,"   PV Surplus / (Shortfall)",null,null,null,{"$f":"SUM(G73:G82)","v":-5115.2819830549206},null,null,{"$f":"'Report After Cont $k'!G83","v":4.425348976155874E-13},null,5115.2819830549206]
[null,null,null,null,null,null,null,null,null,null,null,null,null,null,{"$f":"IF('Standard Inputs'!A46=\"HST\",'Standard Inputs'!A46&\" @ \"&'Standard Inputs'!B46*100&\"%\",\"\")","v":""},null,null,null,null,null,null,null,{"$f":"IF(W79<=0,\"N/A\",W79*'Standard Inputs'!B46)","v":409.0049474626212}]
[null,null,null,null," Profitability Index* ",null,{"$f":"IF(G79+G80+G81=0,\" \",(SUM(G73:G77)+G82)/ABS(G79+G80+G81))","v":0.436548355924537},null,null,{"$f":"IF(J79+J80+J81=0,\" \",(SUM(J73:J77)+J82)/ABS(J79+J80+J81))","v":1.0000000000000002}]
[null,null,null,null,null,null,null,null,null,null,null,null,null,null,"Contribution Required (including HST)1",null,null,null,null,null,null,null,{"$f":"IF(W79<=0,\"N/A\",W79+W84)","v":8589.1038967150453}]
[null,null,"Notes:"]
[null,null,"*PV of total cash flow, excluding net capital expenditure & on-going capital & proceeds on disposal / PV of net capital expenditure & on-going capital & proceeds on disposal",null,null,null,null,null,null,null,null,null,null,null,"Notes:"]
[null,null,null,null,null,null,null,null,null,null,null,null,null,null,{"$f":"IF('Standard Inputs'!A46=\"HST\",\"1)  Payment from customer must include HST.\",\"1)  Payment from customer must include HST/GST.\")","v":"1)  Payment from customer must include HST/GST."}]
[]
[null,null,null,null,null,null,null,null,null,null,null,null,null,null,null,null,null,null,null,null,null,null,null,null,null,null,null,null,null,null,"Calculation Time Stamp:","02-Sep-15, 3:25 PM"]
[]
[]
[]
[null,null,null,null,"Net Present Value check:"]
[null,null,null,null,"* Prev NPV $ before cap cont/ rev guar:",-5115.2819830549206]
[null,null,null,null,"* Represents the last recorded NPV before capital contributions or revenue guarantee when either the IEE/true-up or revenue guarantee calculation was completed."]
[null,null,null,null,"Cap Contributions included in report?",{"$f":"'Capital Cont Inputs'!B53","v":"Yes"}]

{"sheet":"Report After Cont $k","index":7,"n_rows":85,"n_cols":40,"rows_kept":85,"cut":false,"hidden":false,"merged":[[61,2,61,7],[62,2,62,7],[1,9,1,20],[2,9,2,20]]}
["`"]
[null,null,null,null,{"$f":"'Standard Report'!E2","v":"Date:"},{"$f":"'Standard Report'!F2","v":"2015-09-02"},null,null,null,{"$f":"IF(OR('Capital Cont Inputs'!B45=\"Revenue Guarantee\",'Capital Cont Inputs'!B39=\"Yes\"),\"THE REVENUE GUARANTEE CALCULATION IS SET TO BE OR HAS BEEN USED. THIS REPORT IS NOT CORRECT.\",\"SUMMARY OF CONTRIBUTION CALCULATIONS\")","v":"SUMMARY OF CONTRIBUTION CALCULATIONS"}]
[null,null,null,null,{"$f":"'Standard Report'!E3","v":"Project #"},{"$f":"'Standard Report'!F3","v":0},null,null,null,{"$f":"'Standard Report'!I3","v":"Transformation Pool - 1st true-up"}]
[]
[]
[]
[]
[null,null,null,null,{"$f":"'Standard Report'!E8","v":"Facility Name:"},null,{"$f":"'Standard Report'!G8","v":"Holland TS"}]
[null,null,null,null,{"$f":"'Standard Report'!E9","v":"Description:"},null,{"$f":"'Standard Report'!G9","v":"Capital Contribution, Transformation Pool, Newmarket Hydro"}]
[null,null,null,null,{"$f":"'Standard Report'!E10","v":"Customer:"},null,{"$f":"'Standard Report'!G10","v":"Newmarket Hydro"}]
[]
[null,null,null,null,null,null,null,null,{"$f":"'Standard Report'!I12","v":"In-Service"}]
[null,null,null,null,null,null,null,null,{"$f":"'Standard Report'!I13","v":"Date"},"<-------","Project year ended - annualized from In-Service Date       -------->"]
[null,null,null,null,null,null,"Month",null,{"$f":"'Standard Report'!I14","v":"2009-05-01"},{"$f":"'Standard Report'!J14","v":"2009-05-01"},{"$f":"'Standard Report'!K14","v":"2009-05-01"},{"$f":"'Standard Report'!L14","v":"2009-05-01"},{"$f":"'Standard Report'!M14","v":"2009-05-01"},{"$f":"'Standard Report'!N14","v":"2009-05-01"},{"$f":"'Standard Report'!O14","v":"2009-05-01"},{"$f":"'Standard Report'!P14","v":"2009-05-01"},{"$f":"'Standard Report'!Q14","v":"2009-05-01"},{"$f":"'Standard Report'!R14","v":"2009-05-01"},{"$f":"'Standard Report'!S14","v":"2009-05-01"},{"$f":"'Standard Report'!T14","v":"2009-05-01"},{"$f":"'Standard Report'!U14","v":"2009-05-01"},{"$f":"'Standard Report'!V14","v":"2009-05-01"},{"$f":"'Standard Report'!W14","v":"2009-05-01"},{"$f":"'Standard Report'!X14","v":"2009-05-01"},{"$f":"'Standard Report'!Y14","v":"2009-05-01"},{"$f":"'Standard Report'!Z14","v":"2009-05-01"},{"$f":"'Standard Report'!AA14","v":"2009-05-01"},{"$f":"'Standard Report'!AB14","v":"2009-05-01"},{"$f":"'Standard Report'!AC14","v":"2009-05-01"},{"$f":"'Standard Report'!AD14","v":"2009-05-01"},{"$f":"'Standard Report'!AE14","v":"2009-05-01"},{"$f":"'Standard Report'!AF14","v":"2009-05-01"},{"$f":"'Standard Report'!AG14","v":"2009-05-01"},{"$f":"'Standard Report'!AH14","v":"2009-05-01"}]
[null,null,null,null,null,null,"Year",null,{"$f":"'Standard Report'!I15","v":2009},{"$f":"'Standard Report'!J15","v":2010},{"$f":"'Standard Report'!K15","v":2011},{"$f":"'Standard Report'!L15","v":2012},{"$f":"'Standard Report'!M15","v":2013},{"$f":"'Standard Report'!N15","v":2014},{"$f":"'Standard Report'!O15","v":2015},{"$f":"'Standard Report'!P15","v":2016},{"$f":"'Standard Report'!Q15","v":2017},{"$f":"'Standard Report'!R15","v":2018},{"$f":"'Standard Report'!S15","v":2019},{"$f":"'Standard Report'!T15","v":2020},{"$f":"'Standard Report'!U15","v":2021},{"$f":"'Standard Report'!V15","v":2022},{"$f":"'Standard Report'!W15","v":2023},{"$f":"'Standard Report'!X15","v":2024},{"$f":"'Standard Report'!Y15","v":2025},{"$f":"'Standard Report'!Z15","v":2026},{"$f":"'Standard Report'!AA15","v":2027},{"$f":"'Standard Report'!AB15","v":2028},{"$f":"'Standard Report'!AC15","v":2029},{"$f":"'Standard Report'!AD15","v":2030},{"$f":"'Standard Report'!AE15","v":2031},{"$f":"'Standard Report'!AF15","v":2032},{"$f":"'Standard Report'!AG15","v":2033},{"$f":"'Standard Report'!AH15","v":2034}]
[null,null,null,null,null,null,null,null,null,{"$f":"'Standard Report'!J16","v":""},{"$f":"'Standard Report'!K16","v":""},{"$f":"'Standard Report'!L16","v":""},{"$f":"'Standard Report'!M16","v":""},{"$f":"'Standard Report'!N16","v":"1st true-up"},{"$f":"'Standard Report'!O16","v":""},{"$f":"'Standard Report'!P16","v":""},{"$f":"'Standard Report'!Q16","v":""},{"$f":"'Standard Report'!R16","v":""},{"$f":"'Standard Report'!S16","v":"2nd true-up"},{"$f":"'Standard Report'!T16","v":""},{"$f":"'Standard Report'!U16","v":""},{"$f":"'Standard Report'!V16","v":""},{"$f":"'Standard Report'!W16","v":""},{"$f":"'Standard Report'!X16","v":"3rd true-up"},{"$f":"'Standard Report'!Y16","v":""},{"$f":"'Standard Report'!Z16","v":""},{"$f":"'Standard Report'!AA16","v":""},{"$f":"'Standard Report'!AB16","v":""},{"$f":"'Standard Report'!AC16","v":""},{"$f":"'Standard Report'!AD16","v":""},{"$f":"'Standard Report'!AE16","v":""},{"$f":"'Standard Report'!AF16","v":""},{"$f":"'Standard Report'!AG16","v":""},{"$f":"'Standard Report'!AH16","v":""}]
[null,null,null,null,null,null,null,null,{"$f":"'Standard Report'!I17","v":0},{"$f":"'Standard Report'!J17","v":1},{"$f":"'Standard Report'!K17","v":2},{"$f":"'Standard Report'!L17","v":3},{"$f":"'Standard Report'!M17","v":4},{"$f":"'Standard Report'!N17","v":5},{"$f":"'Standard Report'!O17","v":6},{"$f":"'Standard Report'!P17","v":7},{"$f":"'Standard Report'!Q17","v":8},{"$f":"'Standard Report'!R17","v":9},{"$f":"'Standard Report'!S17","v":10},{"$f":"'Standard Report'!T17","v":11},{"$f":"'Standard Report'!U17","v":12},{"$f":"'Standard Report'!V17","v":13},{"$f":"'Standard Report'!W17","v":14},{"$f":"'Standard Report'!X17","v":15},{"$f":"'Standard Report'!Y17","v":16},{"$f":"'Standard Report'!Z17","v":17},{"$f":"'Standard Report'!AA17","v":18},{"$f":"'Standard Report'!AB17","v":19},{"$f":"'Standard Report'!AC17","v":20},{"$f":"'Standard Report'!AD17","v":21},{"$f":"'Standard Report'!AE17","v":22},{"$f":"'Standard Report'!AF17","v":23},{"$f":"'Standard Report'!AG17","v":24},{"$f":"'Standard Report'!AH17","v":25}]
[null,null,{"$f":"'Standard Report'!C18","v":"Revenue & Expense Forecast"}]
[null,null,null,null,{"$f":"'Standard Report'!E19","v":"Load Forecast (MW)"},null,null,null,null,0,2.230416666666649,0,0,5.1048333333333247,14.174999999999997,16.766999999999996,19.359000000000009,21.950999999999993,24.705000000000013,27.459000000000003,28.188000000000017,28.836000000000013,29.564999999999998,30.294000000000011,31.023000000000025,31.751999999999981,32.480999999999995,33.210000000000008,33.939000000000021,34.668000000000006,35.396999999999991,36.126000000000005,36.855000000000018,37.664999999999992]
[null,null,null,null,{"$f":"'Standard Report'!E20","v":"Load adjustments (MW)"},null,null,null,null,0,0,0,0,0,0,0,0,0,0,0,0,0,0,0,0,0,0,0,0,0,0,0,0,0]
[null,null,null,null,null,null,null,null,null,0,2.230416666666649,0,0,5.1048333333333247,14.174999999999997,16.766999999999996,19.359000000000009,21.950999999999993,24.705000000000013,27.459000000000003,28.188000000000017,28.836000000000013,29.564999999999998,30.294000000000011,31.023000000000025,31.751999999999981,32.480999999999995,33.210000000000008,33.939000000000021,34.668000000000006,35.396999999999991,36.126000000000005,36.855000000000018,37.664999999999992]
[null,null,null,null,{"$f":"'Standard Report'!E22","v":"Tariff Applied ($/kW/Month)"},null,null,null,null,1.61,1.61,1.61,1.61,1.61,1.61,1.61,1.61,1.61,1.61,1.61,1.61,1.61,1.61,1.61,1.61,1.61,1.61,1.61,1.61,1.61,1.61,1.61,1.61,1.61]
[null,null,{"$f":"'Standard Report'!C23","v":"Incremental Revenue - $k"},null,null,null,null,null,null,0,43.09164999999966,0,0,98.625379999999836,273.86099999999999,323.93843999999996,374.01588000000021,424.09331999999995,477.30060000000026,530.50788000000011,544.59216000000038,557.11152000000027,571.19579999999996,585.28008000000023,599.36436000000049,613.44863999999961,627.53291999999988,641.61720000000014,655.7014800000004,669.78576000000021,683.87003999999979,697.95432000000005,712.03860000000032,727.68779999999992]
[null,null,null,null,{"$f":"'Standard Report'!E24","v":"Removal Costs - $k"},null,null,null,0]
[null,null,null,null,{"$f":"'Standard Report'!E25","v":"On-going OM&A Costs - $k"},null,null,null,0,-42,-42,-42,-42,-42,-42,-42,-42,-42,-42,-42,-42,-42,-42,-42,-65,-65,-65,-65,-65,-65,-65,-65,-65,-65]
[null,null,null,null,{"$f":"'Standard Report'!E26","v":"Ontario Capital Tax and Municipal Tax - $K"},null,null,null,null,-76.393418216178844,-74.876033983548808,-73.480040489529159,-72.195726475031094,-6.2854672963184894,-6.2854672963184894,-6.2854672963184894,-6.2854672963184894,-6.2854672963184894,-6.2854672963184894,-6.2854672963184894,-6.2854672963184894,-6.2854672963184894,-6.2854672963184894,-6.2854672963184894,-6.2854672963184894,-6.2854672963184894,-6.2854672963184894,-6.2854672963184894,-6.2854672963184894,-6.2854672963184894,-6.2854672963184894,-6.2854672963184894,-6.2854672963184894,-6.2854672963184894]
[null,null,{"$f":"'Standard Report'!C27","v":"Net Revenue/(Costs) before taxes - $k"},null,null,null,null,null,0,-118.39341821617884,-73.784383983549148,-115.48004048952916,-114.19572647503109,50.33991270368135,225.57553270368149,275.65297270368148,325.73041270368174,375.80785270368148,429.01513270368179,482.22241270368164,496.3066927036819,508.8260527036818,522.91033270368143,536.9946127036817,528.07889270368196,542.16317270368108,556.24745270368135,570.33173270368161,584.41601270368187,598.50029270368168,612.58457270368126,626.66885270368152,640.75313270368179,656.4023327036814]
[null,null,null,null,{"$f":"'Standard Report'!E28","v":"Income Taxes - $k"},null,null,null,0,157.32932240127772,250.6394210482959,246.53373378469468,229.47565497218159,-558.16602282026417,-75.567803455733312,-92.343745855733303,-109.11968825573339,-125.8956306557333,-143.72006945573341,-161.54450825573335,-166.26274205573344,-170.4567276557334,-175.1749614557333,-179.89319525573339,-176.90642905573347,-181.62466285573316,-186.34289665573326,-191.06113045573335,-195.77936425573344,-200.49759805573336,-205.21583185573323,-209.93406565573332,-214.65229945573341,-219.89478145573329]
[null,null,{"$f":"'Standard Report'!C29","v":"Operating Cash Flow (after taxes) - $k"},null,null,null,null,null,0,38.935904185098877,176.85503706474674,131.05369329516552,115.27992849715049,-507.82611011658281,150.00772924794819,183.3092268479482,216.61072444794834,249.91222204794818,285.29506324794841,320.67790444794832,330.04395064794846,338.36932504794839,347.73537124794814,357.10141744794828,351.17246364794846,360.53850984794792,369.90455604794806,379.27060224794826,388.63664844794846,398.00269464794832,407.36874084794806,416.7347870479482,426.10083324794834,436.50755124794807]
[null,null,null,null,null,null,"Cumulative PV @"]
[null,null,null,null,null,null,5.681332E-2]
[null,null,{"$f":"'Standard Report'!C32","v":"PV Operating Cash Flow (after taxes) - $k               (A)"},null,null,null,2874.7135611372237,null,0,37.874867769166976,162.78711105731091,114.14412635133348,95.007901100118985,-396.02515580807415,110.6937512814558,127.99574004523917,143.1175412295043,156.24356119380829,168.77596947892607,179.50936602488895,174.8201847020662,169.59478917341505,164.91953806828332,160.25682578965399,149.12386056512582,144.87053530045762,140.64354595832347,136.4523532264682,132.30532448489492,128.2098240145568,124.17229666667831,120.19834543509896,116.29280334536838,112.72855468315318]
[]
[null,null,{"$f":"'Standard Report'!C34","v":"Capital Expenditures - $k"}]
[null,null,null,null,{"$f":"'Standard Report'!E35","v":"Capital cost before overheads & AFUDC - $k"},null,null,null,-9078.4755654556775]
[null,null,null,null,{"$f":"'Standard Report'!E36","v":"               - Overheads - $k"},null,null,null,0]
[null,null,null,null,{"$f":"'Standard Report'!E37","v":"               - AFUDC - $k"},null,null,null,0]
[null,null,null,null,{"$f":"'Standard Report'!E38","v":"Total upfront capital expenditures - $k"},null,null,null,-9078.4755654556775]
[null,null,null,null,{"$f":"'Standard Report'!E39","v":"On-going capital expenditures - $k"},null,null,null,null,0,0,0,0,0,0,0,0,0,0,0,0,0,0,0,0,0,0,0,0,0,0,0,0,0]
[null,null,null,null,{"$f":"'Standard Report'!E40","v":"PV On-going capital expenditures - $k"},null,null,null,0]
[null,null,null,null,{"$f":"'Standard Report'!E41","v":"Total capital expenditures - $k"},null,null,null,-9078.4755654556775]
[]
[null,null,{"$f":"'Standard Report'!C43","v":"Capital Contributions - $k"}]
[null,null,null,null,{"$f":"'Standard Report'!E44","v":"Previous capital contribution/(credit)"},null,null,null,0,0,0,0,0,"","","","","","","","","","","","","","","","","","","","",""]
[null,null,null,null,{"$f":"'Standard Report'!E45","v":"Current capital contribution/(credit)"},null,null,null,"","","","","",8180.0989492524241,"","","","","","","","","","","","","","","","","","","",""]
[null,null,null,null,{"$f":"'Standard Report'!E46","v":"PV of annual capital contribution"},null,null,null,0,0,0,0,0,6205.3626134131946,"","","","","","","","","","","","","","","","","","","",""]
[null,null,null,null,{"$f":"'Standard Report'!E47","v":"Total PV"},null,null,null,6205.3626134131946,null,null,null,null,null,null,null,null,null,null,null,null,null,null,null,null,null,null,null,null,null,null,null,null,null,"","","","","",""]
[null,null,null,null,null,null,null,null,null,null,null,null,null,null,null,null,null,null,null,null,null,null,null,null,null,null,null,null,null,null,null,null,null,null,"","","","","",""]
[null,null,null,null,null,null,null,null,null,null,null,null,null,null,null,null,null,null,null,null,null,null,null,null,null,null,null,null,null,null,null,null,null,null,"","","","","",""]
[null,null,{"$f":"'Standard Report'!C50","v":"PV Proceeds on disposal of assets - $k"},null,null,null,null,null,0,null,null,null,null,null,null,null,null,null,null,null,null,null,null,null,null,null,null,null,null,null,null,null,null,null,"","","","","",""]
[]
[null,null,{"$f":"'Standard Report'!C52","v":"PV CCA Residual Tax Shield - $k"},null,null,null,null,null,0]
[]
[null,null,{"$f":"'Standard Report'!C54","v":"PV Working Capital - $k"},null,null,null,null,null,-1.6006090947398783]
[]
[null,null,{"$f":"'Standard Report'!C56","v":"PV Capital (after taxes) - $k                                       (B)"},null,null,null,-2874.7135611372228,null,-2874.7135611372228]
[]
[]
[null,null,{"$f":"'Standard Report'!C59","v":"Cumulative PV Cash Flow (after taxes) - $k   (A) + (B)"},null,null,null,0,null,-2874.7135611372228,-2836.8386933680558,-2674.0515823107448,-2559.9074559594114,-2464.8995548592925,-2860.9247106673665,-2750.2309593859109,-2622.2352193406718,-2479.1176781111676,-2322.8741169173595,-2154.0981474384334,-1974.5887814135444,-1799.7685967114783,-1630.1738075380631,-1465.2542694697797,-1304.9974436801258,-1155.873583115,-1011.0030478145424,-870.35950185621891,-733.90714862975074,-601.60182414485575,-473.39200013029892,-349.21970346362059,-229.02135802852163,-112.72855468315325,-7.1054273576010019E-14]
[]
[]
[]
[null,null,"  Discounted Cash Flow Summary"]
[]
[null,null,"Economic Study Horizon - Years:",null,null,null,{"$f":"'Capital Cont Inputs'!B5","v":25}]
[]
[null,null,"Discount Rate - %",null,null,null,{"$f":"'Standard Inputs'!B12","v":5.681332E-2}]
[]
[]
[null,null,null,null,null,null,"After Con't"]
[null,null,null,null,null,null,"$k"]
[]
[null,null,"   PV Incremental Revenue",null,null,null,4939.1481250228608]
[null,null,"   PV OM&A Costs",null,null,null,-646.18675261741748]
[null,null,"   PV Ontario Capital Tax and Municipal Tax",null,null,null,-329.33823987002938]
[null,null,"   PV Income Taxes",null,null,null,-1749.944996375594]
[null,null,"   PV CCA Tax Shield",null,null,null,661.03542497740386]
[null,null,"   PV Capital - Upfront",null,null,-9078.4755654556775]
[null,null,"  Add: PV Capital Contribution",null,null,6205.3626134131946,-2873.1129520424829]
[null,null,"   PV Capital - On-going",null,null,null,0]
[null,null,"   PV Proceeds on disposal of assets",null,null,null,0]
[null,null,"   PV Working Capital",null,null,null,-1.6006090947398783]
[null,null,"   PV Surplus / (Shortfall)",null,null,null,4.425348976155874E-13]
[]
[null,null,null,null," Profitability Index* ",null,1.0000000000000002]

{"sheet":"True-up Report","index":8,"n_rows":60,"n_cols":11,"rows_kept":60,"cut":false,"hidden":false,"merged":[[1,1,1,10],[2,1,2,10],[60,1,60,10],[61,1,61,10],[62,1,62,10],[9,2,9,4],[9,6,9,8],[10,2,10,4],[10,6,10,8],[4,2,4,3],[6,2,6,3]]}
[]
[null,"COMPARISON OF CONTRIBUTION CALCULATIONS"]
[null,{"$f":"'Project Inputs'!B17&\" Pool\"","v":"Transformation Pool"}]
[]
[null,{"$f":"'Standard Report'!E3","v":"Project #"},{"$f":"'Standard Report'!F3","v":0}]
[]
[null,{"$f":"'Standard Report'!E8","v":"Facility Name:"},{"$f":"'Standard Report'!G8","v":"Holland TS"}]
[]
[]
[null,null,{"$f":"'Project Inputs'!B28","v":"1st true-up"},null,null,null,"1st true-up"]
[null,null,"Actual (20xx-20xx) / Forecast (20xx-20xx)",null,null,null,"Actual (20xx-20xx) / Forecast (20xx-20xx)",null,null,null,"Change"]
[null,null,"Load","Adjustments","Total",null,"Load","Adjustments","Total",null,"Total"]
[null,"Year","MW","MW","MW",null,"MW","MW","MW",null,"MW"]
[null,{"$f":"'Capital Cont Inputs'!C15","v":2010},{"$f":"'NPV Calc'!$F$10","v":0},{"$f":"'NPV Calc'!$F$11","v":0},{"$f":"C14+D14","v":0},null,null,null,{"$f":"G14+H14","v":0},null,{"$f":"E14-I14","v":0}]
[null,{"$f":"'Capital Cont Inputs'!D15","v":2011},{"$f":"'NPV Calc'!$G$10","v":2.230416666666649},{"$f":"'NPV Calc'!$G$11","v":0},{"$f":"C15+D15","v":2.230416666666649},null,null,null,{"$f":"G15+H15","v":0},null,{"$f":"E15-I15","v":2.230416666666649}]
[null,{"$f":"'Capital Cont Inputs'!E15","v":2012},{"$f":"'NPV Calc'!$H$10","v":0},{"$f":"'NPV Calc'!$H$11","v":0},0,null,null,null,0,null,0]
[null,{"$f":"'Capital Cont Inputs'!F15","v":2013},{"$f":"'NPV Calc'!$I$10","v":0},{"$f":"'NPV Calc'!$I$11","v":0},0,null,null,null,0,null,0]
[null,{"$f":"'Capital Cont Inputs'!G15","v":2014},{"$f":"'NPV Calc'!$J$10","v":5.1048333333333247},{"$f":"'NPV Calc'!$J$11","v":0},5.1048333333333247,null,null,null,0,null,5.1048333333333247]
[null,{"$f":"'Capital Cont Inputs'!H15","v":2015},{"$f":"'NPV Calc'!$K$10","v":14.174999999999997},{"$f":"'NPV Calc'!$K$11","v":0},14.174999999999997,null,null,null,0,null,14.174999999999997]
[null,{"$f":"'Capital Cont Inputs'!I15","v":2016},{"$f":"'NPV Calc'!$L$10","v":16.766999999999996},{"$f":"'NPV Calc'!$L$11","v":0},16.766999999999996,null,null,null,0,null,16.766999999999996]
[null,{"$f":"'Capital Cont Inputs'!J15","v":2017},{"$f":"'NPV Calc'!$M$10","v":19.359000000000009},{"$f":"'NPV Calc'!$M$11","v":0},19.359000000000009,null,null,null,0,null,19.359000000000009]
[null,{"$f":"'Capital Cont Inputs'!K15","v":2018},{"$f":"'NPV Calc'!$N$10","v":21.950999999999993},{"$f":"'NPV Calc'!$N$11","v":0},21.950999999999993,null,null,null,0,null,21.950999999999993]
[null,{"$f":"'Capital Cont Inputs'!L15","v":2019},{"$f":"'NPV Calc'!$O$10","v":24.705000000000013},{"$f":"'NPV Calc'!$O$11","v":0},24.705000000000013,null,null,null,0,null,24.705000000000013]
[null,{"$f":"'Capital Cont Inputs'!M15","v":2020},{"$f":"'NPV Calc'!$P$10","v":27.459000000000003},{"$f":"'NPV Calc'!$P$11","v":0},27.459000000000003,null,null,null,0,null,27.459000000000003]
[null,{"$f":"'Capital Cont Inputs'!N15","v":2021},{"$f":"'NPV Calc'!$Q$10","v":28.188000000000017},{"$f":"'NPV Calc'!$Q$11","v":0},28.188000000000017,null,null,null,0,null,28.188000000000017]
[null,{"$f":"'Capital Cont Inputs'!O15","v":2022},{"$f":"'NPV Calc'!$R$10","v":28.836000000000013},{"$f":"'NPV Calc'!$R$11","v":0},28.836000000000013,null,null,null,0,null,28.836000000000013]
[null,{"$f":"'Capital Cont Inputs'!P15","v":2023},{"$f":"'NPV Calc'!$S$10","v":29.564999999999998},{"$f":"'NPV Calc'!$S$11","v":0},29.564999999999998,null,null,null,0,null,29.564999999999998]
[null,{"$f":"'Capital Cont Inputs'!Q15","v":2024},{"$f":"'NPV Calc'!$T$10","v":30.294000000000011},{"$f":"'NPV Calc'!$T$11","v":0},30.294000000000011,null,null,null,0,null,30.294000000000011]
[null,{"$f":"'Capital Cont Inputs'!R15","v":2025},{"$f":"'NPV Calc'!$U$10","v":31.023000000000025},{"$f":"'NPV Calc'!$U$11","v":0},31.023000000000025,null,null,null,0,null,31.023000000000025]
[null,{"$f":"'Capital Cont Inputs'!S15","v":2026},{"$f":"'NPV Calc'!$V$10","v":31.751999999999981},{"$f":"'NPV Calc'!$V$11","v":0},31.751999999999981,null,null,null,0,null,31.751999999999981]
[null,{"$f":"'Capital Cont Inputs'!T15","v":2027},{"$f":"'NPV Calc'!$W$10","v":32.480999999999995},{"$f":"'NPV Calc'!$W$11","v":0},32.480999999999995,null,null,null,0,null,32.480999999999995]
[null,{"$f":"'Capital Cont Inputs'!U15","v":2028},{"$f":"'NPV Calc'!$X$10","v":33.210000000000008},{"$f":"'NPV Calc'!$X$11","v":0},33.210000000000008,null,null,null,0,null,33.210000000000008]
[null,{"$f":"'Capital Cont Inputs'!V15","v":2029},{"$f":"'NPV Calc'!$Y$10","v":33.939000000000021},{"$f":"'NPV Calc'!$Y$11","v":0},33.939000000000021,null,null,null,0,null,33.939000000000021]
[null,{"$f":"'Capital Cont Inputs'!W15","v":2030},{"$f":"'NPV Calc'!$Z$10","v":34.668000000000006},{"$f":"'NPV Calc'!$Z$11","v":0},34.668000000000006,null,null,null,0,null,34.668000000000006]
[null,{"$f":"'Capital Cont Inputs'!X15","v":2031},{"$f":"'NPV Calc'!$AA$10","v":35.396999999999991},{"$f":"'NPV Calc'!$AA$11","v":0},35.396999999999991,null,null,null,0,null,35.396999999999991]
[null,{"$f":"'Capital Cont Inputs'!Y15","v":2032},{"$f":"'NPV Calc'!$AB$10","v":36.126000000000005},{"$f":"'NPV Calc'!$AB$11","v":0},36.126000000000005,null,null,null,0,null,36.126000000000005]
[null,{"$f":"'Capital Cont Inputs'!Z15","v":2033},{"$f":"'NPV Calc'!$AC$10","v":36.855000000000018},{"$f":"'NPV Calc'!$AC$11","v":0},36.855000000000018,null,null,null,0,null,36.855000000000018]
[null,{"$f":"'Capital Cont Inputs'!AA15","v":2034},{"$f":"'NPV Calc'!$AD$10","v":37.664999999999992},{"$f":"'NPV Calc'!$AD$11","v":0},37.664999999999992,null,null,null,0,null,37.664999999999992]
[null,"Total",{"$f":"SUM(C14:C38)","v":591.75025000000005},{"$f":"SUM(D14:D38)","v":0},591.75025000000005,null,{"$f":"SUM(G14:G38)","v":0},{"$f":"SUM(H14:H38)","v":0},{"$f":"SUM(I14:I38)","v":0},null,{"$f":"E39-I39","v":591.75025000000005}]
[]
[null,"Tariff Rate Applied  ($/kW/Month)",null,null,{"$f":"'NPV Calc'!$F$14","v":1.61},null,null,null,{"$f":"'NPV Calc'!$F$14","v":1.61},null,{"$f":"'NPV Calc'!$F$14","v":1.61}]
[]
[null,"Total Revenue ($k)",null,null,{"$f":"E39*E41*12","v":11432.614830000002},null,null,null,{"$f":"I39*I41*12","v":0},null,{"$f":"K39*K41*12","v":11432.614830000002}]
[]
[null,"Discounted Cash Flow Summary:"]
[null,null,null,null,"$k",null,null,null,"$k",null,"$k"]
[null,"PV Incremental Revenue",null,null,{"$f":"'Standard Report'!J73","v":4939.1481250228608},null,null,null,null,null,{"$f":"IF(E47-I47=0,\"\",E47-I47)","v":4939.1481250228608}]
[null,"PV OM&A Costs",null,null,{"$f":"'Standard Report'!J74","v":-646.18675261741748},null,null,null,null,null,{"$f":"IF(E48-I48=0,\"\",E48-I48)","v":-646.18675261741748}]
[null,"PV Municipal Tax",null,null,{"$f":"'Standard Report'!J75","v":-329.33823987002938},null,null,null,null,null,-329.33823987002938]
[null,"PV Income Taxes",null,null,{"$f":"'Standard Report'!J76","v":-1749.944996375594},null,null,null,null,null,-1749.944996375594]
[null,"PV CCA Tax Shield",null,null,{"$f":"'Standard Report'!J77","v":661.03542497740386},null,null,null,null,null,661.03542497740386]
[null,"PV Capital - Upfront",null,null,{"$f":"'Standard Report'!I78","v":-9078.4755654556775},null,null,null,null,null,-9078.4755654556775]
[null,"PV Capital Contribution1",null,null,{"$f":"'Standard Report'!I79","v":6205.3626134131946},null,null,null,null,null,6205.3626134131946]
[null,"PV Capital - On-going",null,null,{"$f":"'Standard Report'!J80","v":0},null,null,null,null,null,""]
[null,"PV Proceeds on disposal of assets",null,null,{"$f":"'Standard Report'!J81","v":0},null,null,null,null,null,""]
[null,"PV Working Capital",null,null,{"$f":"'Standard Report'!J82","v":-1.6006090947398783},null,null,null,null,null,-1.6006090947398783]
[null,"PV Surplus / (Shortfall)",null,null,{"$f":"SUM(E47:E56)","v":4.425348976155874E-13},null,null,null,{"$f":"SUM(I47:I56)","v":0},null,{"$f":"SUM(K47:K56)","v":4.425348976155874E-13}]
[]
[]
[null,"Notes:"]

{"sheet":"Menus","index":9,"n_rows":50,"n_cols":5,"rows_kept":50,"cut":false,"hidden":false,"merged":[[1,3,1,4]]}
[]
[null,"Tab","Cell Name","Contents"]
[null,"Project Inputs",{"$f":"'Project Inputs'!A28","v":"Current stage of economic evaluation:"},{"$f":"'Standard Inputs'!E54","v":"Estimated cost"}]
[null,null,null,{"$f":"'Standard Inputs'!E55","v":"Actual cost"}]
[null,null,null,{"$f":"'Standard Inputs'!E56","v":"1st true-up"}]
[null,null,null,{"$f":"'Standard Inputs'!E57","v":"2nd true-up"}]
[null,null,null,{"$f":"'Standard Inputs'!E58","v":"3rd true-up"}]
[null,null,null,{"$f":"'Standard Inputs'!E59","v":"4th true-up"}]
[null,null,null,{"$f":"'Standard Inputs'!E60","v":"5th true-up"}]
[]
[null,null,null,null,"Evaluation period (years):"]
[null,"Project Inputs",{"$f":"'Project Inputs'!A19","v":"Customer Risk Classification"},"High",5]
[null,null,null,"Medium-high",10]
[null,null,null,"Medium-low",15]
[null,null,null,"Low",25]
[]
[]
[null,"Project Inputs",{"$f":"'Project Inputs'!A17","v":"Type of Project:"},"Transformation"]
[null,null,null,"Network"]
[null,null,null,"Line"]
[]
[]
[null,"Project Inputs","Asset Types:","Line - Overhead"]
[null,null,null,"Line - Underground"]
[null,null,null,"Network - SS"]
[null,null,null,"Network - TS"]
[null,null,null,"Station - DESN"]
[null,null,null,"Station - single"]
[null,null,null,"N/A"]
[]
[]
[null,"Project Inputs","Multiple uses","Yes"]
[null,"Prelim Calc",null,"No"]
[null,"NPV Calc"]
[]
[]
[null,"Project Inputs",{"$f":"'Project Inputs'!A75","v":"Is this load based on calendar or project year?"},"Project Year"]
[null,null,null,"Calendar Year"]
[]
[]
[null,"Standard Inputs","HST/GST?","HST"]
[null,null,null,"GST"]
[]
[]
[null,"Capital Contributions & Municipal","Net/Gross?","Net"]
[null,"Taxes",null,"Gross"]
[]
[]
[null,"Capital Cont Inputs",null,"IEE/True-up"]
[null,null,null,"Revenue Guarantee"]