{"text_format":"1","workbook":"xlsx","n_sheets":10,"sheets":["Overview","Project Inputs","Capital Cont Inputs","Standard Inputs","Prelim Calc","NPV Calc","Standard Report","Report After Cont $k","True-up Report","Menus"],"not_rendered":{"charts":0,"images":1,"macros":1,"external_links":1,"defined_names":65,"comments":0,"pivot_tables":0},"unopened":[],"bounds":{"document_bytes":16777216,"sheet_cells":100000,"rows_first":2000,"rows_last":500,"rows_between":2000,"halvings":0,"cell_chars":16384,"cell_head_chars":4096},"cells_cut":0,"cells_raw":0,"read":"whole","date_system":"1900"}

{"sheet":"Overview","index":0,"n_rows":5,"n_cols":2,"rows_kept":5,"cut":false,"hidden":false,"merged":[[5,1,5,3]]}
[]
[]
[null,"Hydro One Transmission Contribution Model"]
[null,"Holland TS 5 Year True Up - Transformation"]
[null,"NewMarket Hydro"]

{"sheet":"Project Inputs","index":1,"n_rows":82,"n_cols":27,"rows_kept":82,"cut":false,"hidden":false,"merged":[[37,2,37,11],[48,2,48,11],[54,2,54,11],[60,2,60,11],[4,1,4,3],[27,2,27,11],[8,1,8,6],[22,1,22,6],[20,2,20,9],[10,1,10,6],[12,1,12,6]]}
["A: PROJECT INFORMATION"]
[]
["To reset all user inputs, please click here:"]
[]
["Analysis prepared by:","Hydro One"]
[]
["Plan Number:"]
[]
["Project name:",{"$f":"'[1]Input - Proj Info'!$I$13","v":"Holland TS"}]
[]
{"$rows_left_out":73}
{"sheet":"Capital Cont Inputs","index":2,"n_rows":59,"n_cols":54,"rows_kept":59,"cut":false,"hidden":false,"merged":[[31,0,31,2],[15,28,15,53],[11,1,11,10],[12,1,12,10],[51,3,51,8]]}
["SUMMARY OF CAPITAL CONTRIBUTIONS & ECONOMIC EVALUATION PERIOD"]
[]
["Summary of Key Dates:"]
["In-service year",{"$f":"YEAR('Project Inputs'!B15)","v":2009}]
["Duration of Economic Evaluation",{"$f":"IF(ISNUMBER('Project Inputs'!B21),'Project Inputs'!B21,'Project Inputs'!E19)","v":25},{"$f":"\"Based on \"&'Project Inputs'!B19&\" \"&'Project Inputs'!A19&IF(ISNUMBER('Project Inputs'!B21),\" with alternate evaluation period of \"&'Project Inputs'!B21&\" years.\",\".\")","v":"Based on Low Customer Risk Classification."}]
[]
[null,"Year","Stage"]
["Current Stage Data",{"$f":"VLOOKUP('Project Inputs'!B19&\" - \"&'Project Inputs'!B28,'Standard Inputs'!$A$52:$F$84,MATCH('Standard Inputs'!$F$52,'Standard Inputs'!$A$52:$F$52,0),0)","v":2014},{"$f":"'Project Inputs'!B28","v":"1st true-up"}]
[]
["End of Economic Evaluation",{"$f":"B4+B5","v":2034}]
{"$rows_left_out":50}
{"sheet":"Standard Inputs","index":3,"n_rows":84,"n_cols":7,"rows_kept":84,"cut":false,"hidden":false,"merged":[[83,6,83,14],[75,6,75,14],[79,6,79,14],[80,6,80,14],[81,6,81,14],[82,6,82,14],[67,6,67,14],[71,6,71,14],[72,6,72,14],[73,6,73,14],[74,6,74,14],[59,6,59,14],[63,6,63,14],[64,6,64,14],[65,6,65,14],[66,6,66,14],[47,1,47,4],[53,6,53,14],[54,6,54,14],[55,6,55,14],[56,6,56,14],[30,5,30,10],[31,5,31,10],[32,5,32,10],[57,6,57,14],[58,6,58,14]]}
[]
[]
[]
["REVENUE INPUTS:"]
["Pool","Tariffs ($/kW/Month)"]
["Line",0.59]
["Network",2.31]
["Transformation",1.61]
[]
["DISCOUNT RATE INPUTS:"]
{"$rows_left_out":75}
{"sheet":"Prelim Calc","index":4,"n_rows":83,"n_cols":30,"rows_kept":83,"cut":false,"hidden":false,"merged":[[86,6,86,7]]}
[]
[null,null,"Summary of Up-front Costs Before Contributions"]
[null,null,null,null,{"$f":"'Capital Cont Inputs'!B15","v":2009}]
[]
[null,null,"Up-front capital excluding AFUDC & Overhead - $k",null,{"$f":"'Project Inputs'!B34+'Project Inputs'!B38+'Project Inputs'!B49+'Project Inputs'!B55+'Project Inputs'!B61","v":9078.4755654556775}]
[null,null,"Overhead - $k",null,{"$f":"'Project Inputs'!B39+'Project Inputs'!B50+'Project Inputs'!B56+'Project Inputs'!B62","v":0}]
[null,null,"AFUDC - $k",null,{"$f":"'Project Inputs'!B40+'Project Inputs'!B51+'Project Inputs'!B57+'Project Inputs'!B63","v":0}]
[null,null,"Total up-front capital before capital contributions - $k",null,{"$f":"SUM(E5:E7)","v":9078.4755654556775}]
[]
[null,null,"Up-front removal costs - $k",null,{"$f":"SUM('Project Inputs'!B44:B45)","v":0}]
{"$rows_left_out":74}
{"sheet":"NPV Calc","index":5,"n_rows":181,"n_cols":30,"rows_kept":181,"cut":false,"hidden":false,"merged":[]}
[]
[null,"Capital Contribution flag (select Yes to include in calculation of NPV):","No"]
[]
[null,null,null,"Project Year:",{"$f":"'Capital Cont Inputs'!B16","v":0},{"$f":"'Capital Cont Inputs'!C16","v":1},{"$f":"'Capital Cont Inputs'!D16","v":2},{"$f":"'Capital Cont Inputs'!E16","v":3},{"$f":"'Capital Cont Inputs'!F16","v":4},{"$f":"'Capital Cont Inputs'!G16","v":5},{"$f":"'Capital Cont Inputs'!H16","v":6},{"$f":"'Capital Cont Inputs'!I16","v":7},{"$f":"'Capital Cont Inputs'!J16","v":8},{"$f":"'Capital Cont Inputs'!K16","v":9},{"$f":"'Capital Cont Inputs'!L16","v":10},{"$f":"'Capital Cont Inputs'!M16","v":11},{"$f":"'Capital Cont Inputs'!N16","v":12},{"$f":"'Capital Cont Inputs'!O16","v":13},{"$f":"'Capital Cont Inputs'!P16","v":14},{"$f":"'Capital Cont Inputs'!Q16","v":15},{"$f":"'Capital Cont Inputs'!R16","v":16},{"$f":"'Capital Cont Inputs'!S16","v":17},{"$f":"'Capital Cont Inputs'!T16","v":18},{"$f":"'Capital Cont Inputs'!U16","v":19},{"$f":"'Capital Cont Inputs'!V16","v":20},{"$f":"'Capital Cont Inputs'!W16","v":21},{"$f":"'Capital Cont Inputs'!X16","v":22},{"$f":"'Capital Cont Inputs'!Y16","v":23},{"$f":"'Capital Cont Inputs'!Z16","v":24},{"$f":"'Capital Cont Inputs'!AA16","v":25}]
[null,null,null,"Year Ended:",{"$f":"'Capital Cont Inputs'!B15","v":2009},{"$f":"'Capital Cont Inputs'!C15","v":2010},{"$f":"'Capital Cont Inputs'!D15","v":2011},{"$f":"'Capital Cont Inputs'!E15","v":2012},{"$f":"'Capital Cont Inputs'!F15","v":2013},{"$f":"'Capital Cont Inputs'!G15","v":2014},{"$f":"'Capital Cont Inputs'!H15","v":2015},{"$f":"'Capital Cont Inputs'!I15","v":2016},{"$f":"'Capital Cont Inputs'!J15","v":2017},{"$f":"'Capital Cont Inputs'!K15","v":2018},{"$f":"'Capital Cont Inputs'!L15","v":2019},{"$f":"'Capital Cont Inputs'!M15","v":2020},{"$f":"'Capital Cont Inputs'!N15","v":2021},{"$f":"'Capital Cont Inputs'!O15","v":2022},{"$f":"'Capital Cont Inputs'!P15","v":2023},{"$f":"'Capital Cont Inputs'!Q15","v":2024},{"$f":"'Capital Cont Inputs'!R15","v":2025},{"$f":"'Capital Cont Inputs'!S15","v":2026},{"$f":"'Capital Cont Inputs'!T15","v":2027},{"$f":"'Capital Cont Inputs'!U15","v":2028},{"$f":"'Capital Cont Inputs'!V15","v":2029},{"$f":"'Capital Cont Inputs'!W15","v":2030},{"$f":"'Capital Cont Inputs'!X15","v":2031},{"$f":"'Capital Cont Inputs'!Y15","v":2032},{"$f":"'Capital Cont Inputs'!Z15","v":2033},{"$f":"'Capital Cont Inputs'!AA15","v":2034}]
[]
["Discount","Calculation of Net Present Value:","Undiscounted","Cum. NPV at "]
["Method",null,"Cash Flow","IS Date"]
[null,"Incremental revenues:"]
[null,{"$f":"CONCATENATE('Project Inputs'!B28,\" - \",\"Load Forecast (MW)\")","v":"1st true-up - Load Forecast (MW)"},null,null,null,{"$f":"'Prelim Calc'!F81","v":0},{"$f":"'Prelim Calc'!G81","v":2.230416666666649},{"$f":"'Prelim Calc'!H81","v":0},{"$f":"'Prelim Calc'!I81","v":0},{"$f":"'Prelim Calc'!J81","v":5.1048333333333247},{"$f":"'Prelim Calc'!K81","v":14.174999999999997},{"$f":"'Prelim Calc'!L81","v":16.766999999999996},{"$f":"'Prelim Calc'!M81","v":19.359000000000009},{"$f":"'Prelim Calc'!N81","v":21.950999999999993},{"$f":"'Prelim Calc'!O81","v":24.705000000000013},{"$f":"'Prelim Calc'!P81","v":27.459000000000003},{"$f":"'Prelim Calc'!Q81","v":28.188000000000017},{"$f":"'Prelim Calc'!R81","v":28.836000000000013},{"$f":"'Prelim Calc'!S81","v":29.564999999999998},{"$f":"'Prelim Calc'!T81","v":30.294000000000011},{"$f":"'Prelim Calc'!U81","v":31.023000000000025},{"$f":"'Prelim Calc'!V81","v":31.751999999999981},{"$f":"'Prelim Calc'!W81","v":32.480999999999995},{"$f":"'Prelim Calc'!X81","v":33.210000000000008},{"$f":"'Prelim Calc'!Y81","v":33.939000000000021},{"$f":"'Prelim Calc'!Z81","v":34.668000000000006},{"$f":"'Prelim Calc'!AA81","v":35.396999999999991},{"$f":"'Prelim Calc'!AB81","v":36.126000000000005},{"$f":"'Prelim Calc'!AC81","v":36.855000000000018},{"$f":"'Prelim Calc'!AD81","v":37.664999999999992}]
{"$rows_left_out":172}
{"sheet":"Standard Report","index":6,"n_rows":98,"n_cols":34,"rows_kept":98,"cut":false,"hidden":false,"merged":[[90,31,90,32],[61,2,61,12],[62,2,62,12],[1,8,1,20],[4,9,4,19],[5,9,5,19],[2,8,2,20]]}
["`"]
[null,null,null,null,"Date:","2015-09-02",null,null,{"$f":"IF('Capital Cont Inputs'!B52=\"Revenue Guarantee\",\"SUMMARY OF REVENUE GUARANTEE\",\"SUMMARY OF CONTRIBUTION CALCULATIONS\")","v":"SUMMARY OF CONTRIBUTION CALCULATIONS"}]
[null,null,null,null,"Project #",{"$f":"'Project Inputs'!B7","v":0},null,null,{"$f":"'Project Inputs'!B17&\" Pool\"&\" - \"&'Project Inputs'!B28","v":"Transformation Pool - 1st true-up"}]
[]
[null,null,null,null,null,null,null,null,null,{"$f":"IF(AND('Capital Cont Inputs'!B31=\"Yes\",'Capital Cont Inputs'!B52=\"Revenue Guarantee\"),\"Warning - the revenue guarantee has not been calculated, therefore the revenue guarantee report is not available for review.\",IF(AND('Capital Cont Inputs'!B45=\"Revenue Guarantee\",'Capital Cont Inputs'!B52=\"Revenue Guarantee\",ROUND(NPVStandardReport,6)<>0),\"WARNING - the NPV has changed since the last run of the Revenue Guarantee. Please re-run before reporting.\",IF(AND('Capital Cont Inputs'!B45=\"Revenue Guarantee\",'Capital Cont Inputs'!B52=\"IEE/True-up\",NPVStandardReport<>NPVBeforeCC),\"Warning - the NPV has changed since the last run of the Revenue Guarantee. Please re-run before reporting.\",IF(AND((ROUND('NPV Calc'!D53,6)<>ROUND('Standard Report'!F96,6)),'Capital Cont Inputs'!B31=\"Yes\"),\"WARNING - the NPV has changed since the last run of the IEE calculation. Please re-run before reporting.\",\"\"))))","v":""}]
[null,null,null,null,null,null,null,null,null,{"$f":"IF('NPV Calc'!C2=\"Yes\",\"WARNING - The detailed report is set to include capital contributions. Therefore, the report is not correct.\",\"\")","v":""}]
[]
[null,null,null,null,"Facility Name:",null,{"$f":"'Project Inputs'!B9","v":"Holland TS"}]
[null,null,null,null,"Description:",null,{"$f":"'Project Inputs'!B11","v":"Capital Contribution, Transformation Pool, Newmarket Hydro"}]
[null,null,null,null,"Customer:",null,{"$f":"Customer","v":"Newmarket Hydro"}]
{"$rows_left_out":89}
{"sheet":"Report After Cont $k","index":7,"n_rows":85,"n_cols":40,"rows_kept":85,"cut":false,"hidden":false,"merged":[[61,2,61,7],[62,2,62,7],[1,9,1,20],[2,9,2,20]]}
["`"]
[null,null,null,null,{"$f":"'Standard Report'!E2","v":"Date:"},{"$f":"'Standard Report'!F2","v":"2015-09-02"},null,null,null,{"$f":"IF(OR('Capital Cont Inputs'!B45=\"Revenue Guarantee\",'Capital Cont Inputs'!B39=\"Yes\"),\"THE REVENUE GUARANTEE CALCULATION IS SET TO BE OR HAS BEEN USED. THIS REPORT IS NOT CORRECT.\",\"SUMMARY OF CONTRIBUTION CALCULATIONS\")","v":"SUMMARY OF CONTRIBUTION CALCULATIONS"}]
[null,null,null,null,{"$f":"'Standard Report'!E3","v":"Project #"},{"$f":"'Standard Report'!F3","v":0},null,null,null,{"$f":"'Standard Report'!I3","v":"Transformation Pool - 1st true-up"}]
[]
[]
[]
[]
[null,null,null,null,{"$f":"'Standard Report'!E8","v":"Facility Name:"},null,{"$f":"'Standard Report'!G8","v":"Holland TS"}]
[null,null,null,null,{"$f":"'Standard Report'!E9","v":"Description:"},null,{"$f":"'Standard Report'!G9","v":"Capital Contribution, Transformation Pool, Newmarket Hydro"}]
[null,null,null,null,{"$f":"'Standard Report'!E10","v":"Customer:"},null,{"$f":"'Standard Report'!G10","v":"Newmarket Hydro"}]
{"$rows_left_out":76}
{"sheet":"True-up Report","index":8,"n_rows":60,"n_cols":11,"rows_kept":60,"cut":false,"hidden":false,"merged":[[1,1,1,10],[2,1,2,10],[60,1,60,10],[61,1,61,10],[62,1,62,10],[9,2,9,4],[9,6,9,8],[10,2,10,4],[10,6,10,8],[4,2,4,3],[6,2,6,3]]}
[]
[null,"COMPARISON OF CONTRIBUTION CALCULATIONS"]
[null,{"$f":"'Project Inputs'!B17&\" Pool\"","v":"Transformation Pool"}]
[]
[null,{"$f":"'Standard Report'!E3","v":"Project #"},{"$f":"'Standard Report'!F3","v":0}]
[]
[null,{"$f":"'Standard Report'!E8","v":"Facility Name:"},{"$f":"'Standard Report'!G8","v":"Holland TS"}]
[]
[]
[null,null,{"$f":"'Project Inputs'!B28","v":"1st true-up"},null,null,null,"1st true-up"]
{"$rows_left_out":51}
{"sheet":"Menus","index":9,"n_rows":50,"n_cols":5,"rows_kept":50,"cut":false,"hidden":false,"merged":[[1,3,1,4]]}
[]
[null,"Tab","Cell Name","Contents"]
[null,"Project Inputs",{"$f":"'Project Inputs'!A28","v":"Current stage of economic evaluation:"},{"$f":"'Standard Inputs'!E54","v":"Estimated cost"}]
[null,null,null,{"$f":"'Standard Inputs'!E55","v":"Actual cost"}]
[null,null,null,{"$f":"'Standard Inputs'!E56","v":"1st true-up"}]
[null,null,null,{"$f":"'Standard Inputs'!E57","v":"2nd true-up"}]
[null,null,null,{"$f":"'Standard Inputs'!E58","v":"3rd true-up"}]
[null,null,null,{"$f":"'Standard Inputs'!E59","v":"4th true-up"}]
[null,null,null,{"$f":"'Standard Inputs'!E60","v":"5th true-up"}]
[]
{"$rows_left_out":40}