{"text_format":"1","workbook":"xlsx","n_sheets":14,"sheets":["lists","tempcopy","1. Information Sheet","2. Rate Class Selection","3. Growth Factor - NUM_CALC1","4. Growth Factor - NUM_CALC2","5. Rev_Requ_Check","6. Growth Factor - DEN_CALC","7. Revenue Proportions","8. Threshold Test","9a. Proposed ACM Projects","9b. Proposed ACM ICM Projects","10. Incremental Capital Adj.","11. Rate Rider Calc"],"not_rendered":{"charts":0,"images":2,"macros":1,"external_links":0,"defined_names":39,"comments":0,"pivot_tables":0},"unopened":[],"bounds":{"document_bytes":16777216,"sheet_cells":100000,"rows_first":2000,"rows_last":500,"rows_between":2000,"halvings":0,"cell_chars":16384,"cell_head_chars":4096},"cells_cut":0,"cells_raw":0,"read":"whole","date_system":"1900"}

{"sheet":"lists","index":0,"n_rows":214,"n_cols":55,"rows_kept":214,"cut":false,"hidden":true,"merged":[[5,51,5,52],[0,51,0,52],[1,51,1,52],[2,51,2,52],[3,51,3,52],[4,51,4,52],[17,51,17,52],[6,51,6,52],[7,51,7,52],[8,51,8,52],[9,51,9,52],[10,51,10,52],[11,51,11,52],[12,51,12,52],[13,51,13,52],[14,51,14,52],[15,51,15,52],[16,51,16,52]]}
[null,"Embedded Distributor",{"$f":"COUNTA(B1:B17)","v":4},null,null,null,null,null,"A Standby Service Charge will be applied for a month where standby power is not provided. The applicable rate is the approved Distribution Volumetric Rate of the applicable service class and is applied to gross metered demand or contracted amount, whichever is greater. A monthly administration charge of $200, for simple metering arrangements, or $500, for complex metering arrangements, will also be applied.",null,null,"Loss Factors",null,"Units","Units1","Units2",null,null,null,null,null,null,null,null,null,"Account History","Account set up charge/change of occupancy charge (plus credit agency costs if applicable)","Total Loss Factor – Embedded Distributor – Hydro One Networks Inc.",null,null,null,null,null,null,null,null,null,"Alectra Utilities Corporation-Brampton Rate Zone",null,null,"DISTRIBUTED GENERATION [DGEN]","kW",null,null,null,"Sub-Total:  Delivery (Distribution and Retail Transmission)"]
["RESIDENTIAL R1","General Service 3,000 to 4,999 kW",null,null,null,null,null,null,"Distribution Volumetric Rate",null,null,"Total Loss Factor – Primary Metered Customer",null,"$","$/kWh","$",null,null,null,null,null,null,null,null,null,"Account set up charge/change of occupancy charge","Administrative Billing Charge","Total Loss Factor – Primary Metered Customer",null,null,null,null,null,null,null,null,null,"Alectra Utilities Corporation-Enersource Rate Zone",null,null,"EMBEDDED DISTRIBUTOR","kW",null,null,null,"Wholesale Market Service Rate ",null,null,{"$f":"AU2*AV2","v":0},{"$f":"AU2","v":0},0,{"$f":"AX2*AY2","v":0},null,{"$f":"AZ2-AW2","v":0},{"$f":"BB2/AW2","v":{"$error":"#DIV/0!"}}]
["RESIDENTIAL R2","General Service 1,000 to 4,999 kW",null,null,null,null,null,null,"Distribution Volumetric Rate - $/kW of contracted amount",null,null,"Total Loss Factor – Primary Metered Customer < 5,000 kW",null,"$/kWh","$/kW","%",null,null,null,null,null,null,"MSC",null,null,"Account set up charge/change of occupancy charge (plus credit agency costs if applicable – Residential)","Bell Canada Pole Rentals","Total Loss Factor – Primary Metered Customer < 5,000 kW",null,null,null,null,null,null,null,null,null,"Alectra Utilities Corporation-Horizon Utilities Rate Zone",null,null,"EMBEDDED DISTRIBUTOR","kW",null,null,null,"Rural or Remote Electricity Rate Protection Charge (RRRP)",null,null,{"$f":"AU3*AV3","v":0},0,0,{"$f":"AX3*AY3","v":0},null,{"$f":"AZ3-AW3","v":0},{"$f":"BB3/AW3","v":{"$error":"#DIV/0!"}}]
["SEASONAL CUSTOMERS","General Service Equal To Or Greater Than 1,500 kW - Interval Metered",null,null,null,null,null,null,"Distribution Wheeling Service Rate",null,null,"Total Loss Factor – Primary Metered Customer > 5,000 kW",null,"$/kW","$/kVA",null,null,null,null,null,null,null,"SM_Rate_Adder",null,null,"Account set up charge/change of occupancy charge (plus credit agency costs if applicable)","Clearance Pole Attachment charge $/pole/year","Total Loss Factor – Primary Metered Customer > 5,000 kW",null,null,null,null,null,null,null,null,null,"Alectra Utilities Corporation-PowerStream Rate Zone",null,null,"FARMS - SINGLE PHASE ENERGY-BILLED [F1]","kWh",null,null,null,"Standard Supply Service – Administration Charge (if applicable)",null,null,{"$f":"AU4*AV4","v":0},0,0,{"$f":"AX4*AY4","v":0},null,{"$f":"AZ4-AW4","v":0},{"$f":"BB4/AW4","v":{"$error":"#DIV/0!"}}]
["STREET LIGHTING",null,null,null,null,null,null,null,"Electricity Rate",null,null,"Total Loss Factor – Secondary Metered Customer",null,"$/kVA",null,null,null,null,null,null,null,null,"MSC_Rate_Rider_",null,null,"Arrears certificate","Collection of account charge – no disconnection","Total Loss Factor – Secondary Metered Customer",null,null,null,null,null,null,null,null,null,"Alectra Utilities Corporation-Guelph Rate Zone",null,null,"FARMS - THREE PHASE ENERGY-BILLED [F3]","kWh",null,null,null,"Sub-Total:  Regulatory",null,null,{"$f":"SUM(AW2:AW4)","v":0},null,null,{"$f":"SUM(AZ2:BA4)","v":0},null,{"$f":"AZ5-AW5","v":0},{"$f":"BB5/AW5","v":{"$error":"#DIV/0!"}}]
["RESIDENTIAL",null,null,null,null,null,null,null,"Electricity Rate - All Additional kWh",null,null,"Total Loss Factor – Secondary Metered Customer < 5,000 kW",null,null,null,null,null,null,null,null,null,null,"VC",null,null,"Arrears certificate (credit reference)","Collection of account charge – no disconnection – after regular hours","Total Loss Factor – Secondary Metered Customer < 5,000 kW",null,null,null,null,null,null,null,null,null,"Algoma Power Inc.",null,null,"GENERAL SERVICE - COMMERCIAL","kW",null,null,null,"Debt Retirement Charge (DRC)",null,null,{"$f":"AU6*AV6","v":0},{"$f":"AU6","v":0},{"$f":"AV6","v":0},{"$f":"AX6*AY6","v":0},null,{"$f":"AZ6-AW6","v":0},{"$f":"BB6/AW6","v":{"$error":"#DIV/0!"}}]
["GENERAL SERVICE LESS THAN 50 kW",null,null,null,null,null,null,null,"Electricity Rate - First 250 kWh",null,null,null,null,null,null,null,null,null,null,null,null,null,null,null,null,null,null,null,null,null,null,null,null,null,null,null,null,"Atikokan Hydro Inc.",null,null,"GENERAL SERVICE - INSTITUTIONAL","kW"]
["GENERAL SERVICE 50 TO 4,999 KW",null,null,null,null,null,null,null,"Electricity Rate -All Additional kWh",null,null,"Total Loss Factor – Secondary Metered Customer > 5,000 kW",null,null,null,null,null,null,null,null,null,null,"VC_Rate_Rider_",null,null,"Charge to certify cheque","Collection of account charge – no disconnection - during regular business hours","Total Loss Factor – Secondary Metered Customer > 5,000 kW",null,null,null,null,null,null,null,null,null,"Bluewater Power Distribution Corporation",null,null,"GENERAL SERVICE 1,000 TO 2,999 KW","kW",null,null,null,"Total Bill on RPP (before taxes)",null,null,null,null,null,null,null,{"$f":"AZ8-AW8","v":0}]
["GENERAL SERVICE 50 TO 999 kW",null,null,null,null,null,null,null,"Electricity Rate First 1,000 kWh",null,null,"Distribution Loss Factor - Secondary Metered Customer < 5,000 kW",null,null,null,null,null,null,null,null,null,null,"VC_GA_Rate_Rider_kW_",null,null,"Collection of Account Charge – No Disconnection","Collection of account charge – no disconnection – during regular hours",null,null,null,null,null,null,null,null,null,null,"Brantford Power Inc.",null,null,"GENERAL SERVICE 1,000 TO 4,999 KW","kW",null,null,null,"HST",null,null,{"$f":"AV9*AW8","v":0},null,{"$f":"AV9","v":0},{"$f":"AY9*AZ8","v":0},null,{"$f":"AZ9-AW9","v":0},{"$f":"BB9/AW9","v":{"$error":"#DIV/0!"}}]
["GENERAL SERVICE 1,000 TO 4,999 kW",null,null,null,null,null,null,null,"Electricity Rate First 25,000 kWh",null,null,"Distribution Loss Factor - Secondary Metered Customer > 5,000 kW",null,null,null,null,null,null,null,null,null,null,"VC_LV_Rate",null,null,"Credit Card Convenience Charge","Collection/Disconnection/Load Limiter/Reconnection – if in Community",null,null,null,null,null,null,null,null,null,null,"Burlington Hydro Inc.",null,null,"GENERAL SERVICE 1,000 TO 4,999 KW - INTERVAL METERS","kW",null,null,null,"Total Bill (including HST)",null,null,{"$f":"AW9+AW8","v":0},null,null,{"$f":"AZ9+AZ8","v":0},null,{"$f":"AZ10-AW10","v":0},{"$f":"BB10/AW10","v":{"$error":"#DIV/0!"}}]
["LARGE USE",null,null,null,null,null,null,null,"Electricity Rate First 6,000 kWh",null,null,"Distribution Loss Factor - Primary Metered Customer < 5,000 kW",null,null,null,null,null,null,null,null,null,null,"RTSR_Network",null,null,"Credit check (plus credit agency costs)","Credit Card Convenience Charge",null,null,null,null,null,null,null,null,null,null,"Canadian Niagara Power Inc.",null,null,"GENERAL SERVICE 1,000 TO 4,999 KW (CO-GENERATION)","kW",null,null,null,"Ontario Clean Energy Benefit (OCEB)",null,null,{"$f":"-0.1*AW10","v":0},null,{"$f":"AV11","v":0},{"$f":"-0.1*AZ10","v":0},null,{"$f":"AZ11-AW11","v":0},{"$f":"BB11/AW11","v":{"$error":"#DIV/0!"}}]
["UNMETERED SCATTERED LOAD",null,null,null,null,null,null,null,"Electricity Rate Next 1,500 kWh",null,null,"Distribution Loss Factor - Primary Metered Customer > 5,000 kW",null,null,null,null,null,null,null,null,null,null,"RTSR_Connection",null,null,"Credit reference Letter","Disconnect/Reconnect at meter – after regular hours",null,null,null,null,null,null,null,null,null,null,"Centre Wellington Hydro Ltd.",null,null,"GENERAL SERVICE 1,500 TO 4,999 KW","kW",null,null,null,"Total Bill on RPP (including OCEB)",null,null,{"$f":"AW10+AW11","v":0},null,null,{"$f":"AZ10+AZ11","v":0},null,{"$f":"AZ12-AW12","v":0},{"$f":"BB12/AW12","v":{"$error":"#DIV/0!"}}]
["SENTINEL LIGHTING",null,null,null,null,null,null,null,"General Service 1,500 to 4,999 kW customer",null,null,null,null,null,null,null,null,null,null,null,null,null,null,null,null,null,null,null,null,null,null,null,null,null,null,null,null,"Chapleau Public Utilities Corporation",null,null,"GENERAL SERVICE 2,500 TO 4,999 KW","kW"]
["EMBEDDED DISTRIBUTOR",null,null,null,null,null,null,null,"General Service 50 to 1,499 kW customer",null,null,"Total Loss Factor - Embedded Distributor",null,null,null,null,null,null,null,null,null,null,"RTSR_Network_Interval",null,null,"Credit reference/credit check (plus credit agency costs – General Service)","Disconnect/Reconnect at meter – during regular hours",null,null,null,null,null,null,null,null,null,null,"Cooperative Hydro Embrun Inc.",null,null,"GENERAL SERVICE 3,000 TO 4,999 KW","kW",null,null,null,"Total Bill on TOU (before taxes)",null,null,null,null,null,null,null,{"$f":"AZ14-AW14","v":0}]
["STANDBY POWER",null,null,null,null,null,null,null,"General Service Large Use customer",null,null,"Total Loss Factor – Embedded Distributor – Hydro One Networks Inc.",null,null,null,null,null,null,null,null,null,null,"RTSR_Connection_Interval",null,null,"Credit Reference/credit check (plus credit agency costs)","Disconnect/Reconnect at pole – after regular hours",null,null,null,null,null,null,null,null,null,null,"E.L.K. Energy Inc.",null,null,"GENERAL SERVICE 3,000 TO 4,999 KW - INTERMEDIATE USE","kW",null,null,null,"HST",null,null,{"$f":"AV15*AW14","v":0},null,{"$f":"AV15","v":0},{"$f":"AY15*AZ14","v":0},null,{"$f":"AZ15-AW15","v":0},{"$f":"BB15/AW15","v":{"$error":"#DIV/0!"}}]
{"$rows_left_out":200}
{"sheet":"tempcopy","index":1,"n_rows":0,"n_cols":0,"rows_kept":0,"cut":false,"hidden":true,"merged":[]}

{"sheet":"1. Information Sheet","index":2,"n_rows":61,"n_cols":27,"rows_kept":61,"cut":false,"hidden":false,"merged":[[60,0,60,11],[33,0,33,4],[33,5,33,7],[35,0,35,4],[35,5,35,7],[37,0,37,4],[37,5,37,7],[59,0,59,11],[39,5,39,7],[41,5,41,7],[43,5,43,7],[45,5,45,7],[47,0,48,4],[47,5,47,7],[48,5,48,7],[52,2,52,11],[54,2,54,13],[56,2,56,12],[31,5,31,7],[25,0,25,4],[25,5,25,7],[27,9,27,11],[27,0,27,4],[27,5,27,7],[29,0,29,4],[29,5,29,7],[31,0,31,4],[13,5,13,11],[17,5,17,9],[19,5,19,9],[21,5,21,9],[23,5,23,9]]}
[null,null,null,null,null,null,null,null,null,null,null,null,null,null,null,null,null,null,null,null,"a",null,null,null,null,null,{"$f":"IF(OR(F16=\"\", F16=\"(if applicable)\"), F14, F14 & \" - \" & F16)","v":"Algoma Power Inc."}]
[]
[]
[]
[]
[]
[]
[]
[]
[]
[]
["Note:  Depending on the selections made below, certain worksheets in this workbook will be hidden.",null,null,null,null,null,null,null,null,null,null,null,"Version",1]
[]
[null,null,null,null,"Utility Name   ","Algoma Power Inc."]
[]
{"$rows_left_out":47}
{"sheet":"2. Rate Class Selection","index":3,"n_rows":22,"n_cols":15,"rows_kept":22,"cut":false,"hidden":false,"merged":[[20,1,20,9],[21,1,21,9],[11,0,11,13],[17,1,17,9],[12,14,16,16],[18,1,18,9],[19,1,19,9]]}
[]
[]
[]
[]
[]
[]
[]
[]
[]
[]
[]
["Select the appropriate rate classes as they appear on your most recent Board-Approved Tariff of Rates and Charges, excluding the MicroFit Class."]
[null,null,null,null,null,null,null,null,null,null,null,null,null,null,"Once all rate class classifications have been entered, please press the update button."]
["How many classes are on your most recent Board-Approved Tariff of Rates and Charges?",null,null,null,null,null,null,null,null,4]
[]
{"$rows_left_out":8}
{"sheet":"3. Growth Factor - NUM_CALC1","index":4,"n_rows":20,"n_cols":9,"rows_kept":20,"cut":false,"hidden":false,"merged":[[12,0,12,4],[14,2,14,4],[14,6,14,8]]}
[]
[]
[]
[]
[]
[]
[]
[]
[]
[]
[]
[]
[{"$f":"\"Input the billing determinants associated with \" & '1. Information Sheet'!F14 & \"'s \" & '1. Information Sheet'!F48 & \". Input the current approved distribution rates.  Sheets 4 & 5 calculate the NUMERATOR portion of the growth factor calculation.\"","v":"Input the billing determinants associated with Algoma Power Inc.'s Revenues Based on 2020 Board-Approved Distribution Demand. Input the current approved distribution rates.  Sheets 4 & 5 calculate the NUMERATOR portion of the growth factor calculation."}]
[]
[null,null,{"$f":"RIGHT('1. Information Sheet'!F48,LEN('1. Information Sheet'!F48)-18)","v":"2020 Board-Approved Distribution Demand"},null,null,null,{"$f":"IF('1. Information Sheet'!F26=\"COS\",\"Proposed Distribution Rates\",\"Current Approved Distribution Rates\")","v":"Current Approved Distribution Rates"}]
{"$rows_left_out":6}
{"sheet":"4. Growth Factor - NUM_CALC2","index":5,"n_rows":21,"n_cols":19,"rows_kept":21,"cut":false,"hidden":false,"merged":[[13,2,13,4],[13,6,13,8]]}
[]
[]
[]
[]
[]
[]
[]
[]
[]
[]
[]
[{"$f":"IF('1. Information Sheet'!F26=\"COS\", \"Calculation of \" & '1. Information Sheet'!M26 & \" Revenue Requirement.  No input required.\", \"Calculation of pro forma \" & '1. Information Sheet'!F34 & \" Revenues.  No input required.\")","v":"Calculation of pro forma 2020 Revenues.  No input required."}]
[]
[null,null,{"$f":"'3. Growth Factor - NUM_CALC1'!C15","v":"2020 Board-Approved Distribution Demand"},null,null,null,{"$f":"'3. Growth Factor - NUM_CALC1'!G15:I15","v":"Current Approved Distribution Rates"}]
["Rate Class",null,"Billed Customers or Connections","Billed kWh","Billed kW\n(if applicable)",null,"Monthly Service Charge","Distribution Volumetric Rate kWh","Distribution Volumetric Rate kW",null,"Service Charge Revenue","Distribution Volumetric Rate Revenue \nkWh","Distribution Volumetric Rate Revenue \nkW","Revenues from Rates",null,"Service Charge % Revenue","Distribution Volumetric Rate % Revenue \nkWh","Distribution Volumetric Rate % Revenue \nkW","Total % Revenue"]
{"$rows_left_out":7}
{"sheet":"5. Rev_Requ_Check","index":6,"n_rows":65,"n_cols":6,"rows_kept":65,"cut":false,"hidden":false,"merged":[[7,2,7,5]]}
[]
[]
[]
[]
[]
[]
[]
["Applicants Rate Base",null,{"$f":"IF('1. Information Sheet'!F26=\"COS\",CONCATENATE('1. Information Sheet'!M26,\" Test Year COS Rebasing\"),CONCATENATE(\"Last COS Rebasing: \",'1. Information Sheet'!F34))","v":"Last COS Rebasing: 2020"}]
["Average Net Fixed Assets"]
["Gross Fixed Assets - Re-based Opening",null,191735585.34000003,"A"]
["Add: CWIP Re-based Opening",null,1856895.4499999993,"B"]
["Re-based Capital Additions",null,8743776.0599999987,"C"]
["Re-based Capital Disposals",null,0,"D"]
["Re-based Capital Retirements",null,0,"E"]
["Deduct: CWIP Re-based Closing",null,-1856895.45,"F"]
{"$rows_left_out":51}
{"sheet":"6. Growth Factor - DEN_CALC","index":7,"n_rows":21,"n_cols":19,"rows_kept":21,"cut":false,"hidden":false,"merged":[[13,2,13,4],[13,6,13,8]]}
[]
[]
[]
[]
[]
[]
[]
[]
[]
[]
[]
[{"$f":"\"Input the billing determinants associated with \"&'1. Information Sheet'!F14&\"'s \"&'1. Information Sheet'!F49&\".  This sheet calculates the DENOMINATOR portion of the growth factor calculation.\"","v":"Input the billing determinants associated with Algoma Power Inc.'s Revenues Based on 2019 Actual Distribution Demand.  This sheet calculates the DENOMINATOR portion of the growth factor calculation."}]
["Pro forma Revenue Calculation."]
[null,null,{"$f":"RIGHT('1. Information Sheet'!F49,LEN('1. Information Sheet'!F49)-18)","v":"2019 Actual Distribution Demand"},null,null,null,{"$f":"'3. Growth Factor - NUM_CALC1'!G15","v":"Current Approved Distribution Rates"}]
["Rate Class",null,"Billed Customers or Connections","Billed kWh","Billed kW",null,"Monthly Service Charge","Distribution Volumetric Rate kWh","Distribution Volumetric Rate kW",null,"Service Charge Revenue","Distribution Volumetric Rate Revenue \nkWh","Distribution Volumetric Rate Revenue \nkW","Total Revenue By Rate Class",null,"Service Charge % Revenue","Distribution Volumetric Rate % Revenue \nkWh","Distribution Volumetric Rate % Revenue \nkW","Total % Revenue"]
{"$rows_left_out":7}
{"sheet":"7. Revenue Proportions","index":8,"n_rows":21,"n_cols":19,"rows_kept":21,"cut":false,"hidden":false,"merged":[[12,0,12,6],[13,2,13,4],[13,6,13,8]]}
[]
[]
[]
[]
[]
[]
[]
[]
[]
[]
[]
["Current Revenue from Rates"]
["This sheet is used to determine the applicant's most current allocation of revenues (after the most recent revenue to cost ratio adjustment, if applicable) to appropriately allocate the incremental revenue requirement to the classes.\n"]
[null,null,{"$f":"IF('1. Information Sheet'!F26=\"COS\", \"Proposed Base Rates in Current CoS Application\", \"Current OEB-Approved Base Rates\")","v":"Current OEB-Approved Base Rates"},null,null,null,{"$f":"'3. Growth Factor - NUM_CALC1'!C15","v":"2020 Board-Approved Distribution Demand"}]
["Rate Class",null,"Monthly Service Charge","Distribution Volumetric Rate kWh","Distribution Volumetric Rate kW",null,"Re-based Billed Customers or Connections","Re-based Billed kWh","Re-based Billed kW",null,"Current Base Service Charge Revenue","Current Base Distribution Volumetric Rate kWh Revenue","Current Base Distribution Volumetric Rate kW Revenue","Total Current Base Revenue",null,"Service Charge % Total Revenue","Distribution Volumetric Rate % Total Revenue ","Distribution Volumetric Rate % Total Revenue ","Total % Revenue"]
{"$rows_left_out":7}
{"sheet":"8. Threshold Test","index":9,"n_rows":77,"n_cols":5,"rows_kept":77,"cut":false,"hidden":false,"merged":[[8,2,8,4],[76,2,76,5]]}
[]
[]
[]
[]
[]
[]
[]
["No Input Required."]
[null,null,{"$f":"IF('1. Information Sheet'!F26 = \"COS\", \"Preliminary Materiality Threshold Calculation\", \"Final Materiality Threshold Calculation\")","v":"Final Materiality Threshold Calculation"}]
[]
[]
[]
[null,null,"Cost of Service Rebasing Year",null,{"$f":"IF('1. Information Sheet'!F26=\"COS\",'1. Information Sheet'!M26,'1. Information Sheet'!F34)","v":2020}]
[null,null,"Price Cap IR Year in which Application is made",null,{"$f":"IF('1. Information Sheet'!F26=\"CoS\", \"COS\",'1. Information Sheet'!F28)","v":2}]
[]
{"$rows_left_out":63}
{"sheet":"9a. Proposed ACM Projects","index":10,"n_rows":51,"n_cols":13,"rows_kept":51,"cut":false,"hidden":true,"merged":[[12,2,12,5],[12,6,12,11],[24,2,24,5],[24,6,24,11],[25,12,26,12]]}
[]
[]
[]
[]
[]
[]
[]
[]
[]
[]
["Identify ALL Proposed ACM projects and related CAPEX costs in the relevant years"]
[]
[null,"Cost of Service","Price Cap IR",null,null,null,"(if necessary)"]
[null,"Test Year","Year 1","Year 2","Year 3","Year 4","Year 5","Year 6","Year 7","Year 8","Year 9","Year 10"]
[null,{"$f":"'1. Information Sheet'!K26","v":0},{"$f":"B15+1","v":1},2,3,4,5,6,7,8,9,10]
{"$rows_left_out":37}
{"sheet":"9b. Proposed ACM ICM Projects","index":11,"n_rows":128,"n_cols":15,"rows_kept":128,"cut":false,"hidden":false,"merged":[[49,0,52,1],[88,0,91,1],[127,0,130,1],[88,9,88,11],[88,12,88,14],[89,12,89,14],[61,3,61,5],[61,6,61,8],[61,9,61,11],[61,12,61,14],[54,1,57,1],[60,3,60,5],[60,6,60,8],[60,9,60,11],[60,12,60,14],[100,3,100,5],[15,1,18,1],[21,3,21,5],[21,6,21,8],[21,9,21,11],[21,12,21,14],[22,12,22,14],[53,6,53,8],[53,9,53,11],[53,12,53,14],[51,9,51,11],[51,12,51,14],[100,6,100,8],[100,9,100,11],[100,12,100,14],[91,3,91,5],[91,6,91,8],[91,9,91,11],[91,12,91,14],[92,3,92,5],[92,6,92,8],[92,9,92,11],[92,12,92,14],[93,1,96,1],[99,3,99,5],[99,6,99,8],[99,9,99,11],[99,12,99,14],[12,12,12,14],[49,3,49,5],[49,6,49,8],[49,9,49,11],[49,12,49,14],[13,3,13,5],[13,6,13,8],[13,9,13,11],[13,12,13,14],[14,3,14,5],[14,6,14,8],[14,9,14,11],[14,12,14,14],[22,3,22,5],[22,6,22,8],[22,9,22,11],[51,3,51,5],[51,6,51,8],[12,3,12,5],[12,6,12,8],[12,9,12,11],[90,9,90,11],[90,12,90,14],[89,9,89,11],[52,3,52,5],[52,6,52,8],[52,9,52,11],[52,12,52,14],[53,3,53,5],[88,3,88,5],[88,6,88,8],[90,6,90,8],[90,3,90,5]]}
[]
[]
[]
[]
[]
[]
[]
[]
[]
[]
["Identify ALL Proposed ACM and ICM projects and related CAPEX costs in the relevant years"]
[]
[null,null,"Cost of Service","Price Cap IR",null,null,"Price Cap IR",null,null,"Price Cap IR",null,null,"Price Cap IR"]
[null,null,"Test Year","Year 1",null,null,"Year 2",null,null,"Year 3",null,null,"Year 4"]
[null,null,{"$f":"'1. Information Sheet'!F34","v":2020},{"$f":"C15+1","v":2021},null,null,{"$f":"D15+1","v":2022},null,null,{"$f":"G15+1","v":2023},null,null,{"$f":"J15+1","v":2024}]
{"$rows_left_out":114}
{"sheet":"10. Incremental Capital Adj.","index":12,"n_rows":93,"n_cols":6,"rows_kept":93,"cut":false,"hidden":false,"merged":[[23,2,23,4],[28,1,28,5],[22,5,23,7]]}
[]
[]
[]
[]
[]
[]
[]
[]
[]
[]
[]
[null,"Incremental Capital Adjustment","Rate Year:",null,{"$f":"'1. Information Sheet'!M26","v":2022}]
[]
[]
[]
{"$rows_left_out":79}
{"sheet":"11. Rate Rider Calc","index":13,"n_rows":23,"n_cols":15,"rows_kept":23,"cut":false,"hidden":false,"merged":[[12,0,12,3],[12,4,12,5]]}
[]
[]
[]
[]
[]
[]
[]
[]
[]
[]
[]
[]
["Calculation of incremental rate rider.  Choose one of the 3 options:",null,null,null,"Fixed Only Rate Rider"]
[]
["Rate Class",null,"Service Charge % Revenue","Distribution Volumetric Rate % Revenue kWh","Distribution Volumetric Rate % Revenue kW","Service Charge Revenue","Distribution Volumetric Rate Revenue kWh","Distribution Volumetric Rate Revenue kW","Total Revenue by Rate Class",null,"Billed Customers or Connections","Billed kWh","Billed kW",null,"Service Charge Rate Rider"]
{"$rows_left_out":8}