{"text_format":"1","workbook":"xlsx","n_sheets":5,"sheets":["VolumeData","Input","Calculation","Output","Check"],"not_rendered":{"charts":0,"images":0,"macros":0,"external_links":0,"defined_names":2461,"comments":0,"pivot_tables":0},"unopened":[],"bounds":{"document_bytes":16777216,"sheet_cells":100000,"rows_first":2000,"rows_last":500,"rows_between":2000,"halvings":0,"cell_chars":16384,"cell_head_chars":4096},"cells_cut":0,"cells_raw":0,"read":"whole","date_system":"1900"}

{"sheet":"VolumeData","index":0,"n_rows":64,"n_cols":21,"rows_kept":64,"cut":false,"hidden":false,"merged":[]}
[]
[null,null,null,null,null,null,"CIP Avg Annual Est",null,"T1","T2","T3"]
[null,null,null,null,null,null,{"$f":"SUM(I3:K3)","v":2149},null,1001.3160527512506,1147.6839472487495,0]
[null,null,null,null,null,null,2066,null,1001.3160527512506,1064.6839472487495,0]
[null,null,null,null,null,null,{"$f":"SUM(I5:K5)","v":4693},null,1198.1709868121875,2875.0040927694408,619.82492041837202]
[null,null,null,null,null,null,4720,null,1198.7357889949976,2884.0654843110506,637.1987266939517]
[null,null,null,null,null,null,26933,null,9831.5433379437527,17101.456662056247,0]
[null,null,null,null,null,null,75685,null,11715.326187183033,45792.7184186261,18176.955394190871]
[]
[]
[null,null,null,null,null,"Volumes under CIP m3/cx",null,null,null,null,null,null,null,null,null,null,null,"Actual/Forecasted Volumes"]
[]
[null,null,"Connection Growth (Rate 1)","%"]
[null,null,"Connection Growth (Rate 6)","%"]
[]
[null,null,"Rate Class","Tier",null,null,null,2020,2021,null,null,null,null,null,null,null,null,null,null,2020,2021]
[null,null,null,null,null,null,null,"*Year-end customer connections",null,null,null,null,null,null,null,null,null,null,null,"*Year-end customer connections"]
[null,null,null,null,null,"RATE 1","Existing Residential",161.20897248130734,1694.5471877489144,null,null,null,null,null,null,null,null,"RATE 1","Existing Residential",161.20897248130734,1694.5471877489144]
[null,null,null,null,null,null,"New Residential",12.79102751869266,134.4528122510855,null,null,null,null,null,null,null,null,null,"New Residential",12.79102751869266,134.4528122510855]
[null,null,null,null,null,null,"Small Commercial",1,18,null,null,null,null,null,null,null,null,null,"Small Commercial",1,18]
[null,null,null,null,null,null,"Small Agricultural",0,0,null,null,null,null,null,null,null,null,null,"Small Agricultural",0,0]
[null,null,null,null,null,"RATE 6","Medium Commercial",0,5,null,null,null,null,null,null,null,null,"RATE 6","Medium Commercial",0,5]
[null,null,null,null,null,null,"Large Commercial",0,2,null,null,null,null,null,null,null,null,null,"Large Commercial",0,2]
[]
[null,null,null,null,null,null,null,"*this # represents mid-year connections",null,null,null,null,null,null,null,null,null,null,null,"*this # represents mid-year connections"]
[null,null,null,null,null,"RATE 1","Existing Residential",80.604486240653671,927.87808011511083,null,null,null,null,null,null,null,null,"RATE 1","Existing Residential",80.604486240653671,927.87808011511083]
[null,null,null,null,null,null,"New Residential",6.39551375934633,73.621919884889081,null,null,null,null,null,null,null,null,null,"New Residential",6.39551375934633,73.621919884889081]
[null,null,null,null,null,null,"Small Commercial",0.5,9.5,null,null,null,null,null,null,null,null,null,"Small Commercial",0.5,9.5]
[null,null,null,null,null,null,"Small Agricultural",0,0,null,null,null,null,null,null,null,null,null,"Small Agricultural",0,0]
[null,null,null,null,null,"RATE 6","Medium Commercial",0,2.5,null,null,null,null,null,null,null,null,"RATE 6","Medium Commercial",0,2.5]
[null,null,null,null,null,null,"Large Commercial",0,1,null,null,null,null,null,null,null,null,null,"Large Commercial",0,1]
[null,null,null,null,null,null,null,"*T1 volume",null,null,null,null,null,null,null,null,null,null,null,"*T1 volume"]
[null,null,"Rate 1","Tier 1",null,"RATE 1","Existing Residential",{"$f":"H26*$I3","v":80710.565996533827},929099.21661527141,null,null,null,null,null,null,null,null,"RATE 1","Existing Residential",2517.1761915773791,506667.84880906501]
[null,null,"Rate 1","Tier 1",null,null,"New Residential",6403.9305928249787,73718.810215105943,null,null,null,null,null,null,null,null,null,"New Residential",199.72380842262118,40201.251190935]
[null,null,"Rate 1","Tier 1",null,null,"Small Commercial",599.08549340609375,11382.624374715781,null,null,null,null,null,null,null,null,null,"Small Commercial",0,9031.7999999999993]
[null,null,"Rate 1","Tier 1",null,null,"Small Agricultural",0,0,null,null,null,null,null,null,null,null,null,"Small Agricultural",0,0]
[null,null,"Rate 6","Tier 1",null,"RATE 6","Medium Commercial",0,24578.858344859382,null,null,null,null,null,null,null,null,"RATE 6","Medium Commercial",0,5510]
[null,null,"Rate 6","Tier 1",null,null,"Large Commercial",0,11715.326187183033,null,null,null,null,null,null,null,null,null,"Large Commercial",0,10000]
[]
[null,null,null,null,null,null,null,"*T2 volume",null,null,null,null,null,null,null,null,null,null,null,"*T2 volume"]
{"$rows_left_out":25}
{"sheet":"Input","index":1,"n_rows":89,"n_cols":11,"rows_kept":89,"cut":false,"hidden":false,"merged":[]}
[{"$f":"MID(CELL(\"filename\",A1),FIND(\"]\",CELL(\"filename\",A1))+1,256)","v":"Input"}]
[null,null,"Master Check",{"$f":"Check!E18","v":3.8562575355172157E-10}]
[null,null,null,null,null,null,null,null,2019,2020,2021]
[]
[null,null,"General"]
[]
[null,null,"OEB Prescribed Rate","%",null,null,null,null,{"$f":"AVERAGE(0.0245,0.0218,0.0218,0.0218)","v":2.2474999999999998E-2},{"$f":"AVERAGE(0.0218,0.0218,0.0057,0.0057)","v":1.3749999999999998E-2},{"$f":"AVERAGE(0.0057,0.0057,0.0057,0.0057)","v":5.7000000000000002E-3}]
[]
[null,null,"List"]
[]
[null,null,"Rate Class"]
[]
[null,null,"Rate 1"]
[null,null,"Rate 6"]
[]
[null,null,"Tier"]
[]
[null,null,"Tier 1"]
[null,null,"Tier 2"]
[null,null,"Tier 3"]
[]
[null,null,"Customer Type"]
[]
[null,null,null,null,"Rate Class"]
[null,null,"Existing Residential",null,"Rate 1"]
[null,null,"New Residential",null,"Rate 1"]
[null,null,"Small Commercial",null,"Rate 1"]
[null,null,"Small Agricultural",null,"Rate 1"]
[null,null,"Medium Commercial",null,"Rate 6"]
[null,null,"Large Commercial",null,"Rate 6"]
[]
[]
[]
[]
[]
[null,null,"Volume with CIP Assumptions"]
[]
[null,null,null,null,"Rate Class","Tier"]
[null,null,"Rate 1 - General Firm Service"]
[null,null,"Tier 1","m3","Rate 1","Tier 1",null,{"$f":"SUM(I40:K40)","v":1101914.2332878578},0,{"$f":"SUMIFS(VolumeData!H$18:H$62,VolumeData!$C$18:$C$62,$E40,VolumeData!$D$18:$D$62,$F40)","v":87713.5820827649},{"$f":"SUMIFS(VolumeData!I$18:I$62,VolumeData!$C$18:$C$62,$E40,VolumeData!$D$18:$D$62,$F40)","v":1014200.651205093}]
{"$rows_left_out":50}
{"sheet":"Calculation","index":2,"n_rows":324,"n_cols":11,"rows_kept":324,"cut":false,"hidden":false,"merged":[]}
[{"$f":"MID(CELL(\"filename\",A1),FIND(\"]\",CELL(\"filename\",A1))+1,256)","v":"Calculation"}]
[null,null,"Master Check",{"$f":"Check!E18","v":3.8562575355172157E-10}]
[null,null,null,null,null,null,null,null,{"$f":"Input!I3","v":2019},{"$f":"Input!J3","v":2020},{"$f":"Input!K3","v":2021}]
[]
[null,null,"Connection Growth"]
[null,null,"Connection Growth"]
[]
[null,null,"Shared Between CIP and Actual / Forecast"]
[]
[null,null,"Revenue Rates by Customer Type by Tiers"]
[]
[null,null,"Tier 1"]
[null,null,null,null,"Rate Class","Tier"]
[null,null,"Existing Residential","cents/ m3",{"$f":"INDEX(Input!$E$25:$E$30,MATCH($C14,Input!$C$25:$C$30,0))","v":"Rate 1"},{"$f":"C12","v":"Tier 1"},null,null,null,{"$f":"SUMIFS(Input!J$75:J$87,Input!$E$75:$E$87,$E14,Input!$F$75:$F$87,$F14)","v":27.196721999999998},{"$f":"SUMIFS(Input!K$75:K$87,Input!$E$75:$E$87,$E14,Input!$F$75:$F$87,$F14)","v":27.620999999999999}]
[null,null,"New Residential","cents/ m3",{"$f":"INDEX(Input!$E$25:$E$30,MATCH($C15,Input!$C$25:$C$30,0))","v":"Rate 1"},{"$f":"C12","v":"Tier 1"},null,null,null,{"$f":"SUMIFS(Input!J$75:J$87,Input!$E$75:$E$87,$E15,Input!$F$75:$F$87,$F15)","v":27.196721999999998},{"$f":"SUMIFS(Input!K$75:K$87,Input!$E$75:$E$87,$E15,Input!$F$75:$F$87,$F15)","v":27.620999999999999}]
[null,null,"Small Commercial","cents/ m3",{"$f":"INDEX(Input!$E$25:$E$30,MATCH($C16,Input!$C$25:$C$30,0))","v":"Rate 1"},{"$f":"C12","v":"Tier 1"},null,null,null,{"$f":"SUMIFS(Input!J$75:J$87,Input!$E$75:$E$87,$E16,Input!$F$75:$F$87,$F16)","v":27.196721999999998},{"$f":"SUMIFS(Input!K$75:K$87,Input!$E$75:$E$87,$E16,Input!$F$75:$F$87,$F16)","v":27.620999999999999}]
[null,null,"Small Agricultural","cents/ m3",{"$f":"INDEX(Input!$E$25:$E$30,MATCH($C17,Input!$C$25:$C$30,0))","v":"Rate 1"},{"$f":"C12","v":"Tier 1"},null,null,null,{"$f":"SUMIFS(Input!J$75:J$87,Input!$E$75:$E$87,$E17,Input!$F$75:$F$87,$F17)","v":27.196721999999998},{"$f":"SUMIFS(Input!K$75:K$87,Input!$E$75:$E$87,$E17,Input!$F$75:$F$87,$F17)","v":27.620999999999999}]
[]
[]
[null,null,"Medium Commercial","cents/ m3",{"$f":"INDEX(Input!$E$25:$E$30,MATCH($C20,Input!$C$25:$C$30,0))","v":"Rate 6"},{"$f":"C12","v":"Tier 1"},null,null,null,{"$f":"SUMIFS(Input!J$75:J$87,Input!$E$75:$E$87,$E20,Input!$F$75:$F$87,$F20)","v":25.089700000000001},{"$f":"SUMIFS(Input!K$75:K$87,Input!$E$75:$E$87,$E20,Input!$F$75:$F$87,$F20)","v":25.481100000000001}]
[null,null,"Large Commercial","cents/ m3",{"$f":"INDEX(Input!$E$25:$E$30,MATCH($C21,Input!$C$25:$C$30,0))","v":"Rate 6"},{"$f":"C12","v":"Tier 1"},null,null,null,{"$f":"SUMIFS(Input!J$75:J$87,Input!$E$75:$E$87,$E21,Input!$F$75:$F$87,$F21)","v":25.089700000000001},{"$f":"SUMIFS(Input!K$75:K$87,Input!$E$75:$E$87,$E21,Input!$F$75:$F$87,$F21)","v":25.481100000000001}]
[]
[]
[null,null,"Tier 2"]
[null,null,null,null,"Rate Class","Tier"]
[null,null,"Existing Residential","cents/ m3",{"$f":"INDEX(Input!$E$25:$E$30,MATCH($C26,Input!$C$25:$C$30,0))","v":"Rate 1"},{"$f":"C24","v":"Tier 2"},null,null,null,{"$f":"SUMIFS(Input!J$75:J$87,Input!$E$75:$E$87,$E26,Input!$F$75:$F$87,$F26)","v":26.661004999999996},{"$f":"SUMIFS(Input!K$75:K$87,Input!$E$75:$E$87,$E26,Input!$F$75:$F$87,$F26)","v":27.076899999999998}]
[null,null,"New Residential","cents/ m3",{"$f":"INDEX(Input!$E$25:$E$30,MATCH($C27,Input!$C$25:$C$30,0))","v":"Rate 1"},{"$f":"C24","v":"Tier 2"},null,null,null,{"$f":"SUMIFS(Input!J$75:J$87,Input!$E$75:$E$87,$E27,Input!$F$75:$F$87,$F27)","v":26.661004999999996},{"$f":"SUMIFS(Input!K$75:K$87,Input!$E$75:$E$87,$E27,Input!$F$75:$F$87,$F27)","v":27.076899999999998}]
[null,null,"Small Commercial","cents/ m3",{"$f":"INDEX(Input!$E$25:$E$30,MATCH($C28,Input!$C$25:$C$30,0))","v":"Rate 1"},{"$f":"C24","v":"Tier 2"},null,null,null,{"$f":"SUMIFS(Input!J$75:J$87,Input!$E$75:$E$87,$E28,Input!$F$75:$F$87,$F28)","v":26.661004999999996},{"$f":"SUMIFS(Input!K$75:K$87,Input!$E$75:$E$87,$E28,Input!$F$75:$F$87,$F28)","v":27.076899999999998}]
[null,null,"Small Agricultural","cents/ m3",{"$f":"INDEX(Input!$E$25:$E$30,MATCH($C29,Input!$C$25:$C$30,0))","v":"Rate 1"},{"$f":"C24","v":"Tier 2"},null,null,null,{"$f":"SUMIFS(Input!J$75:J$87,Input!$E$75:$E$87,$E29,Input!$F$75:$F$87,$F29)","v":26.661004999999996},{"$f":"SUMIFS(Input!K$75:K$87,Input!$E$75:$E$87,$E29,Input!$F$75:$F$87,$F29)","v":27.076899999999998}]
[]
[]
[null,null,"Medium Commercial","cents/ m3",{"$f":"INDEX(Input!$E$25:$E$30,MATCH($C32,Input!$C$25:$C$30,0))","v":"Rate 6"},{"$f":"C24","v":"Tier 2"},null,null,null,{"$f":"SUMIFS(Input!J$75:J$87,Input!$E$75:$E$87,$E32,Input!$F$75:$F$87,$F32)","v":22.5807},{"$f":"SUMIFS(Input!K$75:K$87,Input!$E$75:$E$87,$E32,Input!$F$75:$F$87,$F32)","v":22.933}]
[null,null,"Large Commercial","cents/ m3",{"$f":"INDEX(Input!$E$25:$E$30,MATCH($C33,Input!$C$25:$C$30,0))","v":"Rate 6"},{"$f":"C24","v":"Tier 2"},null,null,null,{"$f":"SUMIFS(Input!J$75:J$87,Input!$E$75:$E$87,$E33,Input!$F$75:$F$87,$F33)","v":22.5807},{"$f":"SUMIFS(Input!K$75:K$87,Input!$E$75:$E$87,$E33,Input!$F$75:$F$87,$F33)","v":22.933}]
[]
[]
[null,null,"Tier 3"]
[null,null,null,null,"Rate Class","Tier"]
[null,null,"Existing Residential","cents/ m3",{"$f":"INDEX(Input!$E$25:$E$30,MATCH($C38,Input!$C$25:$C$30,0))","v":"Rate 1"},{"$f":"C36","v":"Tier 3"},null,null,null,{"$f":"SUMIFS(Input!J$75:J$87,Input!$E$75:$E$87,$E38,Input!$F$75:$F$87,$F38)","v":25.873466499999996},{"$f":"SUMIFS(Input!K$75:K$87,Input!$E$75:$E$87,$E38,Input!$F$75:$F$87,$F38)","v":26.277100000000001}]
[null,null,"New Residential","cents/ m3",{"$f":"INDEX(Input!$E$25:$E$30,MATCH($C39,Input!$C$25:$C$30,0))","v":"Rate 1"},{"$f":"C36","v":"Tier 3"},null,null,null,{"$f":"SUMIFS(Input!J$75:J$87,Input!$E$75:$E$87,$E39,Input!$F$75:$F$87,$F39)","v":25.873466499999996},{"$f":"SUMIFS(Input!K$75:K$87,Input!$E$75:$E$87,$E39,Input!$F$75:$F$87,$F39)","v":26.277100000000001}]
[null,null,"Small Commercial","cents/ m3",{"$f":"INDEX(Input!$E$25:$E$30,MATCH($C40,Input!$C$25:$C$30,0))","v":"Rate 1"},{"$f":"C36","v":"Tier 3"},null,null,null,{"$f":"SUMIFS(Input!J$75:J$87,Input!$E$75:$E$87,$E40,Input!$F$75:$F$87,$F40)","v":25.873466499999996},{"$f":"SUMIFS(Input!K$75:K$87,Input!$E$75:$E$87,$E40,Input!$F$75:$F$87,$F40)","v":26.277100000000001}]
{"$rows_left_out":285}
{"sheet":"Output","index":3,"n_rows":329,"n_cols":11,"rows_kept":329,"cut":false,"hidden":false,"merged":[]}
[{"$f":"MID(CELL(\"filename\",A1),FIND(\"]\",CELL(\"filename\",A1))+1,256)","v":"Output"}]
[]
[null,null,"Master Check",{"$f":"Check!E18","v":3.8562575355172157E-10}]
[null,null,null,null,null,null,"Summary"]
[null,null,null,null,null,null,"($)"]
[]
[]
[null,null,null,null,null,null,null,"Col. 1","Col. 2","Col. 3","Col. 4"]
[null,null,null,null,null,null,null,null,"Actual","Actual","Actual"]
[null,null,null,null,null,null,"Forecasted Revenue","Total",{"$f":"Input!I$3","v":2019},{"$f":"Input!J$3","v":2020},{"$f":"Input!K$3","v":2021}]
[]
[null,null,null,null,null,"Row 1","CIP Common Assumptions",{"$f":"SUM(I12:K12)","v":723113.00504211988},{"$f":"I283+I291","v":0},53880.502886484726,669232.50215563516]
[null,null,null,null,null,"Row 2","Actual / Forecast",{"$f":"SUM(I13:K13)","v":281035.69504607795},{"$f":"I309+I317","v":0},884.34090287799995,280151.35414319998]
[null,null,null,null,null,"Row 3","Difference (negative = shortfall)",{"$f":"SUM(I14:K14)","v":-442077.30999604193},{"$f":"I13-I12","v":0},-52996.161983606726,-389081.14801243518]
[]
[]
[]
[null,null,null,null,null,null,"Projected Cumulative Deferral Account"]
[null,null,null,null,null,null,"($)"]
[]
[]
[null,null,null,null,null,null,null,{"$f":"H$8","v":"Col. 1"},{"$f":"I$8","v":"Col. 2"},"Col. 3","Col. 4"]
[null,null,null,null,null,null,null,null,"Actual","Actual","Actual"]
[null,null,null,null,null,null,"Description","Total",{"$f":"Input!I$3","v":2019},{"$f":"Input!J$3","v":2020},{"$f":"Input!K$3","v":2021}]
[]
[null,null,null,null,null,"Row 1","Opening",null,0,{"$f":"I30","v":0},0]
[null,null,null,null,null,"Row 2","Addition",{"$f":"SUM(I27:K27)","v":442077.30999604193},{"$f":"-MIN(0,I14)","v":0},{"$f":"-MIN(0,J14)","v":52996.161983606726},389081.14801243518]
[null,null,null,null,null,"Row 3","Disposal",{"$f":"SUM(I28:K28)","v":-443550.53988151462},{"$f":"-SUM(I26:I27,I29)","v":0},{"$f":"-SUM(J26:J27,J29)","v":-53360.510597244021},{"$f":"-SUM(K26:K27,K29)","v":-390190.0292842706}]
[null,null,null,null,null,"Row 4","Carrying Cost",{"$f":"SUM(I29:K29)","v":1473.2298854727364},{"$f":"(I26+0.5*I27)*I32","v":0},364.34861363729618,1108.8812718354402]
[null,null,null,null,null,"Row 5","Closing",null,{"$f":"SUM(I26:I29)","v":0},{"$f":"SUM(J26:J29)","v":0},2.3646862246096134E-11]
[null,null,null,null,null,"Row 6"]
[null,null,null,null,null,"Row 7","OEB Prescribed Rate (Annual Average)",null,{"$f":"Input!I7","v":2.2474999999999998E-2},{"$f":"Input!J7","v":1.3749999999999998E-2},{"$f":"Input!K7","v":5.7000000000000002E-3}]
[]
[]
[]
[null,null,null,null,null,null,"Revenue with CIP Common Assumptions"]
[null,null,null,null,null,null,"($)"]
[]
[]
[null,null,null,null,null,null,null,{"$f":"H$8","v":"Col. 1"},{"$f":"I$8","v":"Col. 2"},"Col. 3","Col. 4"]
{"$rows_left_out":290}
{"sheet":"Check","index":4,"n_rows":18,"n_cols":5,"rows_kept":18,"cut":false,"hidden":false,"merged":[]}
[{"$f":"MID(CELL(\"filename\",A1),FIND(\"]\",CELL(\"filename\",A1))+1,256)","v":"Check"}]
[]
[null,null,"Description","Tab","Value"]
[null,null,"Revenues",null,{"$f":"SUM(Output!I322:K325)","v":0}]
[null,null,"Volumes",null,{"$f":"SUM(Output!I322:K329)","v":3.8562575355172157E-10}]
[]
[]
[]
[]
[]
[]
[]
[]
[]
[]
[]
[]
[null,null,"Sum",null,{"$f":"SUM(E4:E17)","v":3.8562575355172157E-10}]