{"text_format":"1","workbook":"xlsx","n_sheets":18,"sheets":["A1.1 Distributor Information","B1.1 Current Distribution Rates","B1.2 Billing Determinants","B1.3 Current Rev From Rates","C1.1 Current Rate Riders","D1.1 Rate 1 Adjustment","D1.2 Rate 6 Adjustment","D1.3 Rate 11 Adjustment","D1.4 Rate 16 Adjustment","E1.1 Proposed Dist Rates ","E1.2 Billing Determinants","E1.3 Proposed Rev From Rate","F1.3 Rate Riders","G1.1 Rate 1 Bill Impact","G1.2 Rate 6 Bill Impact","G1.3 Rate 11 Bill Impact","G1.4 Rate 16 Bill Impact","G1.7 Summary of Bill Impacts"],"not_rendered":{"charts":0,"images":0,"macros":1,"external_links":0,"defined_names":4,"comments":0,"pivot_tables":0},"unopened":[],"bounds":{"document_bytes":16777216,"sheet_cells":100000,"rows_first":2000,"rows_last":500,"rows_between":2000,"halvings":0,"cell_chars":16384,"cell_head_chars":4096},"cells_cut":0,"cells_raw":0,"read":"whole","date_system":"1900"}

{"sheet":"A1.1 Distributor Information","index":0,"n_rows":12,"n_cols":4,"rows_kept":12,"cut":false,"hidden":false,"merged":[]}
[]
[]
[null,null,{"$f":" \"Name of LDC:       \" &D8","v":"Name of LDC:       EPCOR Natural Gas Limited Partnership"}]
[null,null,{"$f":" \"OEB Application Number:  \" & D9","v":"OEB Application Number:  EB-2022-0184  Exhibit A - 2023 Custom Incentive Application"}]
[]
[null,null,"Distributor Information"]
[]
[null,null,"Distributor Name","EPCOR Natural Gas Limited Partnership"]
[null,null,"OEB Application Number","EB-2022-0184  Exhibit A - 2023 Custom Incentive Application"]
[]
{"$rows_left_out":3}
{"sheet":"B1.1 Current Distribution Rates","index":1,"n_rows":18,"n_cols":17,"rows_kept":18,"cut":false,"hidden":false,"merged":[[6,6,6,8]]}
[]
[null,null,{"$f":"'A1.1 Distributor Information'!C3","v":"Name of LDC:       EPCOR Natural Gas Limited Partnership"}]
[null,null,{"$f":"'A1.1 Distributor Information'!C4","v":"OEB Application Number:  EB-2022-0184  Exhibit A - 2023 Custom Incentive Application"}]
[]
[null,null,"Current Distribution Tariff Sheet Rates"]
[]
[null,null,null,null,"Fixed ",null,"Delivery Charge",null,null,"Delivery Charge"]
[null,null,"Rate Class",null,"Monthly Base",{"$f":"OneDollar","v":"Bill 32 Rate"},"Tier 1","Tier 2","Tier 3","Contract Demand","Gas Supply","Upstream Recovery \nCharge","Transportation & \nStorage Charge","Transportation Charge \nFrom Dawn","Transportation Charge \nFrom Kirkwall","Transportation Charge From Parkway","Federal Carbon Charge"]
[null,null,null,null," $/month","$ / month","₵ / m3","₵ / m3","₵ / m3","₵ /contracted m3","₵  / m3","(A)","₵  / m3","₵ /contracted m3","₵ /contracted m3","₵ /contracted m3","₵ / m3"]
[null,null,"Rate 1","General Firm Service",26.272397999999999,1,28.148561099999995,27.594068789999994,26.77899261,null,30.690200000000001,1.474,2.6981999999999999,null,null,null,9.7899999999999991]
{"$rows_left_out":9}
{"sheet":"B1.2 Billing Determinants","index":2,"n_rows":12,"n_cols":10,"rows_kept":12,"cut":false,"hidden":false,"merged":[[6,5,6,7]]}
[]
[null,null,{"$f":"'A1.1 Distributor Information'!C3","v":"Name of LDC:       EPCOR Natural Gas Limited Partnership"}]
[null,null,{"$f":"'A1.1 Distributor Information'!C4","v":"OEB Application Number:  EB-2022-0184  Exhibit A - 2023 Custom Incentive Application"}]
[]
[null,null,"Billing Determinants"]
[]
[null,null,null,null,"Fixed","Delivery Charge",null,null,"Delivery Charge"]
[null,null,"Rate Class",null,"Monthly Base","Tier 1","Tier 2","Tier 3","Contract Demand","Gas Supply"]
[null,null,"Rate 1","General Firm Service",4887,3391849,1847677,263269,null,5502795]
[null,null,"Rate 6","Large Volume General Firm Service",35,287896,903329,890107,null,2081331]
{"$rows_left_out":3}
{"sheet":"B1.3 Current Rev From Rates","index":3,"n_rows":19,"n_cols":15,"rows_kept":19,"cut":false,"hidden":false,"merged":[[17,2,17,3],[10,6,10,8]]}
[]
[null,null,{"$f":"'A1.1 Distributor Information'!C3","v":"Name of LDC:       EPCOR Natural Gas Limited Partnership"}]
[null,null,{"$f":"'A1.1 Distributor Information'!C4","v":"OEB Application Number:  EB-2022-0184  Exhibit A - 2023 Custom Incentive Application"}]
[]
[]
[null,null,"Forecasted Revenue from Current Rates"]
[]
[null,null,"Months / Year",12]
[]
[]
{"$rows_left_out":10}
{"sheet":"C1.1 Current Rate Riders","index":4,"n_rows":40,"n_cols":6,"rows_kept":40,"cut":false,"hidden":false,"merged":[]}
[]
[null,null,{"$f":"'A1.1 Distributor Information'!C3","v":"Name of LDC:       EPCOR Natural Gas Limited Partnership"}]
[null,null,{"$f":"'A1.1 Distributor Information'!C4","v":"OEB Application Number:  EB-2022-0184  Exhibit A - 2023 Custom Incentive Application"}]
[]
[null,null,"Current Rate Riders"]
[]
[null,null,"Description:",null,"Delay in Revenue Recovery Rate Rider"]
[null,null,"Effective Until:",null,"Dec 31, 2028"]
[]
[null,null,"Rate 1 | General Firm Service","cents / m3 volume",1.633,"Cents/m3"]
{"$rows_left_out":31}
{"sheet":"D1.1 Rate 1 Adjustment","index":5,"n_rows":27,"n_cols":9,"rows_kept":27,"cut":false,"hidden":false,"merged":[]}
[]
[null,null,{"$f":"'A1.1 Distributor Information'!C3","v":"Name of LDC:       EPCOR Natural Gas Limited Partnership"}]
[null,null,{"$f":"'A1.1 Distributor Information'!C4","v":"OEB Application Number:  EB-2022-0184  Exhibit A - 2023 Custom Incentive Application"}]
[]
[null,null,"Rate 1 Incentive Rate Adjustment"]
[null,null,{"$f":"MID(CELL(\"filename\",A1),FIND(\"]\",CELL(\"filename\",A1))+1,255)","v":"D1.1 Rate 1 Adjustment"}]
[]
[null,null,"Rate 1"]
[]
[null,null,"GDP-IPI"]
{"$rows_left_out":18}
{"sheet":"D1.2 Rate 6 Adjustment","index":6,"n_rows":27,"n_cols":9,"rows_kept":27,"cut":false,"hidden":false,"merged":[]}
[]
[null,null,{"$f":"'A1.1 Distributor Information'!C3","v":"Name of LDC:       EPCOR Natural Gas Limited Partnership"}]
[null,null,{"$f":"'A1.1 Distributor Information'!C4","v":"OEB Application Number:  EB-2022-0184  Exhibit A - 2023 Custom Incentive Application"}]
[]
[null,null,"Rate 6 Incentive Rate Adjustment"]
[null,null,{"$f":"MID(CELL(\"filename\",A1),FIND(\"]\",CELL(\"filename\",A1))+1,255)","v":"D1.2 Rate 6 Adjustment"}]
[]
[null,null,"Rate 6"]
[]
[null,null,"GDP-IPI"]
{"$rows_left_out":18}
{"sheet":"D1.3 Rate 11 Adjustment","index":7,"n_rows":27,"n_cols":9,"rows_kept":27,"cut":false,"hidden":false,"merged":[]}
[]
[null,null,{"$f":"'A1.1 Distributor Information'!C3","v":"Name of LDC:       EPCOR Natural Gas Limited Partnership"}]
[null,null,{"$f":"'A1.1 Distributor Information'!C4","v":"OEB Application Number:  EB-2022-0184  Exhibit A - 2023 Custom Incentive Application"}]
[]
[null,null,"Rate 11 Incentive Rate Adjustment"]
[null,null,{"$f":"MID(CELL(\"filename\",A1),FIND(\"]\",CELL(\"filename\",A1))+1,255)","v":"D1.3 Rate 11 Adjustment"}]
[]
[null,null,"Rate 11"]
[]
[null,null,"GDP-IPI"]
{"$rows_left_out":18}
{"sheet":"D1.4 Rate 16 Adjustment","index":8,"n_rows":29,"n_cols":9,"rows_kept":29,"cut":false,"hidden":false,"merged":[]}
[]
[null,null,{"$f":"'A1.1 Distributor Information'!C3","v":"Name of LDC:       EPCOR Natural Gas Limited Partnership"}]
[null,null,{"$f":"'A1.1 Distributor Information'!C4","v":"OEB Application Number:  EB-2022-0184  Exhibit A - 2023 Custom Incentive Application"}]
[]
[null,null,"Rate 16 Incentive Rate Adjustment"]
[null,null,{"$f":"MID(CELL(\"filename\",A1),FIND(\"]\",CELL(\"filename\",A1))+1,255)","v":"D1.4 Rate 16 Adjustment"}]
[]
[null,null,"Rate 16"]
[]
[null,null,"GDP-IPI"]
{"$rows_left_out":20}
{"sheet":"E1.1 Proposed Dist Rates ","index":9,"n_rows":14,"n_cols":17,"rows_kept":14,"cut":false,"hidden":false,"merged":[]}
[]
[null,null,{"$f":"'A1.1 Distributor Information'!C3","v":"Name of LDC:       EPCOR Natural Gas Limited Partnership"}]
[null,null,{"$f":"'A1.1 Distributor Information'!C4","v":"OEB Application Number:  EB-2022-0184  Exhibit A - 2023 Custom Incentive Application"}]
[]
[null,null,"Proposed Distribution Tariff Sheet Rates"]
[null,null,{"$f":"MID(CELL(\"filename\",A1),FIND(\"]\",CELL(\"filename\",A1))+1,255)","v":"E1.1 Proposed Dist Rates "}]
[]
[null,null,"Rate Class",null,"Monthly Base",{"$f":"OneDollar","v":"Bill 32 Rate"},"Tier 1","Tier 2","Tier 3","Contract Demand","Gas Supply","Upstream Recovery \nCharge","Transportation & \nStorage Charge","Transportation Charge \nFrom Dawn","Transportation Charge \nFrom Kirkwall","Transportation Charge From Parkway","Federal Carbon Charge"]
[null,null,null,null,"$/month","$/month","₵ / m3","₵ / m3","₵ / m3","₵/contracted m3","₵/m3","(A)","₵  / m3","₵ /contracted m3","₵ /contracted m3","₵ /contracted m3","₵ / m3"]
[null,null,"Rate 1","General Firm Service",{"$f":"INDEX('D1.1 Rate 1 Adjustment'!$G$17:$G$26,MATCH(E$8,'D1.1 Rate 1 Adjustment'!$C$17:$C$26,0))","v":26.8057276794},{"$f":"INDEX('D1.1 Rate 1 Adjustment'!$G$17:$G$26,MATCH(F$8,'D1.1 Rate 1 Adjustment'!$C$17:$C$26,0))","v":1},{"$f":"INDEX('D1.1 Rate 1 Adjustment'!$G$17:$G$26,MATCH(G$8,'D1.1 Rate 1 Adjustment'!$C$17:$C$26,0))","v":28.719976890329995},{"$f":"INDEX('D1.1 Rate 1 Adjustment'!$G$17:$G$26,MATCH(H$8,'D1.1 Rate 1 Adjustment'!$C$17:$C$26,0))","v":28.154228386436994},{"$f":"INDEX('D1.1 Rate 1 Adjustment'!$G$17:$G$26,MATCH(I$8,'D1.1 Rate 1 Adjustment'!$C$17:$C$26,0))","v":27.322606159983},null,{"$f":"INDEX('D1.1 Rate 1 Adjustment'!$G$17:$G$26,MATCH(K$8,'D1.1 Rate 1 Adjustment'!$C$17:$C$26,0))","v":30.690200000000001},{"$f":"INDEX('D1.1 Rate 1 Adjustment'!$G$17:$G$26,MATCH(L$8,'D1.1 Rate 1 Adjustment'!$C$17:$C$26,0))","v":1.474},{"$f":"INDEX('D1.1 Rate 1 Adjustment'!$G$17:$G$26,MATCH(M$8,'D1.1 Rate 1 Adjustment'!$C$17:$C$26,0))","v":2.6981999999999999},null,null,null,{"$f":"INDEX('D1.1 Rate 1 Adjustment'!$G$17:$G$26,MATCH(Q$8,'D1.1 Rate 1 Adjustment'!$C$17:$C$26,0))","v":9.7899999999999991}]
{"$rows_left_out":5}
{"sheet":"E1.2 Billing Determinants","index":10,"n_rows":14,"n_cols":10,"rows_kept":14,"cut":false,"hidden":false,"merged":[]}
[]
[null,null,{"$f":"'A1.1 Distributor Information'!C3","v":"Name of LDC:       EPCOR Natural Gas Limited Partnership"}]
[null,null,{"$f":"'A1.1 Distributor Information'!C4","v":"OEB Application Number:  EB-2022-0184  Exhibit A - 2023 Custom Incentive Application"}]
[]
[null,null,"Billing Determinants"]
[null,null,{"$f":"MID(CELL(\"filename\",A1),FIND(\"]\",CELL(\"filename\",A1))+1,255)","v":"E1.2 Billing Determinants"}]
[]
[]
[null,null,"Rate Class","Description","Base","Tier 1","Tier 2","Tier 3","Firm Demand","Gas Supply"]
[null,null,null,null,"cx's","m3","m3","m3","Contracted m3","m3"]
{"$rows_left_out":5}
{"sheet":"E1.3 Proposed Rev From Rate","index":11,"n_rows":18,"n_cols":15,"rows_kept":18,"cut":false,"hidden":false,"merged":[]}
[]
[null,null,{"$f":"'A1.1 Distributor Information'!C3","v":"Name of LDC:       EPCOR Natural Gas Limited Partnership"}]
[null,null,{"$f":"'A1.1 Distributor Information'!C4","v":"OEB Application Number:  EB-2022-0184  Exhibit A - 2023 Custom Incentive Application"}]
[]
[null,null,"Proposed Revenue from Rates"]
[]
[null,null,"Months / Year",12]
[]
[null,null,"Rate Class",null,"Monthly Base",{"$f":"OneDollar","v":"Bill 32 Rate"},"Tier 1","Tier 2","Tier 3","Contracted\nDemand","Gas Supply","Upstream Recovery \nCharge","Transportation & \nStorage Charge","Federal Carbon \nCharge","Total"]
[null,null,null,null,null,null,null,null,null,null,null,null,"(A)"]
{"$rows_left_out":9}
{"sheet":"F1.3 Rate Riders","index":12,"n_rows":39,"n_cols":6,"rows_kept":39,"cut":false,"hidden":false,"merged":[]}
[]
[null,null,{"$f":"'A1.1 Distributor Information'!C3","v":"Name of LDC:       EPCOR Natural Gas Limited Partnership"}]
[null,null,{"$f":"'A1.1 Distributor Information'!C4","v":"OEB Application Number:  EB-2022-0184  Exhibit A - 2023 Custom Incentive Application"}]
[null,null,"F1.3 Rate Riders"]
[]
[null,null,"Delay in Revenue Recovery Rate Rider"]
[null,null,null,null,"Delay in Revenue Recovery Rate Rider"]
[]
[null,null,"Rate 1 | General Firm Service",null,1.633,"Cents/m3"]
[null,null,"Rate 6 | Large Volume General Firm Service",null,0.90900000000000003,"Cents/m3"]
{"$rows_left_out":30}
{"sheet":"G1.1 Rate 1 Bill Impact","index":13,"n_rows":181,"n_cols":12,"rows_kept":181,"cut":false,"hidden":false,"merged":[]}
[]
[null,null,{"$f":"'A1.1 Distributor Information'!C3","v":"Name of LDC:       EPCOR Natural Gas Limited Partnership"}]
[null,null,{"$f":"'A1.1 Distributor Information'!C4","v":"OEB Application Number:  EB-2022-0184  Exhibit A - 2023 Custom Incentive Application"}]
[]
[null,null,"Rate 1 Delivery Bill Impact"]
[null,null,"G1.1 Rate 1 Bill Impact"]
[]
[null,null,"Rate 1"]
[]
[null,null,"Rate 1 - Existing Residential",null,"Units","Current Rate",null,"Proposed Rate"]
{"$rows_left_out":172}
{"sheet":"G1.2 Rate 6 Bill Impact","index":14,"n_rows":93,"n_cols":12,"rows_kept":93,"cut":false,"hidden":false,"merged":[]}
[]
[null,null,{"$f":"'A1.1 Distributor Information'!C3","v":"Name of LDC:       EPCOR Natural Gas Limited Partnership"}]
[null,null,{"$f":"'A1.1 Distributor Information'!C4","v":"OEB Application Number:  EB-2022-0184  Exhibit A - 2023 Custom Incentive Application"}]
[]
[null,null,"Rate 6 Delivery Bill Impact"]
[null,null,"G1.2 Rate 6 Bill Impact"]
[]
[null,null,"Rate 6 - Medium Commercial",null,"Units","Current Rate",null,"Proposed Rate"]
[]
[null,null,"Customer",null,"$/month",{"$f":"INDEX('B1.1 Current Distribution Rates'!$E$10:$Q$13,2,COUNTA($C$10:C10))","v":107.15836499999999},null,{"$f":"INDEX('E1.1 Proposed Dist Rates '!$E$10:$Q$13,2,COUNTA($C$10:C10))","v":109.33367980949998}]
{"$rows_left_out":84}
{"sheet":"G1.3 Rate 11 Bill Impact","index":15,"n_rows":92,"n_cols":12,"rows_kept":92,"cut":false,"hidden":false,"merged":[]}
[]
[null,null,{"$f":"'A1.1 Distributor Information'!C3","v":"Name of LDC:       EPCOR Natural Gas Limited Partnership"}]
[null,null,{"$f":"'A1.1 Distributor Information'!C4","v":"OEB Application Number:  EB-2022-0184  Exhibit A - 2023 Custom Incentive Application"}]
[]
[null,null,"Rate 11 Delivery Bill Impact"]
[null,null,{"$f":"MID(CELL(\"filename\",A1),FIND(\"]\",CELL(\"filename\",A1))+1,255)","v":"G1.3 Rate 11 Bill Impact"}]
[]
[null,null,"Rate 11 - Large Seasonal Service Sample Dryer 1",null,"Units","Current Rate",null,"Proposed Rate"]
[]
[null,null,"Customer",null,"$/month",{"$f":"INDEX('B1.1 Current Distribution Rates'!$E$10:$Q$13,3,COUNTA($C10:C$10))","v":214.30653899999996},null,{"$f":"INDEX('E1.1 Proposed Dist Rates '!$E$10:$Q$13,3,COUNTA($C10:C$10))","v":218.65696174169994}]
{"$rows_left_out":83}
{"sheet":"G1.4 Rate 16 Bill Impact","index":16,"n_rows":53,"n_cols":12,"rows_kept":53,"cut":false,"hidden":false,"merged":[]}
[]
[null,null,{"$f":"'A1.1 Distributor Information'!C3","v":"Name of LDC:       EPCOR Natural Gas Limited Partnership"}]
[null,null,{"$f":"'A1.1 Distributor Information'!C4","v":"OEB Application Number:  EB-2022-0184  Exhibit A - 2023 Custom Incentive Application"}]
[]
[null,null,"Rate 16 Delivery Bill Impact"]
[null,null,{"$f":"MID(CELL(\"filename\",A1),FIND(\"]\",CELL(\"filename\",A1))+1,255)","v":"G1.4 Rate 16 Bill Impact"}]
[]
[null,null,"Rate 16 - Contracted Demand",null,"Units","Current Rate",null,"Proposed Rate"]
[]
[null,null,"Customer",null,"$/month",{"$f":"INDEX('B1.1 Current Distribution Rates'!$E$10:$Q$13,4,COUNTA($C$10:C10))","v":1575.7833749999998},null,{"$f":"INDEX('E1.1 Proposed Dist Rates '!$E$10:$Q$13,4,COUNTA($C$10:C10))","v":1607.7717775124997}]
{"$rows_left_out":44}
{"sheet":"G1.7 Summary of Bill Impacts","index":17,"n_rows":18,"n_cols":13,"rows_kept":18,"cut":false,"hidden":false,"merged":[]}
[]
[null,null,{"$f":"'A1.1 Distributor Information'!C3","v":"Name of LDC:       EPCOR Natural Gas Limited Partnership"}]
[null,null,{"$f":"'A1.1 Distributor Information'!C4","v":"OEB Application Number:  EB-2022-0184  Exhibit A - 2023 Custom Incentive Application"}]
[]
[null,null,"Summary of Bill Impacts"]
[]
[null,null,{"$f":"MID(CELL(\"filename\",A1),FIND(\"]\",CELL(\"filename\",A1))+1,255)","v":"G1.7 Summary of Bill Impacts"}]
[null,null,"Rate Class",null,"Fixed Change",{"$f":"OneDollar","v":"Bill 32 Rate"},"Volumetric Change","Rate Riders","Upstream Recovery \nCharge","Transportation & \nStorage Charge","Federal Carbon Charge Change","Total Change","Total Change %"]
[null,null,null,null,"($/year)","($/year)","($/year)","($/year)","($/year)","($/year)","($/year)","($/year)"]
[null,null,"Rate 1","Existing Residential",{"$f":"'G1.1 Rate 1 Bill Impact'!J31","v":6.3999561527999731},{"$f":"'G1.1 Rate 1 Bill Impact'!J32","v":0},{"$f":"SUM('G1.1 Rate 1 Bill Impact'!J33:J36)","v":12.150539803810545},{"$f":"'G1.1 Rate 1 Bill Impact'!J49","v":-6.6932983624304541},{"$f":"'G1.1 Rate 1 Bill Impact'!J38","v":0},{"$f":"'G1.1 Rate 1 Bill Impact'!J39","v":0},{"$f":"'G1.1 Rate 1 Bill Impact'!J40","v":0},{"$f":"SUM(E10:K10)","v":11.857197594180064},{"$f":"'G1.1 Rate 1 Bill Impact'!L51","v":6.092011376886107E-3}]
{"$rows_left_out":8}