{"text_format":"1","workbook":"xlsx","n_sheets":14,"sheets":["1. Info","2021 List","Sheet1","2. Table of Contents","3. RRR Data","4. UTRs and Sub-Transmission","5. Historical Wholesale","6. Current Wholesale","7. Forecast Wholesale","8. RTSR Rates to Forecast","RateClasses","DELETE 3. Rate Classes","2 1 5 TotalConsumptionData_Dist","hidden1"],"not_rendered":{"charts":0,"images":3,"macros":1,"external_links":8,"defined_names":139,"comments":0,"pivot_tables":0},"unopened":[],"bounds":{"document_bytes":16777216,"sheet_cells":100000,"rows_first":2000,"rows_last":500,"rows_between":2000,"halvings":0,"cell_chars":16384,"cell_head_chars":4096},"cells_cut":0,"cells_raw":0,"read":"whole","date_system":"1900"}

{"sheet":"1. Info","index":0,"n_rows":73,"n_cols":29,"rows_kept":73,"cut":false,"hidden":false,"merged":[[22,3,22,4],[18,3,18,4],[1,2,1,9],[2,2,2,9],[3,2,3,9],[4,2,4,9],[14,3,14,4]]}
[null,null,null,null,null,null,null,null,null,null,null,null,null,null,null,null,null,null,null,null,null,null,null,null,null,null,null,"Alectra Utilities Corporation-Brampton Rate Zone","2021 RTSR Workform \nfor Electricity Distributors\n"]
[null,null,null,null,null,null,null,null,null,null,null,null,null,null,null,null,null,null,null,null,null,null,null,null,null,null,null,"Alectra Utilities Corporation-Enersource Rate Zone","v 1.0\n"]
[null,null,null,null,null,null,null,null,null,null,null,null,null,null,null,null,null,null,null,null,null,null,null,null,null,null,null,"Alectra Utilities Corporation-Horizon Utilities Rate Zone"]
[null,null,null,null,null,null,null,null,null,null,null,null,null,null,null,null,null,null,null,null,null,null,null,null,null,null,null,"Alectra Utilities Corporation-PowerStream Rate Zone"]
[null,null,null,null,null,null,null,null,null,null,null,null,null,null,null,null,null,null,null,null,null,null,null,null,null,null,null,"Alectra Utilities Corporation-Guelph Rate Zone"]
[null,null,null,null,null,null,null,null,null,null,null,null,null,null,null,null,null,null,null,null,null,null,null,null,null,null,null,"Algoma Power Inc."]
[null,null,null,null,null,null,null,null,null,null,null,null,null,null,null,null,null,null,null,null,null,null,null,null,null,null,null,"Atikokan Hydro Inc."]
[null,null,null,null,null,null,null,null,null,null,null,null,null,null,null,null,null,null,null,null,null,null,null,null,null,null,null,"Bluewater Power Distribution Corporation"]
[null,null,null,null,null,null,null,null,null,null,null,null,null,null,null,null,null,null,null,null,null,null,null,null,null,null,null,"Brantford Power Inc."]
[null,null,null,null,null,null,null,null,null,null,null,null,null,null,null,null,null,null,null,null,null,null,null,null,null,null,null,"Burlington Hydro Inc."]
{"$rows_left_out":64}
{"sheet":"2021 List","index":1,"n_rows":73,"n_cols":2,"rows_kept":73,"cut":false,"hidden":true,"merged":[]}
["Alectra Utilities Corporation-Brampton Rate Zone","HHPNS717"]
["Alectra Utilities Corporation-Enersource Rate Zone","HHPNS717"]
["Alectra Utilities Corporation-Horizon Utilities Rate Zone","HHPNS717"]
["Alectra Utilities Corporation-PowerStream Rate Zone","HHPNS717"]
["Alectra Utilities Corporation-Guelph Rate Zone","HHPNS717"]
["Algoma Power Inc.","WKBSV849"]
["Atikokan Hydro Inc.","NJYBW716"]
["Bluewater Power Distribution Corporation","GQQHM388"]
["Brantford Power Inc.","SFXZP935"]
["Burlington Hydro Inc.","OARZC118"]
{"$rows_left_out":64}
{"sheet":"Sheet1","index":2,"n_rows":11,"n_cols":2,"rows_kept":11,"cut":false,"hidden":true,"merged":[]}
[]
[]
[]
[]
["2. Table of Contents","X"]
["3. RRR Data","X"]
["4. UTRs and Sub-Transmission","X"]
["5. Historical Wholesale","X"]
["6. Current Wholesale","X"]
["7. Forecast Wholesale","X"]
{"$rows_left_out":2}
{"sheet":"2. Table of Contents","index":3,"n_rows":26,"n_cols":9,"rows_kept":26,"cut":false,"hidden":false,"merged":[]}
[]
[]
[]
[]
[]
[]
[]
[]
[]
[]
{"$rows_left_out":17}
{"sheet":"3. RRR Data","index":4,"n_rows":26,"n_cols":52,"rows_kept":26,"cut":false,"hidden":false,"merged":[[12,1,12,8]]}
[null,null,null,null,null,null,null,null,null,null,null,null,null,null,null,null,null,null,null,null,null,null,null,null,null,null,null,null,null,null,null,null,null,null,null,null,null,null,null,null,null,null,null,null,null,null,null,null,null,null,null,1]
[]
[]
[]
[]
[]
[]
[]
[]
[]
{"$rows_left_out":17}
{"sheet":"4. UTRs and Sub-Transmission","index":5,"n_rows":76,"n_cols":12,"rows_kept":76,"cut":false,"hidden":false,"merged":[[29,7,29,9],[45,7,45,9],[51,7,51,9],[53,7,53,9],[36,7,36,9],[38,7,38,9],[40,7,40,9],[42,7,42,9],[34,7,34,9],[57,7,57,9],[49,7,49,9],[60,7,60,9],[64,7,64,9],[66,7,66,9],[55,7,55,9],[68,7,68,9],[70,7,70,9],[72,7,72,9],[74,7,74,9],[75,7,75,9]]}
[]
[]
[]
[]
[]
[]
[]
[]
[]
[]
{"$rows_left_out":67}
{"sheet":"5. Historical Wholesale","index":6,"n_rows":117,"n_cols":16,"rows_kept":117,"cut":false,"hidden":false,"merged":[[95,7,95,9],[95,11,95,13],[96,7,96,9],[96,11,96,13],[20,3,20,5],[20,7,20,9],[20,11,20,13],[96,3,96,5],[38,3,38,5],[38,7,38,9],[38,11,38,13],[95,3,95,5],[57,3,57,5],[57,7,57,9],[57,11,57,13],[76,3,76,5],[76,7,76,9],[76,11,76,13]]}
[]
[]
[]
[]
[]
[]
[]
[]
[]
[]
{"$rows_left_out":108}
{"sheet":"6. Current Wholesale","index":7,"n_rows":117,"n_cols":16,"rows_kept":117,"cut":false,"hidden":false,"merged":[[12,1,12,11],[19,3,19,5],[19,7,19,9],[19,11,19,13],[38,3,38,5],[38,7,38,9],[38,11,38,13],[96,7,96,9],[96,11,96,13],[20,3,20,5],[20,7,20,9],[20,11,20,13],[96,3,96,5],[95,3,95,5],[95,7,95,9],[95,11,95,13],[57,3,57,5],[57,7,57,9],[57,11,57,13],[76,3,76,5],[76,7,76,9],[76,11,76,13]]}
[]
[]
[]
[]
[]
[]
[]
[]
[]
[]
{"$rows_left_out":108}
{"sheet":"7. Forecast Wholesale","index":8,"n_rows":117,"n_cols":16,"rows_kept":117,"cut":false,"hidden":false,"merged":[[12,1,12,12],[19,3,19,5],[19,7,19,9],[19,11,19,13],[38,3,38,5],[38,7,38,9],[38,11,38,13],[96,7,96,9],[96,11,96,13],[20,3,20,5],[20,7,20,9],[20,11,20,13],[96,3,96,5],[95,3,95,5],[95,7,95,9],[95,11,95,13],[57,3,57,5],[57,7,57,9],[57,11,57,13],[76,3,76,5],[76,7,76,9],[76,11,76,13]]}
[]
[]
[]
[]
[]
[]
[]
[]
[]
[]
{"$rows_left_out":108}
{"sheet":"8. RTSR Rates to Forecast","index":9,"n_rows":48,"n_cols":10,"rows_kept":48,"cut":false,"hidden":false,"merged":[]}
[]
[]
[]
[]
[]
[]
[]
[]
[]
[]
{"$rows_left_out":39}
{"sheet":"RateClasses","index":10,"n_rows":76,"n_cols":28,"rows_kept":76,"cut":false,"hidden":true,"merged":[]}
[]
["Alectra Utilities Corporation-Brampton Rate Zone","RESIDENTIAL SERVICE CLASSIFICATION~Retail Transmission Rate - Network Service Rate","RESIDENTIAL SERVICE CLASSIFICATION~Retail Transmission Rate - Line and Transformation Connection Service Rate","GENERAL SERVICE LESS THAN 50 KW SERVICE CLASSIFICATION~Retail Transmission Rate - Network Service Rate","GENERAL SERVICE LESS THAN 50 KW SERVICE CLASSIFICATION~Retail Transmission Rate - Line and Transformation Connection Service Rate","GENERAL SERVICE 50 TO 699 KW SERVICE CLASSIFICATION~Retail Transmission Rate - Network Service Rate","GENERAL SERVICE 50 TO 699 KW SERVICE CLASSIFICATION~Retail Transmission Rate - Line and Transformation Connection Service Rate","GENERAL SERVICE 700 TO 4,999 KW SERVICE CLASSIFICATION~Retail Transmission Rate - Network Service Rate","GENERAL SERVICE 700 TO 4,999 KW SERVICE CLASSIFICATION~Retail Transmission Rate - Line and Transformation Connection Service Rate","LARGE USE SERVICE CLASSIFICATION~Retail Transmission Rate - Network Service Rate","LARGE USE SERVICE CLASSIFICATION~Retail Transmission Rate - Line and Transformation Connection Service Rate","UNMETERED SCATTERED LOAD SERVICE CLASSIFICATION~Retail Transmission Rate - Network Service Rate","UNMETERED SCATTERED LOAD SERVICE CLASSIFICATION~Retail Transmission Rate - Line and Transformation Connection Service Rate","STREET LIGHTING SERVICE CLASSIFICATION~Retail Transmission Rate - Network Service Rate","STREET LIGHTING SERVICE CLASSIFICATION~Retail Transmission Rate - Line and Transformation Connection Service Rate","EMBEDDED DISTRIBUTOR SERVICE CLASSIFICATION~Retail Transmission Rate - Network Service Rate","EMBEDDED DISTRIBUTOR SERVICE CLASSIFICATION~Retail Transmission Rate - Line and Transformation Connection Service Rate","DISTRIBUTED GENERATION [DGEN] SERVICE CLASSIFICATION~Retail Transmission Rate - Network Service Rate","DISTRIBUTED GENERATION [DGEN] SERVICE CLASSIFICATION~Retail Transmission Rate - Line and Transformation Connection Service Rate"]
["Alectra Utilities Corporation-Enersource Rate Zone","RESIDENTIAL SERVICE CLASSIFICATION~Retail Transmission Rate - Network Service Rate","RESIDENTIAL SERVICE CLASSIFICATION~Retail Transmission Rate - Line and Transformation Connection Service Rate","GENERAL SERVICE LESS THAN 50 KW SERVICE CLASSIFICATION~Retail Transmission Rate - Network Service Rate","GENERAL SERVICE LESS THAN 50 KW SERVICE CLASSIFICATION~Retail Transmission Rate - Line and Transformation Connection Service Rate","GENERAL SERVICE 50 TO 499 KW SERVICE CLASSIFICATION~Retail Transmission Rate - Network Service Rate","GENERAL SERVICE 50 TO 499 KW SERVICE CLASSIFICATION~Retail Transmission Rate - Line and Transformation Connection Service Rate","GENERAL SERVICE 500 TO 4,999 KW SERVICE CLASSIFICATION~Retail Transmission Rate - Network Service Rate ","GENERAL SERVICE 500 TO 4,999 KW SERVICE CLASSIFICATION~Retail Transmission Rate - Line and Transformation Connection Service Rate ","LARGE USE SERVICE CLASSIFICATION~Retail Transmission Rate - Network Service Rate – Interval Metered","LARGE USE SERVICE CLASSIFICATION~Retail Transmission Rate - Line and Transformation Connection Service Rate – Interval Metered ","UNMETERED SCATTERED LOAD SERVICE CLASSIFICATION~Retail Transmission Rate - Network Service Rate","UNMETERED SCATTERED LOAD SERVICE CLASSIFICATION~Retail Transmission Rate - Line and Transformation Connection Service Rate","STREET LIGHTING SERVICE CLASSIFICATION~Retail Transmission Rate - Network Service Rate","STREET LIGHTING SERVICE CLASSIFICATION~Retail Transmission Rate - Line and Transformation Connection Service Rate"]
["Alectra Utilities Corporation-Horizon Utilities Rate Zone","RESIDENTIAL SERVICE CLASSIFICATION~Retail Transmission Rate - Network Service Rate","RESIDENTIAL SERVICE CLASSIFICATION~Retail Transmission Rate - Line and Transformation Connection Service Rate","GENERAL SERVICE LESS THAN 50 KW SERVICE CLASSIFICATION~Retail Transmission Rate - Network Service Rate","GENERAL SERVICE LESS THAN 50 KW SERVICE CLASSIFICATION~Retail Transmission Rate - Line and Transformation Connection Service Rate","GENERAL SERVICE 50 to 4,999 kW SERVICE CLASSIFICATION~Retail Transmission Rate - Network Service Rate","GENERAL SERVICE 50 to 4,999 kW SERVICE CLASSIFICATION~Retail Transmission Rate - Line and Transformation Connection Service Rate","LARGE USE SERVICE CLASSIFICATION~Retail Transmission Rate - Network Service Rate","LARGE USE SERVICE CLASSIFICATION~Retail Transmission Rate - Line and Transformation Connection Service Rate","LARGE USE WITH DEDICATED ASSETS SERVICE CLASSIFICATION~Retail Transmission Rate - Network Service Rate","LARGE USE WITH DEDICATED ASSETS SERVICE CLASSIFICATION~Retail Transmission Rate - Line and Transformation Connection Service Rate","UNMETERED SCATTERED LOAD SERVICE CLASSIFICATION~Retail Transmission Rate - Network Service Rate","UNMETERED SCATTERED LOAD SERVICE CLASSIFICATION~Retail Transmission Rate - Line and Transformation Connection Service Rate","SENTINEL LIGHTING SERVICE CLASSIFICATION~Retail Transmission Rate - Network Service Rate","SENTINEL LIGHTING SERVICE CLASSIFICATION~Retail Transmission Rate - Line and Transformation Connection Service Rate","STREET LIGHTING SERVICE CLASSIFICATION~Retail Transmission Rate - Network Service Rate","STREET LIGHTING SERVICE CLASSIFICATION~Retail Transmission Rate - Line and Transformation Connection Service Rate"]
["Alectra Utilities Corporation-PowerStream Rate Zone","RESIDENTIAL SERVICE CLASSIFICATION~Retail Transmission Rate - Network Service Rate","RESIDENTIAL SERVICE CLASSIFICATION~Retail Transmission Rate - Line and Transformation Connection Service Rate","GENERAL SERVICE LESS THAN 50 KW SERVICE CLASSIFICATION~Retail Transmission Rate - Network Service Rate","GENERAL SERVICE LESS THAN 50 KW SERVICE CLASSIFICATION~Retail Transmission Rate - Line and Transformation Connection Service Rate","GENERAL SERVICE 50 to 4,999 kW SERVICE CLASSIFICATION~Retail Transmission Rate - Network Service Rate","GENERAL SERVICE 50 to 4,999 kW SERVICE CLASSIFICATION~Retail Transmission Rate - Line and Transformation Connection Service Rate","GENERAL SERVICE 50 to 4,999 kW SERVICE CLASSIFICATION~Retail Transmission Rate - Network Service Rate – Interval Metered","GENERAL SERVICE 50 to 4,999 kW SERVICE CLASSIFICATION~Retail Transmission Rate - Line and Transformation Connection Service Rate – Interval Metered","LARGE USE SERVICE CLASSIFICATION~Retail Transmission Rate - Network Service Rate","LARGE USE SERVICE CLASSIFICATION~Retail Transmission Rate - Line and Transformation Connection Service Rate","UNMETERED SCATTERED LOAD SERVICE CLASSIFICATION~Retail Transmission Rate - Network Service Rate","UNMETERED SCATTERED LOAD SERVICE CLASSIFICATION~Retail Transmission Rate - Line and Transformation Connection Service Rate","SENTINEL LIGHTING SERVICE CLASSIFICATION~Retail Transmission Rate - Network Service Rate","SENTINEL LIGHTING SERVICE CLASSIFICATION~Retail Transmission Rate - Line and Transformation Connection Service Rate","STREET LIGHTING SERVICE CLASSIFICATION~Retail Transmission Rate - Network Service Rate","STREET LIGHTING SERVICE CLASSIFICATION~Retail Transmission Rate - Line and Transformation Connection Service Rate"]
["Algoma Power Inc.","RESIDENTIAL R1 SERVICE CLASSIFICATION~Retail Transmission Rate - Network Service Rate","RESIDENTIAL R1 SERVICE CLASSIFICATION~Retail Transmission Rate - Line and Transformation Connection Service Rate","RESIDENTIAL R2 SERVICE CLASSIFICATION~Retail Transmission Rate - Network Service Rate","RESIDENTIAL R2 SERVICE CLASSIFICATION~Retail Transmission Rate - Line and Transformation Connection Service Rate","SEASONAL CUSTOMERS SERVICE CLASSIFICATION~Retail Transmission Rate - Network Service Rate","SEASONAL CUSTOMERS SERVICE CLASSIFICATION~Retail Transmission Rate - Line and Transformation Connection Service Rate","STREET LIGHTING SERVICE CLASSIFICATION~Retail Transmission Rate - Network Service Rate","STREET LIGHTING SERVICE CLASSIFICATION~Retail Transmission Rate - Line and Transformation Connection Service Rate"]
["Centre Wellington Hydro Ltd.","RESIDENTIAL SERVICE CLASSIFICATION~Retail Transmission Rate - Network Service Rate","RESIDENTIAL SERVICE CLASSIFICATION~Retail Transmission Rate - Line and Transformation Connection Service Rate","GENERAL SERVICE LESS THAN 50 KW SERVICE CLASSIFICATION~Retail Transmission Rate - Network Service Rate","GENERAL SERVICE LESS THAN 50 KW SERVICE CLASSIFICATION~Retail Transmission Rate - Line and Transformation Connection Service Rate","GENERAL SERVICE 50 TO 2,999 KW SERVICE CLASSIFICATION~Retail Transmission Rate - Network Service Rate","GENERAL SERVICE 50 TO 2,999 KW SERVICE CLASSIFICATION~Retail Transmission Rate - Line and Transformation Connection Service Rate","GENERAL SERVICE 3,000 TO 4,999 KW SERVICE CLASSIFICATION~Retail Transmission Rate - Network Service Rate","GENERAL SERVICE 3,000 TO 4,999 KW SERVICE CLASSIFICATION~Retail Transmission Rate - Line and Transformation Connection Service Rate","UNMETERED SCATTERED LOAD SERVICE CLASSIFICATION~Retail Transmission Rate - Network Service Rate","UNMETERED SCATTERED LOAD SERVICE CLASSIFICATION~Retail Transmission Rate - Line and Transformation Connection Service Rate","SENTINEL LIGHTING SERVICE CLASSIFICATION~Retail Transmission Rate - Network Service Rate","SENTINEL LIGHTING SERVICE CLASSIFICATION~Retail Transmission Rate - Line and Transformation Connection Service Rate","STREET LIGHTING SERVICE CLASSIFICATION~Retail Transmission Rate - Network Service Rate","STREET LIGHTING SERVICE CLASSIFICATION~Retail Transmission Rate - Line and Transformation Connection Service Rate"]
["Canadian Niagara Power Inc.","RESIDENTIAL SERVICE CLASSIFICATION~Retail Transmission Rate - Network Service Rate","RESIDENTIAL SERVICE CLASSIFICATION~Retail Transmission Rate - Line and Transformation Connection Service Rate","GENERAL SERVICE LESS THAN 50 KW SERVICE CLASSIFICATION~Retail Transmission Rate - Network Service Rate","GENERAL SERVICE LESS THAN 50 KW SERVICE CLASSIFICATION~Retail Transmission Rate - Line and Transformation Connection Service Rate","GENERAL SERVICE 50 to 4,999 kW SERVICE CLASSIFICATION~Retail Transmission Rate - Network Service Rate","GENERAL SERVICE 50 to 4,999 kW SERVICE CLASSIFICATION~Retail Transmission Rate - Line and Transformation Connection Service Rate","EMBEDDED DISTRIBUTOR SERVICE CLASSIFICATION~Retail Transmission Rate - Network Service Rate","EMBEDDED DISTRIBUTOR SERVICE CLASSIFICATION~Retail Transmission Rate - Line and Transformation Connection Service Rate","UNMETERED SCATTERED LOAD SERVICE CLASSIFICATION~Retail Transmission Rate - Network Service Rate","UNMETERED SCATTERED LOAD SERVICE CLASSIFICATION~Retail Transmission Rate - Line and Transformation Connection Service Rate","SENTINEL LIGHTING SERVICE CLASSIFICATION~Retail Transmission Rate - Network Service Rate","SENTINEL LIGHTING SERVICE CLASSIFICATION~Retail Transmission Rate - Line and Transformation Connection Service Rate","STREET LIGHTING SERVICE CLASSIFICATION~Retail Transmission Rate - Network Service Rate","STREET LIGHTING SERVICE CLASSIFICATION~Retail Transmission Rate - Line and Transformation Connection Service Rate"]
["Entegrus Powerlines Inc.","RESIDENTIAL SERVICE CLASSIFICATION~Retail Transmission Rate - Network Service Rate","RESIDENTIAL SERVICE CLASSIFICATION~Retail Transmission Rate - Line and Transformation Connection Service Rate","GENERAL SERVICE LESS THAN 50 KW SERVICE CLASSIFICATION~Retail Transmission Rate - Network Service Rate","GENERAL SERVICE LESS THAN 50 KW SERVICE CLASSIFICATION~Retail Transmission Rate - Line and Transformation Connection Service Rate","GENERAL SERVICE 50 to 4,999 kW SERVICE CLASSIFICATION~Retail Transmission Rate - Network Service Rate","GENERAL SERVICE 50 to 4,999 kW SERVICE CLASSIFICATION~Retail Transmission Rate - Line and Transformation Connection Service Rate (see Note 1)","LARGE USE SERVICE CLASSIFICATION~Retail Transmission Rate - Network Service Rate","LARGE USE SERVICE CLASSIFICATION~Retail Transmission Rate - Line and Transformation Connection Service Rate (see Note 1)","UNMETERED SCATTERED LOAD SERVICE CLASSIFICATION~Retail Transmission Rate - Network Service Rate","UNMETERED SCATTERED LOAD SERVICE CLASSIFICATION~Retail Transmission Rate - Line and Transformation Connection Service Rate","SENTINEL LIGHTING SERVICE CLASSIFICATION~Retail Transmission Rate - Network Service Rate","SENTINEL LIGHTING SERVICE CLASSIFICATION~Retail Transmission Rate - Line and Transformation Connection Service Rate","STREET LIGHTING SERVICE CLASSIFICATION~Retail Transmission Rate - Network Service Rate","STREET LIGHTING SERVICE CLASSIFICATION~Retail Transmission Rate - Line and Transformation Connection Service Rate","EMBEDDED DISTRIBUTOR SERVICE CLASSIFICATION~Retail Transmission Rate - Network Service Rate","EMBEDDED DISTRIBUTOR SERVICE CLASSIFICATION~Retail Transmission Rate - Line and Transformation Connection Service Rate"]
["Entegrus Powerlines Inc.-For Former St. Thomas Energy Rate Zone","RESIDENTIAL SERVICE CLASSIFICATION~Retail Transmission Rate - Network Service Rate","RESIDENTIAL SERVICE CLASSIFICATION~Retail Transmission Rate - Line and Transformation Connection Service Rate","GENERAL SERVICE LESS THAN 50 KW SERVICE CLASSIFICATION~Retail Transmission Rate - Network Service Rate","GENERAL SERVICE LESS THAN 50 KW SERVICE CLASSIFICATION~Retail Transmission Rate - Line and Transformation Connection Service Rate","GENERAL SERVICE 50 to 4,999 kW SERVICE CLASSIFICATION~Retail Transmission Rate - Network Service Rate","GENERAL SERVICE 50 to 4,999 kW SERVICE CLASSIFICATION~Retail Transmission Rate - Line and Transformation Connection Service Rate","SENTINEL LIGHTING SERVICE CLASSIFICATION~Retail Transmission Rate - Network Service Rate","SENTINEL LIGHTING SERVICE CLASSIFICATION~Retail Transmission Rate - Line and Transformation Connection Service Rate","STREET LIGHTING SERVICE CLASSIFICATION~Retail Transmission Rate - Network Service Rate","STREET LIGHTING SERVICE CLASSIFICATION~Retail Transmission Rate - Line and Transformation Connection Service Rate"]
{"$rows_left_out":67}
{"sheet":"DELETE 3. Rate Classes","index":11,"n_rows":100,"n_cols":23,"rows_kept":100,"cut":false,"hidden":true,"merged":[[12,2,12,8]]}
[]
[]
[]
[]
[]
[]
[]
[]
[]
[]
{"$rows_left_out":91}
{"sheet":"2 1 5 TotalConsumptionData_Dist","index":12,"n_rows":557,"n_cols":20,"rows_kept":557,"cut":false,"hidden":true,"merged":[[0,0,0,3],[1,0,1,3]]}
["2.1.5 TotalConsumptionData_Dist_Ret_Total_Combined_2020_v2 (REVIEW)"]
["Time run: 5/27/2021 3:15:18 PM"]
[""]
["Filing_Year","Company_Name","Rate_Class","Rate_Class_Detail","Company_DetailClass",null,"Ret_Metered_consumption_in_kWhs","Ret_Metered_consumption_in_kWs","Dist_RPPMeterCustkWh","Dist_RPPMeterCustkW","Dist_NonRPPMeterCustkWh","Dist_NonRPPMeterCustkW","IESOMeterCustkWh","IESOMeterCustKW","Class_A_Consumption_kWhs","Class_A_Consumption_kWs","TotConsmptionforDistCustkWh","TotConsmptionforDistCustkW","Calculated_TOTAL_KWH","Calculated_TOTAL_KW"]
["2021","1937680 ONTARIO INC.","GENERAL SERVICE EQUAL TO OR GREATER THAN 50 KW","GENERAL SERVICE 50 TO 4,999 KW","1937680 ONTARIO INC._GENERAL SERVICE 50 TO 4,999 KW SERVICE CLASSIFICATION","1937680 ONTARIO INC._GENERAL SERVICE 50 TO 4,999 KW SERVICE CLASSIFICATION",57388830,133781,50350402,127116,198785078,482951,0,5278,0,0,249135480,615345,306524310,749126]
["2021","1937680 ONTARIO INC.","GENERAL SERVICE LESS THAN 50 KW","GENERAL SERVICE LESS THAN 50 KW","1937680 ONTARIO INC._GENERAL SERVICE LESS THAN 50 KW SERVICE CLASSIFICATION","1937680 ONTARIO INC._GENERAL SERVICE LESS THAN 50 KW SERVICE CLASSIFICATION",14023767,0,87375637,0,118150,0,0,0,0,0,87493787,0,101517554,0]
["2021","1937680 ONTARIO INC.","LARGE USER","LARGE USE","1937680 ONTARIO INC._LARGE USE SERVICE CLASSIFICATION","1937680 ONTARIO INC._LARGE USE SERVICE CLASSIFICATION",30021547,56369,0,0,3874166,8703,0,0,0,0,3874166,8703,33895713,65072]
["2021","1937680 ONTARIO INC.","NO RATE CLASS","NO RATE CLASS","1937680 ONTARIO INC._NO RATE CLASS SERVICE CLASSIFICATION","1937680 ONTARIO INC._NO RATE CLASS SERVICE CLASSIFICATION",0,0,0,0,0,0,0,0,115957904,242416,0,0,0,0]
["2021","1937680 ONTARIO INC.","RESIDENTIAL","RESIDENTIAL","1937680 ONTARIO INC._RESIDENTIAL SERVICE CLASSIFICATION","1937680 ONTARIO INC._RESIDENTIAL SERVICE CLASSIFICATION",4187154,0,299617565,0,0,0,0,0,0,0,299617565,0,303804719,0]
["2021","1937680 ONTARIO INC.","SENTINEL LIGHTING CONNECTIONS","SENTINEL LIGHTING","1937680 ONTARIO INC._SENTINEL LIGHTING SERVICE CLASSIFICATION","1937680 ONTARIO INC._SENTINEL LIGHTING SERVICE CLASSIFICATION",194157,505,336163,895,0,0,0,0,0,0,336163,895,530320,1400]
{"$rows_left_out":548}
{"sheet":"hidden1","index":13,"n_rows":22,"n_cols":2,"rows_kept":22,"cut":false,"hidden":true,"merged":[]}
[{"$f":"IF('DELETE 3. Rate Classes'!L17=1, 'DELETE 3. Rate Classes'!#REF!, \"\")","v":""},1]
[{"$f":"IF('DELETE 3. Rate Classes'!L18=1, 'DELETE 3. Rate Classes'!#REF!, \"\")","v":""},2]
[{"$f":"IF('DELETE 3. Rate Classes'!L19=1, 'DELETE 3. Rate Classes'!#REF!, \"\")","v":""},3]
[{"$f":"IF('DELETE 3. Rate Classes'!L20=1, 'DELETE 3. Rate Classes'!#REF!, \"\")","v":""},4]
[{"$f":"IF('DELETE 3. Rate Classes'!L21=1, 'DELETE 3. Rate Classes'!#REF!, \"\")","v":""},5]
[{"$f":"IF('DELETE 3. Rate Classes'!L22=1, 'DELETE 3. Rate Classes'!#REF!, \"\")","v":""},6]
[{"$f":"IF('DELETE 3. Rate Classes'!L23=1, 'DELETE 3. Rate Classes'!#REF!, \"\")","v":""},7]
[{"$f":"IF('DELETE 3. Rate Classes'!L24=1, 'DELETE 3. Rate Classes'!#REF!, \"\")","v":""},8]
[{"$f":"IF('DELETE 3. Rate Classes'!L25=1, 'DELETE 3. Rate Classes'!#REF!, \"\")","v":""},9]
[{"$f":"IF('DELETE 3. Rate Classes'!L26=1, 'DELETE 3. Rate Classes'!#REF!, \"\")","v":""},10]
{"$rows_left_out":12}