{"text_format":"1","workbook":"xlsx","n_sheets":21,"sheets":["1. Info and Instructions","Table of Contents","S. Summary ","S1. Integrity Checks","A. Data Input Sheet","B. Tax Rates & Exemptions","H0 PILs,Tax Provision Hist","H1 Sch 1 Taxable Income Hist","H4 Sch 4 Loss Cfwd Hist","H8 Sch 8 CCA Hist","H13 Sch 13 Reserves Hist","B0 PILs,Tax Provision Bridge","B1 Sch 1 Taxable Income Bridge","B4 Sch 4 Loss Cfwd Bridge","B8 Sch 8 CCA Bridge","B13 Sch 13 Reserves Bridge","T0 PILs,Tax Provision Test","T1 Sch 1 Taxable Income Test","T4 Sch 4 Loss Cfwd Test","T8 Sch 8 CCA Test","T13 Sch 13 Reserves Test"],"not_rendered":{"charts":0,"images":2,"macros":0,"external_links":0,"defined_names":53,"comments":2,"pivot_tables":0},"unopened":[],"bounds":{"document_bytes":16777216,"sheet_cells":100000,"rows_first":2000,"rows_last":500,"rows_between":2000,"halvings":0,"cell_chars":16384,"cell_head_chars":4096},"cells_cut":0,"cells_raw":0,"read":"whole","date_system":"1900"}

{"sheet":"1. Info and Instructions","index":0,"n_rows":73,"n_cols":28,"rows_kept":73,"cut":false,"hidden":false,"merged":[[21,3,21,4],[17,3,17,4],[13,3,13,4]]}
[null,null,null,null,null,null,null,null,null,null,null,null,null,null,null,null,null,null,null,null,null,null,null,null,null,null,null,"Alectra Utilities Corporation-Brampton Rate Zone"]
[null,null,null,null,null,null,null,null,null,null,null,null,null,null,null,null,null,null,null,null,null,null,null,null,null,null,null,"Alectra Utilities Corporation-Enersource Rate Zone"]
[null,null,null,null,null,null,null,null,null,null,null,null,null,null,null,null,null,null,null,null,null,null,null,null,null,null,null,"Alectra Utilities Corporation-Horizon Utilities Rate Zone"]
[null,null,null,null,null,null,null,null,null,null,null,null,null,null,null,null,null,null,null,null,null,null,null,null,null,null,null,"Alectra Utilities Corporation-PowerStream Rate Zone"]
[null,null,null,null,null,null,null,null,null,null,null,null,null,null,null,null,null,null,null,null,null,null,null,null,null,null,null,"Alectra Utilities Corporation-Guelph Rate Zone"]
[null,null,null,null,null,null,null,null,null,null,null,null,null,null,null,null,null,null,null,null,null,null,null,null,null,null,null,"Algoma Power Inc."]
[null,null,null,null,null,null,null,null,null,null,null,null,null,null,null,null,null,null,null,null,null,null,null,null,null,null,null,"Atikokan Hydro Inc."]
[null,null,null,null,null,null,null,null,null,null,null,null,null,null,null,null,null,null,null,null,null,null,null,null,null,null,null,"Bluewater Power Distribution Corporation"]
[null,null,null,null,null,null,null,null,null,null,null,null,null,null,null,null,null,null,null,null,null,null,null,null,null,null,null,"Brantford Power Inc."]
[null,null,null,null,null,null,null,null,null,null,null,null,null,null,null,null,null,null,null,null,null,null,null,null,null,null,null,"Burlington Hydro Inc."]
{"$rows_left_out":64}
{"sheet":"Table of Contents","index":1,"n_rows":32,"n_cols":27,"rows_kept":32,"cut":false,"hidden":false,"merged":[[81,0,88,6],[0,2,0,4],[1,3,1,6],[3,3,3,4],[8,2,8,4]]}
[null,null,null,null,null,null,null,null,null,null,null,null,null,null,null,null,null,null,null,null,null,null,null,null,null,null,1]
[null,null,null,null,null,null,null,null,null,null,null,null,null,null,null,null,null,null,null,null,null,null,null,null,null,null,2012]
[null,null,null,null,null,null,null,null,null,null,null,null,null,null,null,null,null,null,null,null,null,null,null,null,null,null,2013]
[null,null,null,null,null,null,null,null,null,null,null,null,null,null,null,null,null,null,null,null,null,null,null,null,null,null,2014]
[null,null,null,null,null,null,null,null,null,null,null,null,null,null,null,null,null,null,null,null,null,null,null,null,null,null,2015]
[null,null,null,null,null,null,null,null,null,null,null,null,null,null,null,null,null,null,null,null,null,null,null,null,null,null,2016]
[]
[]
[]
[null,null,null,"1. Info"]
{"$rows_left_out":23}
{"sheet":"S. Summary ","index":2,"n_rows":25,"n_cols":9,"rows_kept":25,"cut":false,"hidden":false,"merged":[[0,2,0,6],[1,2,1,10],[2,2,2,10],[3,2,3,10]]}
[]
[]
[]
[]
[]
[]
[null,"No inputs required on this worksheet."]
[]
[null,null,null,"Inputs on Service Revenue Requirement Worksheet"]
[null,null,null,"The Service Revenue Requirement is in the 'Revenue Requirement Workform' - Tab 3."]
{"$rows_left_out":16}
{"sheet":"S1. Integrity Checks","index":3,"n_rows":24,"n_cols":4,"rows_kept":24,"cut":false,"hidden":false,"merged":[[12,0,12,3]]}
[]
[]
[]
[]
[]
[]
[]
[]
[]
[]
{"$rows_left_out":15}
{"sheet":"A. Data Input Sheet","index":4,"n_rows":41,"n_cols":9,"rows_kept":41,"cut":false,"hidden":false,"merged":[[25,2,25,4],[27,2,27,4],[0,2,0,4],[1,2,1,8],[2,2,2,8],[3,2,3,8],[37,2,37,4],[40,2,40,4],[29,2,29,4],[31,2,31,4],[33,2,33,4],[35,2,35,4]]}
[]
[]
[]
[]
[]
[]
[null,null,null,null,null,null,"Test Year","Bridge Year"]
[]
[null,null,"Rate Base",null,null,"S",76786731.354180336,69800449.869997784]
[]
{"$rows_left_out":32}
{"sheet":"B. Tax Rates & Exemptions","index":5,"n_rows":39,"n_cols":11,"rows_kept":39,"cut":false,"hidden":false,"merged":[[0,2,0,3],[1,2,1,3],[2,2,2,3],[3,2,3,3]]}
[]
[]
[]
[]
[]
[]
[]
[]
[null,null,"Tax Rates"]
[null,null,"Federal & Provincial",null,"Effective","Effective","Effective","Effective","Effective","Effective","Effective"]
{"$rows_left_out":30}
{"sheet":"H0 PILs,Tax Provision Hist","index":6,"n_rows":34,"n_cols":10,"rows_kept":34,"cut":false,"hidden":false,"merged":[[42,2,42,5],[0,2,0,6],[1,2,1,11],[2,2,2,11],[3,2,3,11],[38,2,38,5],[7,2,7,5]]}
[]
[]
[]
[]
[]
[null,null,"PILs Tax Provision - Historical Year"]
[]
[null,null,"Note: Input the actual information from the tax returns for the historical year. ",null,null,null,null,null,"Wires Only"]
[]
[null,null,"Regulatory Taxable Income",null,null,null,null,"H1",{"$f":"'H1 Sch 1 Taxable Income Hist'!G115","v":808207.24000000209},"A"]
{"$rows_left_out":25}
{"sheet":"H1 Sch 1 Taxable Income Hist","index":7,"n_rows":115,"n_cols":8,"rows_kept":115,"cut":false,"hidden":false,"merged":[[46,2,46,6],[107,2,107,6],[0,2,0,4],[1,2,1,8],[2,2,2,8],[3,2,3,8],[12,2,12,6],[83,2,83,6],[70,2,70,6]]}
[]
[]
[]
[]
[]
[]
[]
[null,null,"Adjusted Taxable Income - Historical Year"]
[]
[]
{"$rows_left_out":106}
{"sheet":"H4 Sch 4 Loss Cfwd Hist","index":8,"n_rows":17,"n_cols":9,"rows_kept":17,"cut":false,"hidden":false,"merged":[[15,2,15,4],[16,2,16,4],[12,2,12,4],[13,2,13,4],[0,2,0,4],[1,2,1,8],[2,2,2,8],[3,2,3,8]]}
[]
[]
[]
[]
[]
[]
[]
[]
[null,null,"Schedule 4 Loss Carry Forward - Historical"]
[]
{"$rows_left_out":8}
{"sheet":"H8 Sch 8 CCA Hist","index":9,"n_rows":45,"n_cols":8,"rows_kept":45,"cut":false,"hidden":false,"merged":[[46,2,46,6],[9,2,9,6],[0,2,0,4],[1,2,1,8],[2,2,2,8],[3,2,3,8]]}
[]
[]
[]
[]
[]
[null,null,"Schedule 8 - Historical Year"]
[]
[]
[]
[]
{"$rows_left_out":36}
{"sheet":"H13 Sch 13 Reserves Hist","index":10,"n_rows":51,"n_cols":7,"rows_kept":51,"cut":false,"hidden":false,"merged":[[15,2,15,5],[28,2,28,5],[0,2,0,4],[1,2,1,8],[2,2,2,8],[3,2,3,8]]}
[]
[]
[]
[]
[]
[]
[]
[null,null,"Schedule 13 Tax Reserves - Historical"]
[]
[null,null,"Continuity of Reserves"]
{"$rows_left_out":42}
{"sheet":"B0 PILs,Tax Provision Bridge","index":11,"n_rows":30,"n_cols":11,"rows_kept":30,"cut":false,"hidden":false,"merged":[[33,2,33,5],[0,2,0,6],[1,2,1,12],[2,2,2,12],[3,2,3,12],[29,2,29,5]]}
[]
[]
[]
[]
[]
[null,"PILS Tax Provision - Bridge Year"]
[]
[null,null,null,null,null,null,null,null,null,"Wires Only"]
[null,null,null,null,null,null,null,null,"Reference"]
[null,null,"Regulatory Taxable Income",null,null,null,null,null,"B1",{"$f":"'B1 Sch 1 Taxable Income Bridge'!F111","v":5633300.4150008857},"A"]
{"$rows_left_out":21}
{"sheet":"B1 Sch 1 Taxable Income Bridge","index":12,"n_rows":111,"n_cols":6,"rows_kept":111,"cut":false,"hidden":false,"merged":[[67,2,67,5],[44,2,44,5],[109,2,109,5],[8,2,8,5],[0,2,0,5],[1,2,1,9],[2,2,2,9],[3,2,3,9],[9,2,9,5]]}
[]
[]
[]
[]
[null,"Adjusted Taxable Income - Bridge Year"]
[]
[null,null,null,"T2S1 line #","Working Paper Reference","Total for Regulated Utility"]
[null,null,"Income before PILs/Taxes","(A + 101 + 102)",null,3558240.25]
[]
[null,null,"Additions:"]
{"$rows_left_out":102}
{"sheet":"B4 Sch 4 Loss Cfwd Bridge","index":13,"n_rows":23,"n_cols":8,"rows_kept":23,"cut":false,"hidden":false,"merged":[[21,2,21,4],[14,2,14,4],[20,2,20,4],[18,2,18,4],[0,2,0,4],[13,2,13,4],[17,2,17,4],[10,2,10,4],[11,2,11,4],[1,2,1,9],[2,2,2,9],[3,2,3,9],[11,9,11,11],[13,9,13,11]]}
[]
[]
[]
[]
[]
[]
[null,null,"Corporation Loss Continuity and Application"]
[]
[null,null,"Schedule 4 Loss Carry Forward - Bridge Year"]
[]
{"$rows_left_out":14}
{"sheet":"B8 Sch 8 CCA Bridge","index":14,"n_rows":46,"n_cols":24,"rows_kept":46,"cut":false,"hidden":false,"merged":[[47,2,47,23],[48,2,48,23],[44,1,44,23],[45,1,45,23],[0,1,0,4],[1,1,1,16],[2,1,2,16],[3,1,3,16],[46,2,46,23]]}
[]
[]
[]
[]
[]
[]
[null,"Schedule 8 CCA - Bridge Year"]
[]
[null,"(1)\nClass","Class Description","Working Paper Reference","(2)\nUndepreciated capital\ncost (UCC) at the\nbeginning of the bridge year","(3)\nCost of acquisitions during\nthe year (new property must\nbe available for use, except CWIP)","(4)\nCost of acquisitions from column 3 that are accelerated investment incentive property (AIIP)","(5)\nAdjustments and transfers (enter amounts that will reduce the UCC as negatives)","(6)\nAmount from column 5 that is assistance received or receivable during the year for a property, subsequent to its disposition","(7)\nAmount from column 5 that is repaid during the year for a property, subsequent to its disposition","(8)\nProceeds of dispositions","(9)\nUCC (column 2 plus column 3 plus or minus column 5 minus column 8)","(10)\nProceeds of disposition available to reduce the UCC of AIIP (column 8 plus column 6 minus column 3 plus column 4 minus column 7) (if negative, enter \"0\")","(11)\nNet capital cost additions of AIIP acquired during the year (column 4 minus column 10) (if negative, enter \"0\")","Relevant factor","(12)\nUCC adjustment for AIIP acquired during the year (column 11 multiplied by the relevant factor)","(13)\nUCC adjustment for non-AIIP acquired during the year (0.5 multiplied by the result of column 3 minus column 4 minus column 6 plus column 7 minus column 8) (if negative, enter \"0\")","(14)\nCCA Rate %","(15)\nRecapture of CCA","(16)\nTerminal Loss","(17)\nCCA (for declining balance method, the result of column 9 plus column 12 minus column 13, multiplied by column 14)",null,"(18)\nUCC at the end of the bridge year (column 9 minus column 17)","Working Paper Reference"]
[null,{"$f":"IF(ISBLANK('H8 Sch 8 CCA Hist'!C12), \"\", 'H8 Sch 8 CCA Hist'!C12)","v":1},{"$f":"IF(ISBLANK('H8 Sch 8 CCA Hist'!D12), \"\", 'H8 Sch 8 CCA Hist'!D12)","v":"Buildings, Distribution System (acq'd post 1987)"},"H8",{"$f":"IF(ISBLANK('H8 Sch 8 CCA Hist'!E12),0, 'H8 Sch 8 CCA Hist'!G12)","v":18024111},null,null,null,null,null,null,{"$f":"IFERROR(E10+F10+H10-K10,0)","v":18024111},{"$f":"IF((K10+I10-F10+G10-J10)<0,0,(K10+I10-F10+G10-J10))","v":0},{"$f":"IF((G10-M10)<0,0,(G10-M10))","v":0},0.5,{"$f":"N10*O10","v":0},{"$f":"IF((0.5*(F10-G10-I10+J10-K10))<0,0,(0.5*(F10-G10-I10+J10-K10)))","v":0},0.04,null,null,{"$f":"IF(OR(L10<0,T10>0),0,(L10+P10-Q10)*R10)","v":720964.44000000006},null,{"$f":"IF(L10<0,0,L10-T10-U10)","v":17303146.559999999},"T8"]
{"$rows_left_out":37}
{"sheet":"B13 Sch 13 Reserves Bridge","index":15,"n_rows":44,"n_cols":14,"rows_kept":44,"cut":false,"hidden":false,"merged":[[23,2,23,13],[9,8,9,9],[1,2,1,10],[2,2,2,10],[3,2,3,10],[13,2,13,13]]}
[]
[]
[]
[]
[]
[]
[null,null,"Schedule 13 Tax Reserves - Bridge Year"]
[]
[null,null,"Continuity of Reserves"]
[null,null,null,null,null,null,null,null,"Bridge Year Adjustments"]
{"$rows_left_out":35}
{"sheet":"T0 PILs,Tax Provision Test","index":16,"n_rows":44,"n_cols":21,"rows_kept":44,"cut":false,"hidden":false,"merged":[[33,2,33,6],[0,2,0,7],[1,2,1,12],[2,2,2,12],[3,2,3,12]]}
[null,null,null,null,null,null,null,null,null,null,null,null,null,null,null,null,null,null,null,"Rate Base","Federal Tax Rate"]
[null,null,null,null,null,null,null,null,null,null,null,null,null,null,null,null,null,null,null,500000,0.11]
[null,null,null,null,null,null,null,null,null,null,null,null,null,null,null,null,null,null,null,10000000,0.11]
[null,null,null,null,null,null,null,null,null,null,null,null,null,null,null,null,null,null,null,{"$f":"T3+100000","v":10100000},0.11]
[null,null,null,null,null,null,null,null,null,null,null,null,null,null,null,null,null,null,null,{"$f":"T4+100000","v":10200000},0.11]
[null,"PILs Tax Provision - Test Year",null,null,null,null,null,null,null,null,null,null,null,null,null,null,null,null,null,10300000,0.11]
[null,null,null,null,null,null,null,null,null,null,null,null,null,null,null,null,null,null,null,10400000,0.11]
[null,null,null,null,null,null,null,null,null,"Wires Only",null,null,null,null,null,null,null,null,null,10500000,0.11]
[null,null,null,null,null,null,null,null,null,null,null,null,null,null,null,null,null,null,null,10600000,0.11]
[null,null,"Regulatory Taxable Income",null,null,null,null,null,"T1",{"$f":"'T1 Sch 1 Taxable Income Test'!F122","v":702384.18515008688},"A",null,null,null,null,null,null,null,null,10700000,0.11]
{"$rows_left_out":35}
{"sheet":"T1 Sch 1 Taxable Income Test","index":17,"n_rows":122,"n_cols":7,"rows_kept":122,"cut":false,"hidden":false,"merged":[[0,2,0,5],[1,2,1,9],[2,2,2,9],[3,2,3,9]]}
[]
[]
[]
[]
[]
[]
[]
[]
[]
[null,null,"Taxable Income - Test Year"]
{"$rows_left_out":113}
{"sheet":"T4 Sch 4 Loss Cfwd Test","index":18,"n_rows":28,"n_cols":9,"rows_kept":28,"cut":false,"hidden":false,"merged":[[26,2,26,4],[24,2,24,4],[25,2,25,4],[11,2,11,4],[0,2,0,4],[1,2,1,9],[2,2,2,9],[3,2,3,9],[10,2,10,4],[15,2,15,4],[20,2,20,4],[21,2,21,4],[14,2,14,4],[16,2,16,4]]}
[]
[]
[]
[]
[]
[]
[null,null,"Schedule 4 Loss Carry Forward - Test Year"]
[]
[null,null,"Corporation Loss Continuity and Application"]
[]
{"$rows_left_out":19}
{"sheet":"T8 Sch 8 CCA Test","index":19,"n_rows":46,"n_cols":23,"rows_kept":46,"cut":false,"hidden":false,"merged":[[0,1,0,4],[44,1,44,30],[45,1,45,30],[1,1,1,16],[2,1,2,16],[3,1,3,16]]}
[]
[]
[]
[]
[]
[]
[null,"Schedule 8 CCA - Test Year"]
[]
[null,"(1)\nClass","Class Description","Working Paper Reference","(2)\nUndepreciated capital\ncost (UCC) at the\nbeginning of the test year","(3)\nCost of acquisitions during\nthe year (new property must\nbe available for use, except CWIP)","(4)\nCost of acquisitions from column 3 that are accelerated investment incentive property (AIIP)","(5)\nAdjustments and transfers (enter amounts that will reduce the UCC as negatives)","(6)\nAmount from column 5 that is assistance received or receivable during the year for a property, subsequent to its disposition","(7)\nAmount from column 5 that is repaid during the year for a property, subsequent to its disposition","(8)\nProceeds of dispositions","(9)\nUCC (column 2 plus column 3 plus or minus column 5 minus column 8)","(10)\nProceeds of disposition available to reduce the UCC of AIIP (column 8 plus column 6 minus column 3 plus column 4 minus column 7) (if negative, enter \"0\")","(11)\nNet capital cost additions of AIIP acquired during the year (column 4 minus column 10) (if negative, enter \"0\")","Relevant factor","(12)\nUCC adjustment for AIIP acquired during the year (column 11 multiplied by the relevant factor)","(13)\nUCC adjustment for non-AIIP acquired during the year (0.5 multiplied by the result of column 3 minus column 4 minus column 6 plus column 7 minus column 8) (if negative, enter \"0\")","(14)\nCCA Rate %","(15)\nRecapture of CCA","(16)\nTerminal Loss","(17)\nCCA (for declining balance method, the result of column 9 plus column 12 minus column 13, multiplied by column 14)",null,"(18)\nUCC at the end of the test year (column 9 minus column 17)"]
[null,{"$f":"IF(ISBLANK('B8 Sch 8 CCA Bridge'!B10), \"\", 'B8 Sch 8 CCA Bridge'!B10)","v":1},{"$f":"IF(ISBLANK('B8 Sch 8 CCA Bridge'!C10), \"\", 'B8 Sch 8 CCA Bridge'!C10)","v":"Buildings, Distribution System (acq'd post 1987)"},"B8",{"$f":"IF(ISBLANK('B8 Sch 8 CCA Bridge'!W10), \"\", 'B8 Sch 8 CCA Bridge'!W10)","v":17303146.559999999},null,null,null,null,null,null,{"$f":"IFERROR(E10+F10+H10-K10,0)","v":17303146.559999999},{"$f":"IF((K10+I10-F10+G10-J10)<0,0,(K10+I10-F10+G10-J10))","v":0},{"$f":"IF((G10-M10)<0,0,(G10-M10))","v":0},0,{"$f":"N10*O10","v":0},{"$f":"IF((0.5*(F10-G10-I10+J10-K10))<0,0,(0.5*(F10-G10-I10+J10-K10)))","v":0},0.04,null,null,{"$f":"IF(OR(L10<0,T10>0),0,(L10+P10-Q10)*R10)","v":692125.86239999998},null,{"$f":"IF(L10<0,0,L10-T10-U10)","v":16611020.6976}]
{"$rows_left_out":37}
{"sheet":"T13 Sch 13 Reserves Test","index":20,"n_rows":44,"n_cols":14,"rows_kept":44,"cut":false,"hidden":false,"merged":[[13,4,13,13],[9,8,9,9],[1,2,1,10],[2,2,2,10],[3,2,3,10]]}
[]
[]
[]
[]
[]
[]
[null,null,"Schedule 13 Tax Reserves - Test Year"]
[]
[null,null,"Continuity of Reserves"]
[null,null,null,null,null,null,null,null,"Test Year Adjustments"]
{"$rows_left_out":34}