{"text_format":"1","workbook":"xlsx","n_sheets":26,"sheets":["1. Info and Instructions","Table of Contents","S. Summary ","S1. Integrity Checks","A. Data Input Sheet","B. Tax Rates & Exemptions","H0 PILs,Tax Provision Hist","H1 Sch 1 Taxable Income Hist","H4 Sch 4 Loss Cfwd Hist","H8 Sch 8 CCA Hist","H13 Sch 13 Reserves Hist","B0 PILs,Tax Provision Bridge","B1 Sch 1 Taxable Income Bridge","B4 Sch 4 Loss Cfwd Bridge","B8 Sch 8 CCA Bridge","B13 Sch 13 Reserves Bridge","T0 PILs,Tax Provision Test","T1 Sch 1 Taxable Income Test","T4 Sch 4 Loss Cfwd Test","T8 Sch 8 CCA Test","T13 Sch 13 Reserves Test","2026-2029 PILs,Tax Provision","T8 Sch 8 CCA 2026 Test","T8 Sch 8 CCA 2027 Test","T8 Sch 8 CCA 2028 Test","T8 Sch 8 CCA 2029 Test"],"not_rendered":{"charts":0,"images":2,"macros":1,"external_links":3,"defined_names":79,"comments":6,"pivot_tables":0},"unopened":[],"bounds":{"document_bytes":16777216,"sheet_cells":100000,"rows_first":2000,"rows_last":500,"rows_between":2000,"halvings":0,"cell_chars":16384,"cell_head_chars":4096},"cells_cut":0,"cells_raw":0,"read":"whole","date_system":"1900"}

{"sheet":"1. Info and Instructions","index":0,"n_rows":73,"n_cols":28,"rows_kept":73,"cut":false,"hidden":false,"merged":[[21,3,21,4],[17,3,17,4],[13,3,13,4]]}
[null,null,null,null,null,null,null,null,null,null,null,null,null,null,null,null,null,null,null,null,null,null,null,null,null,null,null,"Alectra Utilities Corporation-Brampton Rate Zone"]
[null,null,null,null,null,null,null,null,null,null,null,null,null,null,null,null,null,null,null,null,null,null,null,null,null,null,null,"Alectra Utilities Corporation-Enersource Rate Zone"]
[null,null,null,null,null,null,null,null,null,null,null,null,null,null,null,null,null,null,null,null,null,null,null,null,null,null,null,"Alectra Utilities Corporation-Horizon Utilities Rate Zone"]
[null,null,null,null,null,null,null,null,null,null,null,null,null,null,null,null,null,null,null,null,null,null,null,null,null,null,null,"Alectra Utilities Corporation-PowerStream Rate Zone"]
[null,null,null,null,null,null,null,null,null,null,null,null,null,null,null,null,null,null,null,null,null,null,null,null,null,null,null,"Alectra Utilities Corporation-Guelph Rate Zone"]
[null,null,null,null,null,null,null,null,null,null,null,null,null,null,null,null,null,null,null,null,null,null,null,null,null,null,null,"Algoma Power Inc."]
[null,null,null,null,null,null,null,null,null,null,null,null,null,null,null,null,null,null,null,null,null,null,null,null,null,null,null,"Atikokan Hydro Inc."]
[null,null,null,null,null,null,null,null,null,null,null,null,null,null,null,null,null,null,null,null,null,null,null,null,null,null,null,"Bluewater Power Distribution Corporation"]
[null,null,null,null,null,null,null,null,null,null,null,null,null,null,null,null,null,null,null,null,null,null,null,null,null,null,null,"Brantford Power Inc."]
[null,null,null,null,null,null,null,null,null,null,null,null,null,null,null,null,null,null,null,null,null,null,null,null,null,null,null,"Burlington Hydro Inc."]
{"$rows_left_out":64}
{"sheet":"Table of Contents","index":1,"n_rows":32,"n_cols":27,"rows_kept":32,"cut":false,"hidden":false,"merged":[[81,0,88,6]]}
[null,null,null,null,null,null,null,null,null,null,null,null,null,null,null,null,null,null,null,null,null,null,null,null,null,null,1]
[null,null,null,null,null,null,null,null,null,null,null,null,null,null,null,null,null,null,null,null,null,null,null,null,null,null,2012]
[null,null,null,null,null,null,null,null,null,null,null,null,null,null,null,null,null,null,null,null,null,null,null,null,null,null,2013]
[null,null,null,null,null,null,null,null,null,null,null,null,null,null,null,null,null,null,null,null,null,null,null,null,null,null,2014]
[null,null,null,null,null,null,null,null,null,null,null,null,null,null,null,null,null,null,null,null,null,null,null,null,null,null,2015]
[null,null,null,null,null,null,null,null,null,null,null,null,null,null,null,null,null,null,null,null,null,null,null,null,null,null,2016]
[]
[]
[]
[null,null,null,"1. Info"]
{"$rows_left_out":23}
{"sheet":"S. Summary ","index":2,"n_rows":26,"n_cols":9,"rows_kept":26,"cut":false,"hidden":false,"merged":[[0,2,0,10],[1,2,1,10]]}
[]
[]
[]
[]
[null,"No inputs required on this worksheet."]
[]
[null,null,null,"Inputs on Service Revenue Requirement Worksheet"]
[null,null,null,"The Service Revenue Requirement is in the 'Revenue Requirement Workform' - Tab 3."]
[]
[null,null,null,"Item",null,null,"Working Paper Reference"]
{"$rows_left_out":17}
{"sheet":"S1. Integrity Checks","index":3,"n_rows":24,"n_cols":4,"rows_kept":24,"cut":false,"hidden":false,"merged":[[12,0,12,3],[19,4,21,5]]}
[]
[]
[]
[]
[]
[]
[]
[]
[]
[]
{"$rows_left_out":15}
{"sheet":"A. Data Input Sheet","index":4,"n_rows":41,"n_cols":9,"rows_kept":41,"cut":false,"hidden":false,"merged":[[37,2,37,4],[40,2,40,4],[29,2,29,4],[31,2,31,4],[33,2,33,4],[35,2,35,4],[25,2,25,4],[27,2,27,4],[0,2,0,4],[1,2,1,8],[2,2,2,8],[3,2,3,8]]}
[]
[]
[]
[]
[]
[]
[null,null,null,null,null,null,"Test Year","Bridge Year"]
[]
[null,null,"Rate Base",null,null,"S",5901228002,{"$f":"5596523662-17699007","v":5578824655},"/C"]
[]
{"$rows_left_out":32}
{"sheet":"B. Tax Rates & Exemptions","index":5,"n_rows":39,"n_cols":11,"rows_kept":39,"cut":false,"hidden":false,"merged":[[0,2,0,3],[1,2,1,3],[2,2,2,3],[3,2,3,3]]}
[]
[]
[]
[]
[]
[]
[]
[]
[null,null,"Tax Rates"]
[null,null,"Federal & Provincial",null,"Effective","Effective","Effective","Effective","Effective","Effective","Effective"]
{"$rows_left_out":30}
{"sheet":"H0 PILs,Tax Provision Hist","index":6,"n_rows":34,"n_cols":10,"rows_kept":34,"cut":false,"hidden":false,"merged":[[42,2,42,5],[0,2,0,6],[1,2,1,11],[2,2,2,11],[3,2,3,11],[38,2,38,5],[7,2,7,5]]}
[]
[]
[]
[]
[]
[null,null,"PILs Tax Provision - Historical Year"]
[null,null,"INFORMATION NOT AVAILABLE. THIS SCHEDULE WILL BE UPDATED ONCE 2023 TAX RETURN IS FILED IN JUNE 2024."]
[null,null,"Note: Input the actual information from the tax returns for the historical year. ",null,null,null,null,null,"Wires Only"]
[]
[null,null,"Regulatory Taxable Income",null,null,null,null,"H1",{"$f":"'H1 Sch 1 Taxable Income Hist'!G115","v":0},"A"]
{"$rows_left_out":25}
{"sheet":"H1 Sch 1 Taxable Income Hist","index":7,"n_rows":115,"n_cols":8,"rows_kept":115,"cut":false,"hidden":false,"merged":[[46,2,46,6],[107,2,107,6],[0,2,0,4],[1,2,1,8],[2,2,2,8],[3,2,3,8],[12,2,12,6],[83,2,83,6],[70,2,70,6]]}
[]
[]
[]
[]
[]
[]
[]
[null,null,"Adjusted Taxable Income - Historical Year"]
[null,null,"INFORMATION NOT AVAILABLE. THIS SCHEDULE WILL BE UPDATED ONCE 2023 TAX RETURN IS FILED IN JUNE 2024."]
[]
{"$rows_left_out":106}
{"sheet":"H4 Sch 4 Loss Cfwd Hist","index":8,"n_rows":17,"n_cols":9,"rows_kept":17,"cut":false,"hidden":false,"merged":[[15,2,15,4],[16,2,16,4],[12,2,12,4],[13,2,13,4]]}
[]
[]
[]
[]
[]
[]
[null,null,"INFORMATION NOT AVAILABLE. THIS SCHEDULE WILL BE UPDATED ONCE 2023 TAX RETURN IS FILED IN JUNE 2024."]
[]
[null,null,"Schedule 4 Loss Carry Forward - Historical"]
[]
{"$rows_left_out":8}
{"sheet":"H8 Sch 8 CCA Hist","index":9,"n_rows":45,"n_cols":8,"rows_kept":45,"cut":false,"hidden":false,"merged":[[46,2,46,6],[9,2,9,6],[0,2,0,4],[1,2,1,8],[2,2,2,8],[3,2,3,8]]}
[]
[]
[]
[]
[]
[null,null,"Schedule 8 - Historical Year"]
[]
[null,null,"BELOW ARE FORECASTED AMOUNTS. THIS SCHEDULE WILL BE UPDATED ONCE 2023 TAX RETURN IS FILED IN JUNE 2024."]
[]
[]
{"$rows_left_out":36}
{"sheet":"H13 Sch 13 Reserves Hist","index":10,"n_rows":51,"n_cols":7,"rows_kept":51,"cut":false,"hidden":false,"merged":[[28,2,28,5],[3,2,3,8],[2,2,2,8],[1,2,1,8],[0,2,0,4],[15,2,15,5]]}
[]
[]
[]
[]
[]
[]
[]
[null,null,"Schedule 13 Tax Reserves - Historical"]
[]
[null,null,"Continuity of Reserves"]
{"$rows_left_out":42}
{"sheet":"B0 PILs,Tax Provision Bridge","index":11,"n_rows":38,"n_cols":12,"rows_kept":38,"cut":false,"hidden":false,"merged":[[41,2,41,5],[0,2,0,6],[1,2,1,12],[2,2,2,12],[3,2,3,12],[37,2,37,5]]}
[]
[]
[]
[]
[]
[null,"PILS Tax Provision - Bridge Year"]
[]
[null,null,null,null,null,null,null,null,null,"Wires Only"]
[null,null,null,null,null,null,null,null,"Reference"]
[null,null,"Regulatory Taxable Income",null,null,null,null,null,"B1",{"$f":"'B1 Sch 1 Taxable Income Bridge'!F111","v":25066130.154999971},"A","/C"]
{"$rows_left_out":29}
{"sheet":"B1 Sch 1 Taxable Income Bridge","index":12,"n_rows":111,"n_cols":7,"rows_kept":111,"cut":false,"hidden":false,"merged":[[67,2,67,5],[44,2,44,5],[109,2,109,5],[8,2,8,5],[0,2,0,5],[1,2,1,9],[2,2,2,9],[3,2,3,9],[9,2,9,5]]}
[]
[]
[]
[]
[null,"Adjusted Taxable Income - Bridge Year"]
[]
[null,null,null,"T2S1 line #","Working Paper Reference","Total for Regulated Utility"]
[null,null,"Income before PILs/Taxes","(A + 101 + 102)",null,{"$f":"190729522-603178","v":190126344},"/C"]
[]
[null,null,"Additions:"]
{"$rows_left_out":102}
{"sheet":"B4 Sch 4 Loss Cfwd Bridge","index":13,"n_rows":23,"n_cols":8,"rows_kept":23,"cut":false,"hidden":false,"merged":[[21,2,21,4],[14,2,14,4],[20,2,20,4],[18,2,18,4],[0,2,0,4],[13,2,13,4],[17,2,17,4],[10,2,10,4],[11,2,11,4],[1,2,1,9],[2,2,2,9],[3,2,3,9],[11,9,11,11],[13,9,13,11]]}
[]
[]
[]
[]
[]
[]
[null,null,"Corporation Loss Continuity and Application"]
[]
[null,null,"Schedule 4 Loss Carry Forward - Bridge Year"]
[]
{"$rows_left_out":14}
{"sheet":"B8 Sch 8 CCA Bridge","index":14,"n_rows":46,"n_cols":24,"rows_kept":46,"cut":false,"hidden":false,"merged":[[47,2,47,23],[48,2,48,23],[44,1,44,23],[45,1,45,23],[0,1,0,4],[1,1,1,16],[2,1,2,16],[3,1,3,16],[46,2,46,23]]}
[]
[]
[]
[]
[]
[]
[null,"Schedule 8 CCA - Bridge Year"]
[]
[null,"(1)\nClass","Class Description","Working Paper Reference","(2)\nUndepreciated capital\ncost (UCC) at the\nbeginning of the bridge year","(3)\nCost of acquisitions during\nthe year (new property must\nbe available for use, except CWIP)","(4)\nCost of acquisitions from column 3 that are accelerated investment incentive property (AIIP)","(5)\nAdjustments and transfers (enter amounts that will reduce the UCC as negatives)","(6)\nAmount from column 5 that is assistance received or receivable during the year for a property, subsequent to its disposition","(7)\nAmount from column 5 that is repaid during the year for a property, subsequent to its disposition","(8)\nProceeds of dispositions","(9)\nUCC (column 2 plus column 3 plus or minus column 5 minus column 8)","(10)\nProceeds of disposition available to reduce the UCC of AIIP (column 8 plus column 6 minus column 3 plus column 4 minus column 7) (if negative, enter \"0\")","(11)\nNet capital cost additions of AIIP acquired during the year (column 4 minus column 10) (if negative, enter \"0\")","Relevant factor","(12)\nUCC adjustment for AIIP acquired during the year (column 11 multiplied by the relevant factor)","(13)\nUCC adjustment for non-AIIP acquired during the year (0.5 multiplied by the result of column 3 minus column 4 minus column 6 plus column 7 minus column 8) (if negative, enter \"0\")","(14)\nCCA Rate %","(15)\nRecapture of CCA","(16)\nTerminal Loss","(17)\nCCA (for declining balance method, the result of column 9 plus column 12 minus column 13, multiplied by column 14)",null,"(18)\nUCC at the end of the bridge year (column 9 minus column 17)","Working Paper Reference"]
[null,{"$f":"IF(ISBLANK('H8 Sch 8 CCA Hist'!C12), \"\", 'H8 Sch 8 CCA Hist'!C12)","v":1},{"$f":"IF(ISBLANK('H8 Sch 8 CCA Hist'!D12), \"\", 'H8 Sch 8 CCA Hist'!D12)","v":"Buildings, Distribution System (acq'd post 1987)"},"H8",{"$f":"IF(ISBLANK('H8 Sch 8 CCA Hist'!E12),0, 'H8 Sch 8 CCA Hist'!G12)","v":918272436},21328139,21313243,null,null,null,null,{"$f":"IFERROR(E10+F10+H10-K10,0)","v":939600575},{"$f":"IF((K10+I10-F10+G10-J10)<0,0,(K10+I10-F10+G10-J10))","v":0},{"$f":"IF((G10-M10)<0,0,(G10-M10))","v":21313243},0,{"$f":"N10*O10","v":0},{"$f":"IF((0.5*(F10-G10-I10+J10-K10))<0,0,(0.5*(F10-G10-I10+J10-K10)))","v":7448},0.04,null,null,{"$f":"IF(OR(L10<0,T10>0),0,(L10+P10-Q10)*R10)","v":37583725.079999998},null,{"$f":"IF(L10<0,0,L10-T10-U10)","v":902016849.91999996},"T8"]
{"$rows_left_out":37}
{"sheet":"B13 Sch 13 Reserves Bridge","index":15,"n_rows":44,"n_cols":14,"rows_kept":44,"cut":false,"hidden":false,"merged":[[23,2,23,13],[9,8,9,9],[1,2,1,10],[2,2,2,10],[3,2,3,10],[13,2,13,13]]}
[]
[]
[]
[]
[]
[]
[null,null,"Schedule 13 Tax Reserves - Bridge Year"]
[]
[null,null,"Continuity of Reserves"]
[null,null,null,null,null,null,null,null,"Bridge Year Adjustments"]
{"$rows_left_out":35}
{"sheet":"T0 PILs,Tax Provision Test","index":16,"n_rows":47,"n_cols":21,"rows_kept":47,"cut":false,"hidden":false,"merged":[[36,2,36,6],[0,2,0,7],[1,2,1,12],[2,2,2,12],[3,2,3,12]]}
[null,null,null,null,null,null,null,null,null,null,null,null,null,null,null,null,null,null,null,"Rate Base","Federal Tax Rate"]
[null,null,null,null,null,null,null,null,null,null,null,null,null,null,null,null,null,null,null,500000,0.11]
[null,null,null,null,null,null,null,null,null,null,null,null,null,null,null,null,null,null,null,10000000,0.11]
[null,null,null,null,null,null,null,null,null,null,null,null,null,null,null,null,null,null,null,{"$f":"T3+100000","v":10100000},0.11]
[null,null,null,null,null,null,null,null,null,null,null,null,null,null,null,null,null,null,null,{"$f":"T4+100000","v":10200000},0.11]
[null,"PILs Tax Provision - Test Year",null,null,null,null,null,null,null,null,null,null,null,null,null,null,null,null,null,10300000,0.11]
[null,null,null,null,null,null,null,null,null,null,null,null,null,null,null,null,null,null,null,10400000,0.11]
[null,null,null,null,null,null,null,null,null,"Wires Only",null,null,null,null,null,null,null,null,null,10500000,0.11]
[null,null,null,null,null,null,null,null,null,null,null,null,null,null,null,null,null,null,null,10600000,0.11]
[null,null,"Regulatory Taxable Income",null,null,null,null,null,"T1",{"$f":"'T1 Sch 1 Taxable Income Test'!F122","v":77254374.356994271},"A",null,null,null,null,null,null,null,null,10700000,0.11]
{"$rows_left_out":38}
{"sheet":"T1 Sch 1 Taxable Income Test","index":17,"n_rows":122,"n_cols":7,"rows_kept":122,"cut":false,"hidden":false,"merged":[[0,2,0,5],[1,2,1,9],[2,2,2,9],[3,2,3,9]]}
[]
[]
[]
[]
[]
[]
[]
[]
[]
[null,null,"Taxable Income - Test Year"]
{"$rows_left_out":113}
{"sheet":"T4 Sch 4 Loss Cfwd Test","index":18,"n_rows":28,"n_cols":9,"rows_kept":28,"cut":false,"hidden":false,"merged":[[26,2,26,4],[24,2,24,4],[25,2,25,4],[11,2,11,4],[0,2,0,4],[1,2,1,9],[2,2,2,9],[3,2,3,9],[10,2,10,4],[15,2,15,4],[20,2,20,4],[21,2,21,4],[14,2,14,4],[16,2,16,4]]}
[]
[]
[]
[]
[]
[]
[null,null,"Schedule 4 Loss Carry Forward - Test Year"]
[]
[null,null,"Corporation Loss Continuity and Application"]
[]
{"$rows_left_out":19}
{"sheet":"T8 Sch 8 CCA Test","index":19,"n_rows":47,"n_cols":28,"rows_kept":47,"cut":false,"hidden":false,"merged":[[0,1,0,4],[45,1,45,35],[46,1,46,35],[1,1,1,22],[2,1,2,22],[3,1,3,22]]}
[]
[]
[]
[]
[]
[]
[null,"Schedule 8 CCA - Test Year"]
[]
[null,"(1)\nClass","Class Description","Working Paper Reference","(2)\nUndepreciated capital\ncost (UCC) at the\nbeginning of the test year","(3)\nCost of acquisitions during\nthe year (new property must\nbe available for use, except CWIP)","(4)\nCost of acquisitions from column 3 that are accelerated investment incentive property (AIIP)","(5)\nAdjustments and transfers (enter amounts that will reduce the UCC as negatives)","(6)\nAmount from column 5 that is assistance received or receivable during the year for a property, subsequent to its disposition","(7)\nAmount from column 5 that is repaid during the year for a property, subsequent to its disposition","(8)\nProceeds of dispositions","(9)\nProceeds of dispositions of the DIEP (enter amount from column 8 that relates to the DIEP reported in column 4)\n","(10)\nUCC (column 2 plus column 3 plus or minus column 5 minus column 8)","(11)\nUCC of the DIEP (enter the UCC amount that relates to the DIEP reported in column 4)\n","(12)\nImmediate expensing ","(13)\nCost of acquisitions on remainder of Class (column 3 minus\ncolumn 4 plus\ncolumn 11 minus\ncolumn 12)","(14)\nCost of acquisitions from column 13 that are accelerated investment incentive properties (AIIP) or properties included in Classes 54 to 56","(15)\nRemaining UCC (column 10 minus\ncolumn 12)\n(if negative, enter \"0\")","(16)\nProceeds of disposition available to reduce the UCC of AIIP and property included in Classes 54 to 56 (column 8 minus column 9\nplus column 6 minus column 13\nplus column 14 minus column 7) (if negative, enter \"0\")","(17)\nNet capital cost additions of AIIP acquired during the year (column 4 minus column 10) (if negative, enter \"0\")","Relevant factor","(18)\nUCC adjustment for AIIP and property included in Classes 54 to 56 acquired during the year (column 17 multiplied by the relevant factor)"," (19)\nUCC adjustment for non-AIIP and property included in Classes 54 to 56 (0.5 multiplied by the result of column 13 minus column 14 minus\ncolumn 6 plus column 7 minus\ncolumn 8 plus column 9) (if negative, enter \"0\")","(20)\nCCA Rate %","(21)\nRecapture of CCA","(22)\nTerminal Loss","(23)\nCCA (for declining balance method, the result of column 15 plus column  18 minus column 19, multiplied by column  20  or a lower amount, plus column 12))","(24)\nUCC at the end of the test year (column 10 minus column  23)"]
[null,{"$f":"IF(ISBLANK('B8 Sch 8 CCA Bridge'!B10), \"\", 'B8 Sch 8 CCA Bridge'!B10)","v":1},{"$f":"IF(ISBLANK('B8 Sch 8 CCA Bridge'!C10), \"\", 'B8 Sch 8 CCA Bridge'!C10)","v":"Buildings, Distribution System (acq'd post 1987)"},"B8",{"$f":"IF(ISBLANK('B8 Sch 8 CCA Bridge'!W10), \"\", 'B8 Sch 8 CCA Bridge'!W10)","v":902016849.91999996},17945572,17930676,null,null,null,null,{"$f":"IF(G10<>0,K10,0)","v":0},{"$f":"IFERROR(E10+F10+H10-K10,0)","v":919962421.91999996},{"$f":"IF(G10<>0,G10,0)","v":17930676},null,{"$f":"+F10-G10+N10-O10","v":17945572},{"$f":"IF(L10=0,G10-L10,0)","v":17930676},{"$f":"IF((M10-O10)<0,0,M10-O10)","v":919962421.91999996},{"$f":"IF((K10-L10+I10-P10+Q10-J10)<0,0,(K10-L10+I10-P10+Q10-J10))","v":0},{"$f":"IF((G10-S10)<0,0,(G10-S10))","v":17930676},0,{"$f":"T10*U10","v":0},{"$f":"IF((0.5*(P10-Q10-I10+J10-K10))<0,0,(0.5*(P10-Q10-I10+J10-K10)))","v":7448},0.04,null,null,{"$f":"IF(OR(R10<0,Y10>0),0,(R10+V10-W10)*X10)","v":36798198.956799999},{"$f":"IF(M10<0,0,M10-Z10-AA10)","v":883164222.96319997}]
{"$rows_left_out":38}
{"sheet":"T13 Sch 13 Reserves Test","index":20,"n_rows":44,"n_cols":14,"rows_kept":44,"cut":false,"hidden":false,"merged":[[13,4,13,13],[9,8,9,9],[1,2,1,10],[2,2,2,10],[3,2,3,10]]}
[]
[]
[]
[]
[]
[]
[null,null,"Schedule 13 Tax Reserves - Test Year"]
[]
[null,null,"Continuity of Reserves"]
[null,null,null,null,null,null,null,null,"Test Year Adjustments"]
{"$rows_left_out":35}
{"sheet":"2026-2029 PILs,Tax Provision","index":21,"n_rows":67,"n_cols":8,"rows_kept":67,"cut":false,"hidden":false,"merged":[]}
[]
[]
[]
[]
[]
[null,null,"T2 S1 line #","2026 Test Year                         Taxable Income","2027 Test Year                         Taxable Income","2028 Test Year                         Taxable Income","2029 Test Year                         Taxable Income"]
[null,"Net Income Before Taxes",null,235291868,251397578,268739692,284849689]
[]
[null,"Additions:"]
[null,"Amortization of tangible assets\n2-4 ADJUSTED ACCOUNTING DATA P489",104,299636599.58100402,319928789.08387202,342059946.74455899,354470110.11005902]
{"$rows_left_out":58}
{"sheet":"T8 Sch 8 CCA 2026 Test","index":22,"n_rows":45,"n_cols":17,"rows_kept":45,"cut":false,"hidden":false,"merged":[[0,2,0,5],[46,2,48,16]]}
[]
[]
[]
[]
[]
[]
[null,null,"Schedule 8 CCA - 2026"]
[]
[]
[null,null,"Class","Class Description",null,"2026 Opening UCC Balance","Additions (acquired before November 21, 2018)","Additions (acquired after November 20, 2018)","Total Additions","Disposals  (Negative)","UCC Before 1/2 Yr Adjustment","1/2 Year Rule {1/2 Additions Less Disposals}","Reduced UCC","Rate %","2026 CCA\n(Accelerated CCA rule applied)",null,"2026 Ending UCC Balance"]
{"$rows_left_out":36}
{"sheet":"T8 Sch 8 CCA 2027 Test","index":23,"n_rows":46,"n_cols":17,"rows_kept":46,"cut":false,"hidden":false,"merged":[[0,2,0,5],[47,2,49,16]]}
[]
[]
[]
[]
[]
[]
[null,null,"Schedule 8 CCA - 2027"]
[]
[]
[null,null,"Class","Class Description",null,"2027 Opening UCC Balance","Additions (acquired before November 21, 2018)","Additions (acquired after November 20, 2018)","Total Additions","Disposals  (Negative)","UCC Before 1/2 Yr Adjustment","1/2 Year Rule {1/2 Additions Less Disposals}","Reduced UCC","Rate %","2027 CCA\n(Accelerated CCA rule applied)",null,"2027 Ending UCC Balance"]
{"$rows_left_out":37}
{"sheet":"T8 Sch 8 CCA 2028 Test","index":24,"n_rows":52,"n_cols":17,"rows_kept":52,"cut":false,"hidden":false,"merged":[[0,2,0,5]]}
[]
[]
[]
[]
[]
[]
[null,null,"Schedule 8 CCA - 2028"]
[]
[]
[null,null,"Class","Class Description",null,"2028 Opening UCC Balance","Additions (acquired before November 21, 2018)","Additions (acquired after November 20, 2018)","Total Additions","Disposals  (Negative)","UCC Before 1/2 Yr Adjustment","1/2 Year Rule {1/2 Additions Less Disposals}","Reduced UCC","Rate %","2028 CCA\n(Accelerated CCA rule - NA)",null,"2028 Ending UCC Balance"]
{"$rows_left_out":43}
{"sheet":"T8 Sch 8 CCA 2029 Test","index":25,"n_rows":48,"n_cols":17,"rows_kept":48,"cut":false,"hidden":false,"merged":[[0,2,0,5]]}
[]
[]
[]
[]
[]
[]
[null,null,"Schedule 8 CCA - 2029"]
[]
[]
[null,null,"Class","Class Description",null,"2029 Opening UCC Balance","Additions (acquired before November 21, 2018)","Additions (acquired after November 20, 2018)","Total Additions","Disposals  (Negative)","UCC Before 1/2 Yr Adjustment","1/2 Year Rule {1/2 Additions Less Disposals}","Reduced UCC","Rate %","2029 CCA\n(Accelerated CCA rule - NA)",null,"2029 Ending UCC Balance"]
{"$rows_left_out":38}