{"text_format":"1","workbook":"xlsx","n_sheets":21,"sheets":["A1.1 Distributor Information","B1.1 Current Distribution Rates","B1.2 Billing Determinants","B1.3 Current Rev From Rates","C1.1 Current Rate Riders","C1.2 - PCA","D1.1 Rate 1 Adjustment","D1.2 Rate 6 Adjustment","D1.3 Rate 11 Adjustment","D1.4 Rate 16 Adjustment","E1.1 Proposed Dist Rates ","E1.2 Billing Determinants","E1.3 Proposed Rev From Rate","F1.3 Proposed Rate Riders","G1.1 Rate 1 Bill Impact","G1.2 Rate 6 Bill Impact","G1.3 Rate 11 Bill Impact","G1.4 Rate 16 Bill Impact","G1.7 Summary of Bill Impacts","Staff-2","Staff-2 CVVA Calculation"],"not_rendered":{"charts":0,"images":0,"macros":1,"external_links":0,"defined_names":5,"comments":0,"pivot_tables":0},"unopened":[],"bounds":{"document_bytes":16777216,"sheet_cells":100000,"rows_first":2000,"rows_last":500,"rows_between":2000,"halvings":0,"cell_chars":16384,"cell_head_chars":4096},"cells_cut":0,"cells_raw":0,"read":"whole","date_system":"1900"}

{"sheet":"A1.1 Distributor Information","index":0,"n_rows":12,"n_cols":4,"rows_kept":12,"cut":false,"hidden":false,"merged":[]}
[]
[]
[null,null,{"$f":"D8","v":"EPCOR Natural Gas Limited Partnership"}]
[null,null,{"$f":" \"OEB Application Number:  \" & D9","v":"OEB Application Number:  EB-2024-0238  Exhibit A - 2025 Custom Incentive Application"}]
[]
[null,null,"Distributor Information"]
[]
[null,null,"Distributor Name","EPCOR Natural Gas Limited Partnership"]
[null,null,"OEB Application Number","EB-2024-0238  Exhibit A - 2025 Custom Incentive Application"]
[]
{"$rows_left_out":3}
{"sheet":"B1.1 Current Distribution Rates","index":1,"n_rows":18,"n_cols":18,"rows_kept":18,"cut":false,"hidden":false,"merged":[[6,6,6,8]]}
[]
[null,null,{"$f":"'A1.1 Distributor Information'!C3","v":"EPCOR Natural Gas Limited Partnership"}]
[null,null,{"$f":"'A1.1 Distributor Information'!C4","v":"OEB Application Number:  EB-2024-0238  Exhibit A - 2025 Custom Incentive Application"}]
[]
[null,null,"Current Distribution Tariff Sheet Rates"]
[]
[null,null,null,null,"Fixed ",null,"Delivery Charge",null,null,"Delivery Charge"]
[null,null,"Rate Class",null,"Monthly Base",{"$f":"OneDollar","v":"Bill 32 Rate"},"Tier 1","Tier 2","Tier 3","Contract Demand","Gas Supply","Upstream Recovery \nCharge","Transportation & \nStorage Charge","Transportation Charge \nFrom Dawn","Transportation Charge \nFrom Kirkwall","Transportation Charge From Parkway","Federal Carbon Charge","Facility Carbon Charge"]
[null,null,null,null," $/month","$ / month","₵ / m3","₵ / m3","₵ / m3","₵ /contracted m3","₵  / m3","(A)","₵  / m3","₵ /contracted m3","₵ /contracted m3","₵ /contracted m3","₵ / m3","₵ / m3"]
[null,null,"Rate 1","General Firm Service",27.448077999999999,1,29.403535999999999,28.824269960000002,27.972877880000002,null,12.9848,1.474,2.6981999999999999,null,null,null,15.25,1.2999999999999999E-3]
{"$rows_left_out":9}
{"sheet":"B1.2 Billing Determinants","index":2,"n_rows":12,"n_cols":10,"rows_kept":12,"cut":false,"hidden":false,"merged":[[6,5,6,7]]}
[]
[null,null,{"$f":"'A1.1 Distributor Information'!C3","v":"EPCOR Natural Gas Limited Partnership"}]
[null,null,{"$f":"'A1.1 Distributor Information'!C4","v":"OEB Application Number:  EB-2024-0238  Exhibit A - 2025 Custom Incentive Application"}]
[]
[null,null,"Billing Determinants"]
[]
[null,null,null,null,"Fixed","Delivery Charge",null,null,"Delivery Charge"]
[null,null,"Rate Class",null,"Monthly Base","Tier 1","Tier 2","Tier 3","Contract Demand","Gas Supply"]
[null,null,"Rate 1","General Firm Service",5516,4885012,3296557,89051,null,8270620]
[null,null,"Rate 6","Large Volume General Firm Service",54,525661,1137819,564677,null,2228157]
{"$rows_left_out":3}
{"sheet":"B1.3 Current Rev From Rates","index":3,"n_rows":19,"n_cols":15,"rows_kept":19,"cut":false,"hidden":false,"merged":[[17,2,17,3],[10,6,10,8]]}
[]
[null,null,{"$f":"'A1.1 Distributor Information'!C3","v":"EPCOR Natural Gas Limited Partnership"}]
[null,null,{"$f":"'A1.1 Distributor Information'!C4","v":"OEB Application Number:  EB-2024-0238  Exhibit A - 2025 Custom Incentive Application"}]
[]
[]
[null,null,"Forecasted Revenue from Current Rates"]
[]
[null,null,"Months / Year",12]
[null,null,null,"EB-2023-0161  Exhibit A - 2024 Custom Incentive Application"]
[]
{"$rows_left_out":10}
{"sheet":"C1.1 Current Rate Riders","index":4,"n_rows":49,"n_cols":6,"rows_kept":49,"cut":false,"hidden":false,"merged":[]}
[]
[null,null,{"$f":"'A1.1 Distributor Information'!C3","v":"EPCOR Natural Gas Limited Partnership"}]
[null,null,{"$f":"'A1.1 Distributor Information'!C4","v":"OEB Application Number:  EB-2024-0238  Exhibit A - 2025 Custom Incentive Application"}]
[]
[null,null,"Current Rate Riders"]
[]
[null,null,"Description:",null,"Delay in Revenue Recovery Rate Rider"]
[null,null,"Effective Until:",null,"Dec 31, 2028"]
[]
[null,null,"Rate 1 | General Firm Service","cents / m3 volume",1.633,"Cents/m3"]
{"$rows_left_out":40}
{"sheet":"C1.2 - PCA","index":5,"n_rows":12,"n_cols":8,"rows_kept":12,"cut":false,"hidden":false,"merged":[]}
[{"$f":"'C1.1 Current Rate Riders'!C2","v":"EPCOR Natural Gas Limited Partnership"}]
[{"$f":"'C1.1 Current Rate Riders'!C3","v":"OEB Application Number:  EB-2024-0238  Exhibit A - 2025 Custom Incentive Application"}]
[]
["2025 OEB Inflation Factor",null,null,null,null,null,null,3.5999999999999997E-2]
[]
["Incentive Rate Adjustment (IR) = [(1.0 – 0.314) x 0.0127] + [0.314 x Inflation (I)]"]
[]
[null,null,null,1,-0.314,1.2699999999999999E-2,"+",0.314]
[null,null,null,null,{"$f":"D8+E8","v":0.68599999999999994},{"$f":"F8","v":1.2699999999999999E-2},null,{"$f":"H8*H4","v":1.1304E-2}]
[null,null,null,null,null,{"$f":"E9*F9","v":8.7121999999999981E-3},null,{"$f":"H9","v":1.1304E-2}]
{"$rows_left_out":3}
{"sheet":"D1.1 Rate 1 Adjustment","index":6,"n_rows":27,"n_cols":9,"rows_kept":27,"cut":false,"hidden":false,"merged":[]}
[]
[null,null,{"$f":"'A1.1 Distributor Information'!C3","v":"EPCOR Natural Gas Limited Partnership"}]
[null,null,{"$f":"'A1.1 Distributor Information'!C4","v":"OEB Application Number:  EB-2024-0238  Exhibit A - 2025 Custom Incentive Application"}]
[]
[null,null,"Rate 1 Incentive Rate Adjustment"]
[null,null,{"$f":"MID(CELL(\"filename\",A1),FIND(\"]\",CELL(\"filename\",A1))+1,255)","v":"D1.1 Rate 1 Adjustment"}]
[]
[null,null,"Rate 1"]
[]
[null,null,"GDP-IPI"]
{"$rows_left_out":18}
{"sheet":"D1.2 Rate 6 Adjustment","index":7,"n_rows":27,"n_cols":9,"rows_kept":27,"cut":false,"hidden":false,"merged":[]}
[]
[null,null,{"$f":"'A1.1 Distributor Information'!C3","v":"EPCOR Natural Gas Limited Partnership"}]
[null,null,{"$f":"'A1.1 Distributor Information'!C4","v":"OEB Application Number:  EB-2024-0238  Exhibit A - 2025 Custom Incentive Application"}]
[]
[null,null,"Rate 6 Incentive Rate Adjustment"]
[null,null,{"$f":"MID(CELL(\"filename\",A1),FIND(\"]\",CELL(\"filename\",A1))+1,255)","v":"D1.2 Rate 6 Adjustment"}]
[]
[null,null,"Rate 6"]
[]
[null,null,"GDP-IPI"]
{"$rows_left_out":18}
{"sheet":"D1.3 Rate 11 Adjustment","index":8,"n_rows":27,"n_cols":9,"rows_kept":27,"cut":false,"hidden":false,"merged":[]}
[]
[null,null,{"$f":"'A1.1 Distributor Information'!C3","v":"EPCOR Natural Gas Limited Partnership"}]
[null,null,{"$f":"'A1.1 Distributor Information'!C4","v":"OEB Application Number:  EB-2024-0238  Exhibit A - 2025 Custom Incentive Application"}]
[]
[null,null,"Rate 11 Incentive Rate Adjustment"]
[null,null,{"$f":"MID(CELL(\"filename\",A1),FIND(\"]\",CELL(\"filename\",A1))+1,255)","v":"D1.3 Rate 11 Adjustment"}]
[]
[null,null,"Rate 11"]
[]
[null,null,"GDP-IPI"]
{"$rows_left_out":18}
{"sheet":"D1.4 Rate 16 Adjustment","index":9,"n_rows":29,"n_cols":9,"rows_kept":29,"cut":false,"hidden":false,"merged":[]}
[]
[null,null,{"$f":"'A1.1 Distributor Information'!C3","v":"EPCOR Natural Gas Limited Partnership"}]
[null,null,{"$f":"'A1.1 Distributor Information'!C4","v":"OEB Application Number:  EB-2024-0238  Exhibit A - 2025 Custom Incentive Application"}]
[]
[null,null,"Rate 16 Incentive Rate Adjustment"]
[null,null,{"$f":"MID(CELL(\"filename\",A1),FIND(\"]\",CELL(\"filename\",A1))+1,255)","v":"D1.4 Rate 16 Adjustment"}]
[]
[null,null,"Rate 16"]
[]
[null,null,"GDP-IPI"]
{"$rows_left_out":20}
{"sheet":"E1.1 Proposed Dist Rates ","index":10,"n_rows":14,"n_cols":18,"rows_kept":14,"cut":false,"hidden":false,"merged":[]}
[]
[null,null,{"$f":"'A1.1 Distributor Information'!C3","v":"EPCOR Natural Gas Limited Partnership"}]
[null,null,{"$f":"'A1.1 Distributor Information'!C4","v":"OEB Application Number:  EB-2024-0238  Exhibit A - 2025 Custom Incentive Application"}]
[]
[null,null,"Proposed Distribution Tariff Sheet Rates"]
[null,null,{"$f":"MID(CELL(\"filename\",A1),FIND(\"]\",CELL(\"filename\",A1))+1,255)","v":"E1.1 Proposed Dist Rates "}]
[]
[null,null,"Rate Class",null,"Monthly Base",{"$f":"OneDollar","v":"Bill 32 Rate"},"Tier 1","Tier 2","Tier 3","Contract Demand","Gas Supply","Upstream Recovery \nCharge","Transportation & \nStorage Charge","Transportation Charge \nFrom Dawn","Transportation Charge \nFrom Kirkwall","Transportation Charge From Parkway","Federal Carbon Charge","Facililty Carbon Charge"]
[null,null,null,null,"$/month","$/month","₵ / m3","₵ / m3","₵ / m3","₵/contracted m3","₵/m3","(A)","₵  / m3","₵ /contracted m3","₵ /contracted m3","₵ /contracted m3","₵ / m3","₵ / m3"]
[null,null,"Rate 1","General Firm Service",{"$f":"INDEX('D1.1 Rate 1 Adjustment'!$G$17:$G$26,MATCH(E$8,'D1.1 Rate 1 Adjustment'!$C$17:$C$26,0))","v":27.997484218863598},{"$f":"INDEX('D1.1 Rate 1 Adjustment'!$G$17:$G$26,MATCH(F$8,'D1.1 Rate 1 Adjustment'!$C$17:$C$26,0))","v":1},{"$f":"INDEX('D1.1 Rate 1 Adjustment'!$G$17:$G$26,MATCH(G$8,'D1.1 Rate 1 Adjustment'!$C$17:$C$26,0))","v":29.992083057283196},{"$f":"INDEX('D1.1 Rate 1 Adjustment'!$G$17:$G$26,MATCH(H$8,'D1.1 Rate 1 Adjustment'!$C$17:$C$26,0))","v":29.401222312373353},{"$f":"INDEX('D1.1 Rate 1 Adjustment'!$G$17:$G$26,MATCH(I$8,'D1.1 Rate 1 Adjustment'!$C$17:$C$26,0))","v":28.532788598221657},null,{"$f":"INDEX('D1.1 Rate 1 Adjustment'!$G$17:$G$26,MATCH(K$8,'D1.1 Rate 1 Adjustment'!$C$17:$C$26,0))","v":12.9848},{"$f":"INDEX('D1.1 Rate 1 Adjustment'!$G$17:$G$26,MATCH(L$8,'D1.1 Rate 1 Adjustment'!$C$17:$C$26,0))","v":1.474},{"$f":"INDEX('D1.1 Rate 1 Adjustment'!$G$17:$G$26,MATCH(M$8,'D1.1 Rate 1 Adjustment'!$C$17:$C$26,0))","v":2.6981999999999999},null,null,null,{"$f":"INDEX('D1.1 Rate 1 Adjustment'!$G$17:$G$26,MATCH(Q$8,'D1.1 Rate 1 Adjustment'!$C$17:$C$26,0))","v":15.25},1.1000000000000001E-3]
{"$rows_left_out":5}
{"sheet":"E1.2 Billing Determinants","index":11,"n_rows":14,"n_cols":10,"rows_kept":14,"cut":false,"hidden":false,"merged":[]}
[]
[null,null,{"$f":"'A1.1 Distributor Information'!C3","v":"EPCOR Natural Gas Limited Partnership"}]
[null,null,{"$f":"'A1.1 Distributor Information'!C4","v":"OEB Application Number:  EB-2024-0238  Exhibit A - 2025 Custom Incentive Application"}]
[]
[null,null,"Billing Determinants"]
[null,null,{"$f":"MID(CELL(\"filename\",A1),FIND(\"]\",CELL(\"filename\",A1))+1,255)","v":"E1.2 Billing Determinants"}]
[]
[]
[null,null,"Rate Class","Description","Base","Tier 1","Tier 2","Tier 3","Firm Demand","Gas Supply"]
[null,null,null,null,"cx's","m3","m3","m3","Contracted m3","m3"]
{"$rows_left_out":5}
{"sheet":"E1.3 Proposed Rev From Rate","index":12,"n_rows":18,"n_cols":15,"rows_kept":18,"cut":false,"hidden":false,"merged":[]}
[]
[null,null,{"$f":"'A1.1 Distributor Information'!C3","v":"EPCOR Natural Gas Limited Partnership"}]
[null,null,{"$f":"'A1.1 Distributor Information'!C4","v":"OEB Application Number:  EB-2024-0238  Exhibit A - 2025 Custom Incentive Application"}]
[]
[null,null,"Proposed Revenue from Rates"]
[]
[null,null,"Months / Year",12]
[]
[null,null,"Rate Class",null,"Monthly Base",{"$f":"OneDollar","v":"Bill 32 Rate"},"Tier 1","Tier 2","Tier 3","Contracted\nDemand","Gas Supply","Upstream Recovery \nCharge","Transportation & \nStorage Charge","Federal Carbon \nCharge","Total"]
[null,null,null,null,null,null,null,null,null,null,null,null,"(A)"]
{"$rows_left_out":9}
{"sheet":"F1.3 Proposed Rate Riders","index":13,"n_rows":57,"n_cols":6,"rows_kept":57,"cut":false,"hidden":false,"merged":[]}
[]
[null,null,{"$f":"'A1.1 Distributor Information'!C3","v":"EPCOR Natural Gas Limited Partnership"}]
[null,null,{"$f":"'A1.1 Distributor Information'!C4","v":"OEB Application Number:  EB-2024-0238  Exhibit A - 2025 Custom Incentive Application"}]
[null,null,"F1.3 Rate Riders"]
[]
[null,null,"Delay in Revenue Recovery Rate Rider"]
[null,null,null,null,"Delay in Revenue Recovery Rate Rider"]
[]
[null,null,"Rate 1 | General Firm Service",null,1.633,"Cents/m3"]
[null,null,"Rate 6 | Large Volume General Firm Service",null,0.90900000000000003,"Cents/m3"]
{"$rows_left_out":48}
{"sheet":"G1.1 Rate 1 Bill Impact","index":14,"n_rows":189,"n_cols":12,"rows_kept":189,"cut":false,"hidden":false,"merged":[]}
[]
[null,null,{"$f":"'A1.1 Distributor Information'!C3","v":"EPCOR Natural Gas Limited Partnership"}]
[null,null,{"$f":"'A1.1 Distributor Information'!C4","v":"OEB Application Number:  EB-2024-0238  Exhibit A - 2025 Custom Incentive Application"}]
[]
[null,null,"Rate 1 Delivery Bill Impact"]
[null,null,"G1.1 Rate 1 Bill Impact"]
[]
[null,null,"Rate 1"]
[]
[null,null,"Rate 1 - Existing Residential",null,"Units","Current Rate",null,"Proposed Rate"]
{"$rows_left_out":180}
{"sheet":"G1.2 Rate 6 Bill Impact","index":15,"n_rows":97,"n_cols":12,"rows_kept":97,"cut":false,"hidden":false,"merged":[]}
[]
[null,null,{"$f":"'A1.1 Distributor Information'!C3","v":"EPCOR Natural Gas Limited Partnership"}]
[null,null,{"$f":"'A1.1 Distributor Information'!C4","v":"OEB Application Number:  EB-2024-0238  Exhibit A - 2025 Custom Incentive Application"}]
[]
[null,null,"Rate 6 Delivery Bill Impact"]
[null,null,"G1.2 Rate 6 Bill Impact"]
[]
[null,null,"Rate 6 - Medium Commercial",null,"Units","Current Rate",null,"Proposed Rate"]
[]
[null,null,"Customer",null,"$/month",{"$f":"INDEX('B1.1 Current Distribution Rates'!$E$10:$Q$13,2,COUNTA($C$10:C10))","v":111.93205400000001},null,{"$f":"INDEX('E1.1 Proposed Dist Rates '!$E$10:$Q$13,2,COUNTA($C$10:C10))","v":114.1725083792748}]
{"$rows_left_out":88}
{"sheet":"G1.3 Rate 11 Bill Impact","index":16,"n_rows":96,"n_cols":12,"rows_kept":96,"cut":false,"hidden":false,"merged":[]}
[]
[null,null,{"$f":"'A1.1 Distributor Information'!C3","v":"EPCOR Natural Gas Limited Partnership"}]
[null,null,{"$f":"'A1.1 Distributor Information'!C4","v":"OEB Application Number:  EB-2024-0238  Exhibit A - 2025 Custom Incentive Application"}]
[]
[null,null,"Rate 11 Delivery Bill Impact"]
[null,null,{"$f":"MID(CELL(\"filename\",A1),FIND(\"]\",CELL(\"filename\",A1))+1,255)","v":"G1.3 Rate 11 Bill Impact"}]
[]
[null,null,"Rate 11 - Large Seasonal Service Sample Dryer 1",null,"Units","Current Rate",null,"Proposed Rate"]
[]
[null,null,"Customer",null,"$/month",{"$f":"INDEX('B1.1 Current Distribution Rates'!$E$10:$Q$13,3,COUNTA($C10:C$10))","v":223.86410800000002},null,{"$f":"INDEX('E1.1 Proposed Dist Rates '!$E$10:$Q$13,3,COUNTA($C10:C$10))","v":228.3450167585496}]
{"$rows_left_out":87}
{"sheet":"G1.4 Rate 16 Bill Impact","index":17,"n_rows":55,"n_cols":12,"rows_kept":55,"cut":false,"hidden":false,"merged":[]}
[]
[null,null,{"$f":"'A1.1 Distributor Information'!C3","v":"EPCOR Natural Gas Limited Partnership"}]
[null,null,{"$f":"'A1.1 Distributor Information'!C4","v":"OEB Application Number:  EB-2024-0238  Exhibit A - 2025 Custom Incentive Application"}]
[]
[null,null,"Rate 16 Delivery Bill Impact"]
[null,null,{"$f":"MID(CELL(\"filename\",A1),FIND(\"]\",CELL(\"filename\",A1))+1,255)","v":"G1.4 Rate 16 Bill Impact"}]
[]
[null,null,"Rate 16 - Contracted Demand",null,"Units","Current Rate",null,"Proposed Rate"]
[]
[null,null,"Customer",null,"$/month",{"$f":"INDEX('B1.1 Current Distribution Rates'!$E$10:$Q$13,4,COUNTA($C$10:C10))","v":1646.034926},null,{"$f":"INDEX('E1.1 Proposed Dist Rates '!$E$10:$Q$13,4,COUNTA($C$10:C10))","v":1678.9822902858011}]
{"$rows_left_out":46}
{"sheet":"G1.7 Summary of Bill Impacts","index":18,"n_rows":18,"n_cols":19,"rows_kept":18,"cut":false,"hidden":false,"merged":[]}
[]
[null,null,{"$f":"'A1.1 Distributor Information'!C3","v":"EPCOR Natural Gas Limited Partnership"}]
[null,null,{"$f":"'A1.1 Distributor Information'!C4","v":"OEB Application Number:  EB-2024-0238  Exhibit A - 2025 Custom Incentive Application"}]
[]
[null,null,"Summary of Bill Impacts"]
[]
[null,null,{"$f":"MID(CELL(\"filename\",A1),FIND(\"]\",CELL(\"filename\",A1))+1,255)","v":"G1.7 Summary of Bill Impacts"}]
[null,null,"Rate Class",null,"Fixed Charge",{"$f":"E8","v":"Fixed Charge"},{"$f":"OneDollar","v":"Bill 32 Rate"},"Volumetric Charge",{"$f":"H8","v":"Volumetric Charge"},"Rate Riders",{"$f":"J8","v":"Rate Riders"},"Upstream Recovery \nCharge","Transportation & \nStorage Charge","Federal Carbon Charge Change","Total",{"$f":"O8","v":"Total"},null,null,"Check"]
[null,null,null,null,"($/year)","(%)","($/year)","($/year)","(%)","($/year)","(%)","($/year)","($/year)","($/year)","($/year)","(%)"]
[null,null,"Rate 1","Existing Residential",{"$f":"'G1.1 Rate 1 Bill Impact'!J32","v":6.592874626363141},{"$f":"'G1.1 Rate 1 Bill Impact'!L32","v":2.0016199999999821E-2},{"$f":"'G1.1 Rate 1 Bill Impact'!J33","v":0},{"$f":"SUM('G1.1 Rate 1 Bill Impact'!J34:J37)","v":12.514805694034749},{"$f":"F10","v":2.0016199999999821E-2},{"$f":"'G1.1 Rate 1 Bill Impact'!J51","v":121.66065069374365},{"$f":"'G1.1 Rate 1 Bill Impact'!L51","v":3.2191977371262763},{"$f":"'G1.1 Rate 1 Bill Impact'!J39","v":0},{"$f":"'G1.1 Rate 1 Bill Impact'!J40","v":0},{"$f":"'G1.1 Rate 1 Bill Impact'!J41","v":0},{"$f":"E10+H10+J10","v":140.76833101414155},{"$f":"'G1.1 Rate 1 Bill Impact'!L53","v":8.2764519398384848E-2},null,null,{"$f":"'G1.1 Rate 1 Bill Impact'!J53-O10","v":0}]
{"$rows_left_out":9}
{"sheet":"Staff-2","index":19,"n_rows":151,"n_cols":22,"rows_kept":151,"cut":false,"hidden":false,"merged":[[2,18,2,21],[2,16,2,17]]}
[]
[{"$f":"'A1.1 Distributor Information'!C3","v":"EPCOR Natural Gas Limited Partnership"},null,null,null,null,null,null,null,null,null,null,null,null,null,null,"A","B","C","D","E","F","G"]
["OEB Staff-2 Bill Impacts",null,null,null,null,null,null,null,null,null,null,null,null,null,null,"Usage","CVVA",null,"Total Bill"]
[null,null,null,null,null,null,null,null,null,null,null,null,null,null,null,"m3","Fixed ","Variable","Fixed","Variable","Variance $","Variance %"]
["Rate 1 Delivery Bill Impact"]
["G1.1 Rate 1 Bill Impact"]
[]
["Rate 1"]
[]
["Rate 1 Residential - Average Usage",null,"Units","Fixed CVVA","Variable CVVA","Variance $","Variance %",null,null,null,null,null,null,1,"Average User",{"$f":"C35+C36","v":2149},{"$f":"D51","v":64.44},{"$f":"E52","v":92.400525374306213},{"$f":"D55","v":1841.5977690074544},{"$f":"E55","v":1869.5582943817606},{"$f":"R10-Q10","v":27.960525374306215},{"$f":"G55","v":1.5182753717917306E-2}]
{"$rows_left_out":142}
{"sheet":"Staff-2 CVVA Calculation","index":20,"n_rows":13,"n_cols":4,"rows_kept":13,"cut":false,"hidden":false,"merged":[]}
["CVVA Fixed Rate Rider"]
[null,null,"A","B"]
[null,null,"Unit","Rate 1"]
[1,"Customer Count","#",{"$f":"'B1.2 Billing Determinants'!E9","v":5516}]
[2,"Sum","$",355611.74182002997]
[3,"Rate Rider","$/month",{"$f":"D5/D4/12","v":5.3724278133313694}]
[]
["CVVA Variable Rate Rider"]
[null,null,"A","B"]
[null,null,"Unit","Rate 1"]
{"$rows_left_out":3}