{"text_format":"1","workbook":"xlsx","n_sheets":43,"sheets":["LDC Info","Index","App.2-A_Capital Projects","App.2-B_Fixed Asset Con'ty 2007","App.2-B_Fixed Asset Con'ty 2008","App.2-B_Fixed Asset Con'ty 2009","App.2-B_Fixed Asset Con'ty 2010","App.2-B_Fixed Asset Con'ty 2011","App.2-B_FA Con'ty 2012 CGAAP","App.2-B_Fixed Asset Con'ty 2013","App.2-CE_CGAAP_DepExp_2011","App.2-CF_CGAAP_DepExp_2012","App.2-CG_EUL_DepExp_2013","App.2-D_Overhead","App.2-F_Other_Oper_Rev","App.2-G_Detailed_OM&A_Expenses","App.2-H_OM&A_Detailed_Analysis","App.2-I_OM&A_Summary_Analys","App.2-J_OM&A_Cost _Drivers","App.2-K_Employee Costs","App.2-L_OM&A_per_Cust_FTEE","App.2-M_Regulatory_Costs","App.2-N_Corp_Cost_Allocation","App.2-OA Capital Structure","App.2-OB_Debt Instruments","App.2-P_Cost_Allocation","App.2-R_Loss Factors","App.2-S_Stranded Meters","App.2-T_1592_Tax_Variance","App.2-U_IFRS Transition Costs","App.2-V_Rev_Reconciliation","App.2-W Bill Impacts","App.2-X_CoS_Flowchart","App.2-B_FA Con'ty 2012 MIFRS NA","App.2-CA_CGAAP_DepExp_2011","App.2-CB_MIFRS_DepExp_2011","App.2-CC_MIFRS_DepExp_2012","App.2-CD_MIFRS_DepExp_2013","App.2-CI_AltAccStd_DepExp","App.2-EA_PP&E Deferral Account","App.2-CH_MIFRS_DepExp_2013 NA","App.2-EB_PP&E Deferral Acct NA","App.2-Q_Cost of Serv. Emb. Dx"],"not_rendered":{"charts":0,"images":3,"macros":1,"external_links":6,"defined_names":81,"comments":0,"pivot_tables":0},"unopened":[],"bounds":{"document_bytes":16777216,"sheet_cells":100000,"rows_first":2000,"rows_last":500,"rows_between":2000,"halvings":0,"cell_chars":16384,"cell_head_chars":4096},"cells_cut":0,"cells_raw":0,"read":"whole","date_system":"1900"}

{"sheet":"LDC Info","index":0,"n_rows":80,"n_cols":27,"rows_kept":80,"cut":false,"hidden":false,"merged":[[19,4,19,10],[33,2,33,11],[37,2,37,12],[13,4,13,10],[15,4,15,8],[17,4,17,8],[21,4,21,8],[23,4,23,8],[25,4,25,6],[27,4,27,6],[35,2,35,13],[29,4,29,6]]}
[]
[]
[null,null,null,null,null,null,null,null,null,null,null,null,null,null,null,null,null,null,null,null,null,null,null,null,null,null,"Algoma Power Inc."]
[null,null,null,null,null,null,null,null,null,null,null,null,null,null,null,null,null,null,null,null,null,null,null,null,null,null,"Atikokan Hydro Inc."]
[null,null,null,null,null,null,null,null,null,null,null,null,null,null,null,null,null,null,null,null,null,null,null,null,null,null,"Attawapiskat Power Corporation"]
[null,null,null,null,null,null,null,null,null,null,null,null,null,null,null,null,null,null,null,null,null,null,null,null,null,null,"Bluewater Power Distribution Corp."]
[null,null,null,null,null,null,null,null,null,null,null,null,null,null,null,null,null,null,null,null,null,null,null,null,null,null,"Brant County Power"]
[null,null,null,null,null,null,null,null,null,null,null,null,null,null,null,null,null,null,null,null,null,null,null,null,null,null,"Brantford Power Inc."]
[null,null,null,null,null,null,null,null,null,null,null,null,null,null,null,null,null,null,null,null,null,null,null,null,null,null,"Burlington Hydro Inc."]
[null,null,null,null,null,null,null,null,null,null,null,null,null,null,null,null,null,null,null,null,null,null,null,null,null,null,"Cambridge and North Dumfries Hydro"]
[null,null,null,null,null,null,null,null,null,null,null,null,null,null,null,null,null,null,null,null,null,null,null,null,null,null,"Canadian Niagara Power Inc. – Eastern Ontario Power/Fort Erie/Port Colborne"]
[null,null,null,null,null,null,null,null,null,null,null,null,null,null,null,null,null,null,null,null,null,null,null,null,null,null,"Centre Wellington Hydro Ltd."]
[null,null,null,null,null,null,null,null,null,null,null,null,null,"Version 1.1",null,null,null,null,null,null,null,null,null,null,null,null,"Chapleau Public Utilities Corporation"]
[null,null,null,"Utility Name   ","Greater Sudbury Hydro Inc.",null,null,null,null,null,null,null,null,null,null,null,null,null,null,null,null,null,null,null,null,null,"COLLUS Power Corp."]
[null,null,null,null,null,null,null,null,null,null,null,null,null,null,null,null,null,null,null,null,null,null,null,null,null,null,"Cooperative Hydro Embrun Inc."]
[null,null,null,"Service Territory",null,null,null,null,null,null,null,null,null,null,null,null,null,null,null,null,null,null,null,null,null,null,"E.L.K. Energy Inc."]
[null,null,null,null,null,null,null,null,null,null,null,null,null,null,null,null,null,null,null,null,null,null,null,null,null,null,"Enersource Hydro Mississauga Inc."]
[null,null,null,"Assigned EB Number","EB-2012-0126",null,null,null,null,null,null,null,null,null,null,null,null,null,null,null,null,null,null,null,null,null,"Entegrus Powerlines Inc."]
[null,null,null,null,null,null,null,null,null,null,null,null,null,null,null,null,null,null,null,null,null,null,null,null,null,null,"ENWIN Utilities Ltd."]
[null,null,null,"Name of Contact and Title","Nancy Whissell, Vice-President, Corporate Services",null,null,null,null,null,null,null,null,null,null,null,null,null,null,null,null,null,null,null,null,null,"Erie Thames Powerlines Corp."]
[null,null,null,null,null,null,null,null,null,null,null,null,null,null,null,null,null,null,null,null,null,null,null,null,null,null,"Espanola Regional Hydro Distribution Corporation"]
[null,null,null,"Phone Number   ","705-675-0509",null,null,null,null,null,null,null,null,null,null,null,null,null,null,null,null,null,null,null,null,null,"Essex Powerlines Corporation"]
[null,null,null,null,null,null,null,null,null,null,null,null,null,null,null,null,null,null,null,null,null,null,null,null,null,null,"Festival Hydro Inc."]
[null,null,null,"Email Address   ","nancyw@shec.com",null,null,null,null,null,null,null,null,null,null,null,null,null,null,null,null,null,null,null,null,null,"Fort Albany Power Corporation"]
[null,null,null,null,null,null,null,null,null,null,null,null,null,null,null,null,null,null,null,null,null,null,null,null,null,null,"Fort Frances Power Corporation"]
[null,null,null,"Bridge Year",2012,null,null,null,null,null,null,null,null,null,null,null,null,null,null,null,null,null,null,null,null,null,"Greater Sudbury Hydro Inc."]
[null,null,null,null,null,null,null,null,null,null,null,null,null,null,null,null,null,null,null,null,null,null,null,null,null,null,"Grimsby Power Inc."]
[null,null,null,"Test Year",2013,null,null,null,null,null,null,null,null,null,null,null,null,null,null,null,null,null,null,null,null,null,"Guelph Hydro Electric Systems Inc."]
[null,null,null,null,null,null,null,null,null,null,null,null,null,null,null,null,null,null,null,null,null,null,null,null,null,null,"Haldimand County Hydro Inc."]
[null,null,null,"Last Rebasing Year",2009,null,null,null,null,null,null,null,null,null,null,null,null,null,null,null,null,null,null,null,null,null,"Guelph Hydro Electric Systems Inc."]
[null,null,null,null,null,null,null,null,null,null,null,null,null,null,null,null,null,null,null,null,null,null,null,null,null,null,"Halton Hills Hydro Inc."]
[null,"Notes",null,null,null,null,null,null,null,null,null,null,null,null,null,null,null,null,null,null,null,null,null,null,null,null,"Hearst Power Distribution Co. Ltd."]
[null,null,null,null,null,null,null,null,null,null,null,null,null,null,null,null,null,null,null,null,null,null,null,null,null,null,"Horizon Utilities Corporation"]
[null,null,"Pale green cells represent input cells.",null,null,null,null,null,null,null,null,null,null,null,null,null,null,null,null,null,null,null,null,null,null,null,"Hydro 2000 Inc."]
[null,null,null,null,null,null,null,null,null,null,null,null,null,null,null,null,null,null,null,null,null,null,null,null,null,null,"Hydro Hawkesbury Inc."]
[null,null,"Pale blue cells represent drop-down lists.  The applicant should select the appropriate item from the drop-down list.",null,null,null,null,null,null,null,null,null,null,null,null,null,null,null,null,null,null,null,null,null,null,null,"Hydro One Brampton Networks Inc."]
[null,null,null,null,null,null,null,null,null,null,null,null,null,null,null,null,null,null,null,null,null,null,null,null,null,null,"Hydro One Networks Inc."]
[null,null,"White cells contain fixed values, automatically generated values or formulae. ",null,null,null,null,null,null,null,null,null,null,null,null,null,null,null,null,null,null,null,null,null,null,null,"Hydro One Remote Communities Inc."]
[null,null,null,null,null,null,null,null,null,null,null,null,null,null,null,null,null,null,null,null,null,null,null,null,null,null,"Hydro Ottawa Limited"]
[null,null,null,null,null,null,null,null,null,null,null,null,null,null,null,null,null,null,null,null,null,null,null,null,null,null,"Innisfil Hydro Dist. Systems Limited"]
[null,null,null,null,null,null,null,null,null,null,null,null,null,null,null,null,null,null,null,null,null,null,null,null,null,null,"Kashechewan Power Corporation"]
[null,null,null,null,null,null,null,null,null,null,null,null,null,null,null,null,null,null,null,null,null,null,null,null,null,null,"Kenora Hydro Electric Corporation Ltd."]
[null,null,null,null,null,null,null,null,null,null,null,null,null,null,null,null,null,null,null,null,null,null,null,null,null,null,"Kingston Hydro Corporation"]
[null,null,null,null,null,null,null,null,null,null,null,null,null,null,null,null,null,null,null,null,null,null,null,null,null,null,"Kitchener-Wilmot Hydro Inc."]
[null,null,null,null,null,null,null,null,null,null,null,null,null,null,null,null,null,null,null,null,null,null,null,null,null,null,"Lakefront Utilities Inc."]
[null,null,null,null,null,null,null,null,null,null,null,null,null,null,null,null,null,null,null,null,null,null,null,null,null,null,"Lakeland Power Distribution Ltd."]
[null,null,null,null,null,null,null,null,null,null,null,null,null,null,null,null,null,null,null,null,null,null,null,null,null,null,"London Hydro Inc."]
[null,null,null,null,null,null,null,null,null,null,null,null,null,null,null,null,null,null,null,null,null,null,null,null,null,null,"Midland Power Utility Corporation"]
[null,null,null,null,null,null,null,null,null,null,null,null,null,null,null,null,null,null,null,null,null,null,null,null,null,null,"Milton Hydro Distribution Inc."]
[null,null,null,null,null,null,null,null,null,null,null,null,null,null,null,null,null,null,null,null,null,null,null,null,null,null,"Newmarket – Tay Power Distribution Ltd."]
[null,null,null,null,null,null,null,null,null,null,null,null,null,null,null,null,null,null,null,null,null,null,null,null,null,null,"Niagara Peninsula Energy Inc."]
[null,null,null,null,null,null,null,null,null,null,null,null,null,null,null,null,null,null,null,null,null,null,null,null,null,null,"Niagara-on-the-Lake Hydro Inc."]
[null,null,null,null,null,null,null,null,null,null,null,null,null,null,null,null,null,null,null,null,null,null,null,null,null,null,"Norfolk Power Distribution Ltd."]
[null,null,null,null,null,null,null,null,null,null,null,null,null,null,null,null,null,null,null,null,null,null,null,null,null,null,"North Bay Hydro Distribution Limited"]
[null,null,null,null,null,null,null,null,null,null,null,null,null,null,null,null,null,null,null,null,null,null,null,null,null,null,"Northern Ontario Wires Inc."]
[null,null,null,null,null,null,null,null,null,null,null,null,null,null,null,null,null,null,null,null,null,null,null,null,null,null,"Oakville Hydro Distribution Inc."]
[null,null,null,null,null,null,null,null,null,null,null,null,null,null,null,null,null,null,null,null,null,null,null,null,null,null,"Orangeville Hydro Limited"]
[null,null,null,null,null,null,null,null,null,null,null,null,null,null,null,null,null,null,null,null,null,null,null,null,null,null,"Orillia Power Distribution Corp."]
[null,null,null,null,null,null,null,null,null,null,null,null,null,null,null,null,null,null,null,null,null,null,null,null,null,null,"Oshawa PUC Networks Inc."]
[null,null,null,null,null,null,null,null,null,null,null,null,null,null,null,null,null,null,null,null,null,null,null,null,null,null,"Ottawa River Power Corporation"]
[null,null,null,null,null,null,null,null,null,null,null,null,null,null,null,null,null,null,null,null,null,null,null,null,null,null,"Parry Sound Power Corporation"]
[null,null,null,null,null,null,null,null,null,null,null,null,null,null,null,null,null,null,null,null,null,null,null,null,null,null,"Peterborough Distribution Inc."]
[null,null,null,null,null,null,null,null,null,null,null,null,null,null,null,null,null,null,null,null,null,null,null,null,null,null,"PowerStream Inc."]
[null,null,null,null,null,null,null,null,null,null,null,null,null,null,null,null,null,null,null,null,null,null,null,null,null,null,"PUC Distribution Inc."]
[null,null,null,null,null,null,null,null,null,null,null,null,null,null,null,null,null,null,null,null,null,null,null,null,null,null,"Renfrew Hydro Inc."]
[null,null,null,null,null,null,null,null,null,null,null,null,null,null,null,null,null,null,null,null,null,null,null,null,null,null,"Rideau St. Lawrence Distribution Inc."]
[null,null,null,null,null,null,null,null,null,null,null,null,null,null,null,null,null,null,null,null,null,null,null,null,null,null,"St. Thomas Energy Inc."]
[null,null,null,null,null,null,null,null,null,null,null,null,null,null,null,null,null,null,null,null,null,null,null,null,null,null,"Sioux Lookout Hydro Inc."]
[null,null,null,null,null,null,null,null,null,null,null,null,null,null,null,null,null,null,null,null,null,null,null,null,null,null,"Thunder Bay Hydro Electricity Distribution"]
[null,null,null,null,null,null,null,null,null,null,null,null,null,null,null,null,null,null,null,null,null,null,null,null,null,null,"Tillsonburg Hydro Inc."]
[null,null,null,null,null,null,null,null,null,null,null,null,null,null,null,null,null,null,null,null,null,null,null,null,null,null,"Toronto Hydro-Electric System Limited"]
[null,null,null,null,null,null,null,null,null,null,null,null,null,null,null,null,null,null,null,null,null,null,null,null,null,null,"Veridian Connections Inc."]
[null,null,null,null,null,null,null,null,null,null,null,null,null,null,null,null,null,null,null,null,null,null,null,null,null,null,"Wasaga Distribution Inc."]
[null,null,null,null,null,null,null,null,null,null,null,null,null,null,null,null,null,null,null,null,null,null,null,null,null,null,"Waterloo North Hydro Inc."]
[null,null,null,null,null,null,null,null,null,null,null,null,null,null,null,null,null,null,null,null,null,null,null,null,null,null,"Welland Hydro Electric System Corp."]
[null,null,null,null,null,null,null,null,null,null,null,null,null,null,null,null,null,null,null,null,null,null,null,null,null,null,"Wellington North Power Inc."]
[null,null,null,null,null,null,null,null,null,null,null,null,null,null,null,null,null,null,null,null,null,null,null,null,null,null,"West Coast Huron Energy Inc."]
[null,null,null,null,null,null,null,null,null,null,null,null,null,null,null,null,null,null,null,null,null,null,null,null,null,null,"Westario Power Inc."]
[null,null,null,null,null,null,null,null,null,null,null,null,null,null,null,null,null,null,null,null,null,null,null,null,null,null,"Whitby Hydro Electric Corporation"]
[null,null,null,null,null,null,null,null,null,null,null,null,null,null,null,null,null,null,null,null,null,null,null,null,null,null,"Woodstock Hydro Services Inc."]

{"sheet":"Index","index":1,"n_rows":32,"n_cols":6,"rows_kept":32,"cut":false,"hidden":false,"merged":[]}
[]
[]
[]
[]
[]
[]
[]
[]
[]
[]
[]
[]
[]
[]
[1,"LDC Information Sheet",null,null,19,"Appendix 2-H OM&A Detailed Analysis"]
[2,"Index",null,null,20,"Appendix 2-I OM&A Summary Analysis"]
[3,"Appendix 2-A Capital Projects",null,null,21,"Appendix 2-J OM&A Cost  Drivers"]
[4,"Appendix 2-B Fixed Asset Continuity",null,null,22,"Appendix 2-K Employee Costs"]
[5,"Appendix 2-CA CGAAP Depreciation Expense 2011",null,null,23,"Appendix 2-L OM&A per Cust FTEE"]
[6,"Appendix 2-CB MIFRS Depreciation Expense 2011",null,null,24,"Appendix 2-M Regulatory Costs"]
[7,"Appendix 2-CC MIFRS Depreciation Expense 2012",null,null,25,"Appendix 2-N Corp Cost Allocation"]
[8,"Appendix 2-CD MIFRS Depreciation Expense 2013",null,null,26,"Appendix 2-OA Capital Structure and Cost of Capital"]
[9,"Appendix 2-CE CGAAP Depreciation Expense 2011",null,null,27,"Appendix 2-OB Debt Instruments"]
[10,"Appendix 2-CF CGAAP Depreciation Expense 2012",null,null,28,"Appendix 2-P Cost Allocation"]
[11,"Appendix 2-CG MIFRS Depreciation Expense 2012",null,null,29,"Appendix 2-Q Cost of Service Embedded Distributor"]
[12,"Appendix 2-CH MIFRS Depreciation Expense 2013",null,null,30,"Appendix 2-R Loss Factors"]
[13,"Appendix 2-CI Alternative Accounting Standards Depreciation Expense",null,null,31,"Appendix 2-S Stranded Meters"]
[14,"Appendix 2-D Overhead",null,null,32,"Appendix 2-T 1592 Tax Variance"]
[15,"Appendix 2-EA PP&E Deferral Account - 2012 IFRS Adopters",null,null,33,"Appendix 2-U IFRS Transition Costs"]
[16,"Appendix 2-EB PP&E Deferral Account - 2013 IFRS Adopters",null,null,34,"Appendix 2-V Rev Reconciliation"]
[17,"Appendix 2-F Other Operating Revenue",null,null,35,"Appendix 2-W Bill Impacts"]
[18,"Appendix 2-G Detailed OM&A Expenses",null,null,36,"Appendix 2-X CoS Flowchart"]

{"sheet":"App.2-A_Capital Projects","index":2,"n_rows":414,"n_cols":8,"rows_kept":414,"cut":false,"hidden":false,"merged":[[8,0,8,7],[9,0,9,7],[413,0,413,7]]}
[null,null,null,null,null,null,"File Number:",{"$f":"'LDC Info'!$E$18","v":"EB-2012-0126"}]
[null,null,null,null,null,null,"Exhibit:",2]
[null,null,null,null,null,null,"Tab:",4]
[null,null,null,null,null,null,"Schedule:",2]
[null,null,null,null,null,null,"Attachment:",1]
[]
[null,null,null,null,null,null,"Date:","9 November, 2012"]
[]
["Appendix 2-A"]
["Capital Projects Table"]
[]
[]
["Projects",{"$f":"IF(ISBLANK('LDC Info'!E26), \"Year 1\", 'LDC Info'!E26-5)","v":2007},{"$f":"IF(ISBLANK('LDC Info'!E26), \"Year 2\", 'LDC Info'!E26-4)","v":2008},{"$f":"IF(ISBLANK('LDC Info'!E26), \"Year 3\", 'LDC Info'!E26-3)","v":2009},{"$f":"IF(ISBLANK('LDC Info'!E26), \"Year 4\", 'LDC Info'!E26-2)","v":2010},{"$f":"IF(ISBLANK('LDC Info'!E26), \"Year 5\", 'LDC Info'!E26-1)","v":2011},{"$f":"'LDC Info'!E26 & \" Bridge Year\"","v":"2012 Bridge Year"},{"$f":"'LDC Info'!E28 & \" Test Year\"","v":"2013 Test Year"}]
["Reporting Basis","CGAAP","CGAAP","CGAAP","CGAAP","CGAAP","CGAAP","CGAAP"]
["Meter Installations"]
["Distribution Station Equipment <50kV",null,165841]
["Poles, Towers & Fixtures",null,null,null,350]
["Meters",{"$f":"228114+583.51","v":228697.51},144873,38348,30167,17453,107254,100000]
["Computer Software",null,2025]
["Contributions ",-3500,null,-39,-450,-4605,-1376]
["Sub-Total",{"$f":"SUM(B16:B20)","v":225197.51},312739,38309,30067,12848,105878,100000]
["Emergency Plant Replacement"]
["Distribution Station Equipment <50kV",null,null,null,51245]
["Poles, Towers & Fixtures",19469,null,58294,30094,44796,49211,16424]
["Overhead Conductors & Devices",17529,null,15787,13442,8378,9204,3072]
["Underground Conduit, Conductors & Devices",{"$f":"195011-1200","v":193811},260479,54671,48522,218855,{"$f":"24827+215598","v":240425},{"$f":"8286+71954","v":80240}]
["Line Transformers",2331,5634,12449,21462,40509,44502,14852]
["Services (Overhead & Underground)",null,null,null,null,31745,34873,11639]
["Sub-total",{"$f":"SUM(B22:B28)","v":233140},266113,141201,164765,344283,378215,126227]
["Failed Transformers"]
["Line Transformers",{"$f":"343766+26570","v":370336},{"$f":"44512+357","v":44869},182213,451953,151333,267362,130737]
["Sub-total",{"$f":"SUM(B30:B31)","v":370336},44869,182213,451953,151333,267362,130737]
["PCB"]
["Line Transformers",137343,25007,37204,74577,14811,155070,47368]
["Sub-Total",{"$f":"SUM(B34:B34)","v":137343},25007,37204,74577,14811,155070,47368]
["Major Substation Repairs"]
["Building Improvements",null,null,31716,{"$f":"3536+12253+18909+10296+16966+11060+30722","v":103742}]
["Buildings",168464,33960]
["Land",null,null,null,32745,null,5569]
["Distribution Station Equipment <50kV",304475,323397,437621,{"$f":"4515+8044+24962+4367+11066+46708+7663+54201+378","v":161904},{"$f":"129113+974+31404","v":161491},1379969,178800]
["Poles, Towers & Fixtures",null,4312,9701,{"$f":"15766","v":15766}]
["Overhead Conductors & Devices",null,null,5945]
["Underground Conduit, Conductors & Devices",{"$f":"7316+314","v":7630},null,11074,{"$f":"71549+32328+73","v":103950}]
["Contributions",null,-296171,null,null,-23335,-17766]
["Sub-total",{"$f":"SUM(B36:B44)","v":480569},65498,496057,418107,138156,1367772,178800]
["System Betterment"]
["Poles, Towers & Fixtures",{"$f":"382351+322+29790","v":412463},441832,408523,{"$f":"622561+34","v":622595},319718,462769,181940]
["Overhead Conductors & Devices",{"$f":"442160+60","v":442220},{"$f":"540970-1028","v":539942},127526,{"$f":"272761-41","v":272720},6970,105628,41528]
["Underground Conduit, Conductors & Devices",358860,289408,175824,314831,109734,{"$f":"100363+95753+1","v":196117},{"$f":"39458+37646","v":77104}]
["Line Transformers",137914,{"$f":"167190-2884","v":164306},255545,172557,{"$f":"203881-187","v":203694},212363,83492]
["Services (Overhead & Underground)",null,null,null,6473,61537,47285,18590]
["Contributions ",{"$f":"-572600-34704","v":-607304},-272754,-46389,-25054,-37791,-1857]
["Sub-total",{"$f":"SUM(B46:B52)","v":744153},1162734,921029,1364122,663862,1022305,{"$f":"SUM(H46:H51)","v":402654}]
["Overhead Services"]
["Services (Overhead & Underground)",{"$f":"184024+13246","v":197270},{"$f":"160+207077","v":207237},189266,{"$f":"247922+2073","v":249995},245842,227842,162401]
["Contributions ",{"$f":"-106436-17369","v":-123805},-112922,-97301,-98341,-91262,-61818,-100000]
["Sub-total",{"$f":"SUM(B54:B56)","v":73465},94315,91965,151654,154580,166024,62401]
["Underground Services"]
["Services (Overhead & Underground)",{"$f":"157598+5376","v":162974},{"$f":"195477+219","v":195696},{"$f":"161885+132","v":162017},{"$f":"237684+513","v":238197},243905,175961,141569]
["Contributions",{"$f":"-77075-4465","v":-81540},-82085,-70368,-80081,-87352,-68794,-80000]
["Sub-total",{"$f":"SUM(B58:B60)","v":81434},113611,91649,158116,156553,107167,61569]
["City Roadworks"]
["Poles, Towers & Fixtures",246176,30758,618,39998,4367,null,58230]
["Overhead Conductors & Devices",438921,19206,206,139688,7583,null,203359]
["Underground Conduit, Conductors & Devices",120140,7703,{"$f":"210332+88","v":210420},19566,1502,null,{"$f":"4380+24104","v":28484}]
["Line Transformers",88631,null,null,14462,null,null,21053]
["Services (Overhead & Underground)",null,null,null,19150,1644,null,27878]
["Contributions",-212456,-37030,-133245,-92174,-6280]
["Sub-total",{"$f":"SUM(B63:B68)","v":681412},20637,77999,140690,8816,0,339004]
["Subdivisions"]
["Poles, Towers & Fixtures",13202,19425,1038,null,106]
["Overhead Conductors & Devices",10544,15552,1308]
["Underground Conduit, Conductors & Devices",{"$f":"337533+24111","v":361644},368653,154874,226618,99980,{"$f":"189337+120775+1","v":310113},{"$f":"90530+57747","v":148277}]
["Line Transformers",{"$f":"61893+10658","v":72551},{"$f":"58662-2164","v":56498},{"$f":"26708+2164","v":28872},76386,59491,184528,88230]
["Services (Overhead & Underground)",null,null,null,null,11609,36008,17217]
["Contributions",{"$f":"-397107-20573","v":-417680},-417180,64834,-244001,-143953,-466732,-168254]
["Sub-total",{"$f":"SUM(B70:B76)","v":40261},42948,250926,59003,27233,63917,85470]
["Commercial Development"]
["Poles, Towers & Fixtures",{"$f":"8764+10198","v":18962},30729,35358,44150,69541,42615,30048]
["Overhead Conductors & Devices",{"$f":"19710+29205","v":48915},52751,31331,65580,51137,{"$f":"41106+91821+1","v":132928},28983]
["Underground Conduit, Conductors & Devices",153019,328184,370587,223041,314268,107702,{"$f":"64743+75940","v":140683}]
["Line Transformers",{"$f":"147955+28471","v":176426},350050,202172,518012,147539,215594,152014]
["Services (Overhead & Underground)",null,19055,null,235,7505,3263,2301]
["Meters",null,null,null,null,880]
["Contributions",{"$f":"-337922+960","v":-336962},-649155,-495587,-721333,-670625,-456002,-355536]
["Sub-Total",{"$f":"SUM(B79:B85)","v":60360},131614,143861,129685,-79755,46100,-1507]
["Building"]
["Carpet/Paint/Flooring",46495,{"$f":"54570","v":54570},null,null,8444]
["Fencing/Exterior/Roof",20859,null,{"$f":"18072+4856+11067+31620+5278","v":70893},{"$f":"10193+14152","v":24345},96434]
["Window/Doors",23489,8196]
["New Walls/Offices/Construction",5000,62099,{"$f":"92798.36+36770","v":129568.36},{"$f":"6250","v":6250},19045]
["Renovate washrooms",null,null,null,null,null,100000]
["Modifications to server room",null,null,null,null,null,{"$f":"6699+3414+15266","v":25379}]
["New Roof",null,null,null,null,null,155700]
["Lighting Conversion",null,null,null,null,null,null,{"$f":"27459+65801+16804","v":110064}]
["Geothermal Energy System",null,null,null,null,null,null,615221]
["Fuel Conversion",null,null,null,null,null,null,208000]
["Other Miscellaneous",467,7178.74,7992,{"$f":"11189+2844+7060-2038","v":19055},35428,29300,{"$f":"966000-SUM(H95:H97)","v":32715}]
["Sub-Total",{"$f":"SUM(B88:B98)","v":96310},132043.74,208453.36,49650,159351,310379,966000]
["Porcelain Insulator Replacement"]
["Poles, Towers & Fixtures",15557,2932,285808]
["Overhead Conductors & Devices",{"$f":"508372+1812","v":510184},271881,153513]
["Sub-Total",{"$f":"SUM(B101:B102)","v":525741},274813,439321,0,0,0,0]
["Pole Replacement Program"]
["Poles, Towers & Fixtures",112188,160976,246453,null,null,null,254383]
["Overhead Conductors & Devices",{"$f":"52653+76","v":52729},{"$f":"187897-1897","v":186000},205950]
["Line Transformers"]
["Contributions",null,null,-1805]
["Sub-total",{"$f":"SUM(B104:B108)","v":164917},346976,450598,0,0,0,254383]
["Tools & Equipment"]
["Tools, Shop & Garage Equipment",{"$f":"88204+1220","v":89424},180931,114715,74325,77854,152809,160000]
["Sub-total",{"$f":"SUM(B110:B111)","v":89424},180931,114715,74325,77854,152809,160000]
["Vehicles"]
["Small Vehicles (Trucks/Cars/Vans)",255827,{"$f":"41887+43579+26643+36466+36466+1296+127+429+373","v":187266},{"$f":"26077+40769+32623+46688+25721+29971+2763.72","v":204612.72},{"$f":"10222+43029","v":53251},46316,193456,40000]
["Trailers",null,{"$f":"13651+13414","v":27065},20236.5,{"$f":"34492+83948","v":118440},12600,null,20000]
["Large Vehicles (Step Vans/Bucket/Boom Trucks)",null,{"$f":"344780+300240","v":645020},270935,{"$f":"100811+268482","v":369293},{"$f":"151814.18+352220","v":504034.18},null,1058450]
["Sub-total",{"$f":"SUM(B113:B116)","v":255827},859351,495784.22,540984,562950.17999999993,193456,1118450]
["Sherwood Park (Phase I, II & III)"]
["Underground Conduit, Conductors & Devices",159705,727,8829,89981,249646]
["Line Transformers",null,null,null,51238,{"$f":"29943+257","v":30200}]
["Services (Overhead & Underground)",null,null,null,null,11117]
["Sub-total",{"$f":"SUM(B118:B121)","v":159705},727,8829,141219,290963,0,0]
["Albinson - Haig to Douglas"]
["Poles, Towers & Fixtures",5840]
["Overhead Conductors & Devices",105893]
["Line Transformers",11737]
["Sub-total",{"$f":"SUM(B123:B126)","v":123470},0,0,0,0,0,0]
["Tilton Lake"]
["Poles, Towers & Fixtures",94507,null,47818]
["Overhead Conductors & Devices",169087]
["Line Transformers",7433]
["Sub-total",{"$f":"SUM(B128:B131)","v":271027},0,47818,0,0,0,0]
["Falconbridge 44kV"]
["Distribution Station Equipment <50kV",null,45]
["Poles, Towers & Fixtures",null,74930]
["Overhead Conductors & Devices",null,54150]
["Underground Conduit, Conductors & Devices",null,103916]
["Sub-Total",{"$f":"SUM(B134:B137)","v":0},233041,0,0,0,0,0]
["Gary Avenue Rebuild"]
["Poles, Towers & Fixtures",null,215732,20472]
["Overhead Conductors & Devices",null,395597,136431]
["Underground Conduit, Conductors & Devices",null,109329,226595,{"$f":"1716+68","v":1784}]
["Line Transformers",null,3763,62572]
["Sub-Total",{"$f":"SUM(B140:B143)","v":0},724421,446070,1784,0,0,0]
["Webbwood Drive Rebuild"]
["Underground Conduit, Conductors & Devices",null,119240]
["Line Transformers",null,42499]
["Sub-total",{"$f":"SUM(B145:B147)","v":0},161739,0,0,0,0,0]
["Beatrice Underground Rebuild"]
["Underground Conduit, Conductors & Devices",null,null,184992]
["Sub-total",{"$f":"SUM(B149:B150)","v":0},0,184992,0,0,0,0]
["GIS"]
["Computer Software",null,null,302438,45300,52901,91500]
["Sub-total",{"$f":"SUM(B152:B153)","v":0},0,302438,45300,52901,91500,0]
["Jarvi Road Rebuild"]
["Poles, Towers & Fixtures",null,null,208082]
["Overhead Conductors & Devices",null,null,55469,5956]
["Line Transformers",null,null,6107]
["Sub-total",{"$f":"SUM(B155:B158)","v":0},0,269658,5956,0,0,0]
["Louis Street Rebuild"]
["Underground Conduit, Conductors & Devices",null,null,152478,156882,2206]
["Line Transformers",null,null,41793,22196]
["Sub-total",{"$f":"SUM(B160:B162)","v":0},0,194271,179078,2206,0,0]
["Montague to Whissell Rebuild"]
["Poles, Towers & Fixtures",null,null,437642,34038]
["Overhead Conductors & Devices",null,null,143447,135286]
["Underground Conduit, Conductors & Devices",null,null,5776]
["Line Transformers",null,null,56961,32770]
["Sub-total",{"$f":"SUM(B164:B168)","v":0},0,643826,202094,0,0,0]
["SCADA Software"]
["System Supervisory Equipment",null,10260,297472,15730,{"$f":"1800+17265","v":19065},675,346045]
["Sub-total",{"$f":"SUM(B170:B171)","v":0},10260,297472,15730,19065,675,346045]
["Southlane Road Rebuild"]
["Poles, Towers & Fixtures",null,null,111828,3485]
["Overhead Conductors & Devices",null,null,159844]
["Line Transformers",null,null,24488]
["Contributions ",null,null,-8311]
["Sub-total",{"$f":"SUM(B173:B177)","v":0},0,287849,3485,0,0,0]
["Sparks Street Rebuild"]
["Poles, Towers & Fixtures",null,null,74255,1834]
["Overhead Conductors & Devices",null,null,99634]
["Underground Conduit, Conductors & Devices",null,null,95792,1015]
["Line Transformers",null,null,145344,2456]
["Sub-total",{"$f":"SUM(B179:B183)","v":0},0,415025,5305,0,0,0]
["Falconbridge Voltage Conversion"]
["Poles, Towers & Fixtures",null,null,11360,12082]
["Overhead Conductors & Devices",null,null,36066,99169]
["Underground Conduit, Conductors & Devices",null,null,1497,35108]
["Line Transformers",null,null,null,60832]
["Sub-total",{"$f":"SUM(B185:B189)","v":0},0,48923,207191,0,0,0]
["Annie St. 4kV to 12kV Conversion"]
["Poles, Towers & Fixtures",null,null,2395,121314,65635]
["Overhead Conductors & Devices",null,null,null,359105,40889]
["Underground Conduit, Conductors & Devices",null,null,null,208805,21402]
["Line Transformers",null,null,null,396007,62896]
["Services (Overhead & Underground)",null,null,null,7850]
["Sub-Total",{"$f":"SUM(B192:B196)","v":0},0,2395,1093081,190822,0,0]
["CIS - Harris Billing System"]
["Computer Software",null,null,null,476702,11042]
["Sub-Total",{"$f":"SUM(B199:B199)","v":0},0,0,476702,11042,0,0]
["Kingsway Rebuild"]
["Poles, Towers & Fixtures",null,null,null,100585]
["Overhead Conductors & Devices",null,null,null,44544]
["Sub-total",{"$f":"SUM(B201:B203)","v":0},0,0,145129,0,0,0]
["Shaughnessy Rebuild"]
["Poles, Towers & Fixtures",null,null,null,7393]
["Overhead Conductors & Devices",null,null,null,10005,4882]
["Underground Conduit, Conductors & Devices",null,1407,4217,146326]
["Line Transformers",null,null,null,57667]
["Services (Overhead & Underground)",null,null,null,16381]
["Sub-total",{"$f":"SUM(B206:B210)","v":0},1407,4217,237772,4882,0,0]
["Automated Vehicle Locator",null,null,null,null,0]
["Computer Software",null,null,null,null,153987,7272]
["Sub-total",{"$f":"SUM(B212:B213)","v":0},0,0,0,153987,7272,0]
["Kennedy Street Rebuild"]
["Poles, Towers & Fixtures",null,null,null,null,55619,4134]
["Overhead Conductors & Devices",null,null,null,null,5634,{"$f":"944","v":944}]
["Underground Conduit, Conductors & Devices",null,null,null,null,59285,{"$f":"897+856","v":1753}]
["Line Transformers",null,null,null,null,8708,{"$f":"1897","v":1897}]
["Services (Overhead & Underground)",null,null,null,null,21225,422]
["Sub-total",{"$f":"SUM(B215:B220)","v":0},0,0,0,150471,9150,0]
["Beech Street Rebuild"]
["Poles, Towers & Fixtures",null,null,null,null,10221]
["Overhead Conductors & Devices",null,null,null,null,19647]
["Underground Conduit, Conductors & Devices",null,null,null,null,85868]
["Line Transformers",null,null,null,null,15444]
["Sub-total",{"$f":"SUM(B222:B226)","v":0},0,0,0,131180,0,0]
["Highway 69 South Rebuild"]
["Poles, Towers & Fixtures",null,null,null,null,290793]
["Overhead Conductors & Devices",null,null,null,null,255580]
["Line Transformers",null,null,null,null,5173]
["Sub-total",{"$f":"SUM(B228:B231)","v":0},0,0,0,551546,0,0]
["Kingsway Area"]
["Poles, Towers & Fixtures",null,null,null,null,220040]
["Overhead Conductors & Devices",null,null,null,null,179849]
["Underground Conduit, Conductors & Devices",null,null,null,null,631]
["Line Transformers",null,null,null,null,61374]
["Services (Overhead & Underground)",null,null,null,null,211902]
["Sub-Total",{"$f":"SUM(B234:B238)","v":0},0,0,0,673796,0,0]
["Lorne Street Rebuild"]
["Poles, Towers & Fixtures",null,null,null,null,246787,169383]
["Overhead Conductors & Devices",null,null,null,null,64836,143034]
["Line Transformers",null,null,null,null,null,26348]
["Services (Overhead & Underground)",null,null,null,null,12067,37641]
["Sub-Total",{"$f":"SUM(B241:B244)","v":0},0,0,0,323690,376406,0]
["Madison Avenue Rebuild"]
["Poles, Towers & Fixtures",null,null,null,null,142224]
["Overhead Conductors & Devices",null,null,null,null,37683]
["Underground Conduit, Conductors & Devices",null,null,null,null,14527]
["Line Transformers",null,null,null,null,51781]
["Services (Overhead & Underground)",null,null,null,null,63350]
["Meters",null,null,null,null,646]
["Sub-Total",{"$f":"SUM(B247:B252)","v":0},0,0,0,310211,0,0]
["Regent Street Rebuild"]
["Poles, Towers & Fixtures",null,null,null,null,136487,21255]
["Overhead Conductors & Devices",null,null,null,null,27723,914]
["Underground Conduit, Conductors & Devices",null,null,null,null,10480,657]
["Line Transformers",null,null,null,null,89315,22090]
["Services (Overhead & Underground)",null,null,null,null,4950,88663]
["Sub-Total",{"$f":"SUM(B255:B259)","v":0},0,0,0,268955,133579,0]
["Hebert/Garland Underground Rebuild"]
["Poles, Towers & Fixtures",null,null,null,null,null,7316]
["Underground Conduit, Conductors & Devices",null,null,null,null,null,{"$f":"164609+62185","v":226794}]
["Line Transformers",null,null,null,null,null,87791]
["Services (Overhead & Underground)",null,null,null,null,null,43896]
["Sub-Total",{"$f":"SUM(B262:B265)","v":0},0,0,0,0,365797,0]
["Copper Cliff Gardens Rebuild"]
["Poles, Towers & Fixtures",null,null,null,null,null,11151]
["Underground Conduit, Conductors & Devices",null,null,null,null,null,{"$f":"250896+94783","v":345679}]
["Line Transformers",null,null,null,null,null,133811]
["Services (Overhead & Underground)",null,null,null,null,null,66906]
["Sub-Total",{"$f":"SUM(B268:B271)","v":0},0,0,0,0,557547,0]
["Westmount Restricted Conductor"]
["Poles, Towers & Fixtures",null,null,null,null,null,287828]
["Overhead Conductors & Devices",null,null,null,null,null,{"$f":"243056","v":243056}]
["Line Transformers",null,null,null,null,null,44773]
["Services (Overhead & Underground)",null,null,null,null,null,63962]
["Sub-Total",{"$f":"SUM(B274:B277)","v":0},0,0,0,0,639619,0]
["Donwood Park - Underground Rebuild"]
["Poles, Towers & Fixtures",null,null,null,null,876,6998]
["Underground Conduit, Conductors & Devices",null,null,null,null,291390,{"$f":"157452+59482","v":216934}]
["Line Transformers",null,null,null,null,71107,83974]
["Services (Overhead & Underground)",null,null,null,null,65414,41987]
["Sub-Total",{"$f":"SUM(B280:B283)","v":0},0,0,0,428787,349893,0]
["Substation Security"]
["Communication Equipment",null,7335,19821,null,7757,66925,50000]
["Sub-Total",{"$f":"SUM(B286:B286)","v":0},7335,19821,0,7757,66925,50000]
["Control Room Electronic Mapping"]
["Computer Hardware",null,null,null,null,null,364238]
["Sub-Total",{"$f":"SUM(B289:B289)","v":0},0,0,0,0,364238,0]
["44kV Motorized Switches"]
["Overhead Conductors & Devices",null,null,{"$f":"81942+0.57","v":81942.570000000007},{"$f":"44163-0.34","v":44162.66},{"$f":"32886+0.29","v":32886.29},371850,433825]
["Sub-Total",{"$f":"SUM(B292:B292)","v":0},0,81942.570000000007,44162.66,32886.29,371850,433825]
["West Nipissing"]
["Poles, Towers & Fixtures",null,null,null,null,null,90370]
["Overhead Conductors & Devices",null,null,null,null,null,20627]
["Underground Conduit, Conductors & Devices",null,null,null,null,null,{"$f":"19599+18699","v":38298}]
["Line Transformers",null,null,null,null,null,41471]
["Services (Overhead & Underground)",null,null,null,null,null,9234]
["Sub-total",{"$f":"SUM(B294:B299)","v":0},0,0,0,0,200000,{"$f":"SUM(H294:H298)","v":0}]
["Vanier Lane Rebuild"]
["Poles, Towers & Fixtures",null,null,null,null,null,23868,97852]
["Overhead Conductors & Devices",null,null,null,null,null,1027,94239]
["Underground Conduit, Conductors & Devices",null,null,null,null,null,738,{"$f":"18065+5480","v":23545}]
["Line Transformers",null,null,null,null,null,24806,58711]
["Services (Overhead & Underground)",null,null,null,null,null,99561,26737]
["Sub-total",{"$f":"SUM(B301:B306)","v":0},0,0,0,0,150000,301084]
["Hillsdale, Mark, Lakeview Conversion"]
["Poles, Towers & Fixtures",null,null,null,null,null,null,90817]
["Overhead Conductors & Devices",null,null,null,null,null,null,45408]
["Line Transformers",null,null,null,null,null,null,136225]
["Services (Overhead & Underground)",null,null,null,null,null,null,30273]
["Sub-total",{"$f":"SUM(B308:B312)","v":0},0,0,0,0,0,{"$f":"SUM(H309:H312)","v":302723}]
["Prete, Benny Connaught Conversion"]
["Poles, Towers & Fixtures",null,null,null,null,null,null,53470]
["Overhead Conductors & Devices",null,null,null,null,null,null,26735]
["Line Transformers",null,null,null,null,null,null,80204]
["Services (Overhead & Underground)",null,null,null,null,null,null,17823]
["Sub-total",{"$f":"SUM(B314:B318)","v":0},0,0,0,0,0,178232]
["Gary/Madison Rebuild"]
["Poles, Towers & Fixtures",null,null,null,null,null,null,6693]
["Underground Conduit, Conductors & Devices",null,null,null,null,null,null,{"$f":"150597+56892","v":207489}]
["Line Transformers",null,null,null,null,null,null,80319]
["Services (Overhead & Underground)",null,null,null,null,null,null,{"$f":"40159+1","v":40160}]
["Sub-total",{"$f":"SUM(B320:B324)","v":0},0,0,0,0,0,334661]
["Eden Point Underground Rebuild"]
["Poles, Towers & Fixtures",null,null,null,null,null,null,4088]
["Underground Conduit, Conductors & Devices",null,null,null,null,null,null,{"$f":"91987+34751","v":126738}]
["Line Transformers",null,null,null,null,null,null,49060]
["Services (Overhead & Underground)",null,null,null,null,null,null,{"$f":"24530-1","v":24529}]
["Sub-total",{"$f":"SUM(B326:B330)","v":0},0,0,0,0,0,204415]
["Sunnyside Road Line Relocation to Road"]
["Poles, Towers & Fixtures",null,null,null,null,null,null,149501]
["Overhead Conductors & Devices",null,null,null,null,null,null,104651]
["Line Transformers",null,null,null,null,null,null,44850]
["Services (Overhead & Underground)",null,null,null,null,null,null,74751]
["Sub-total",{"$f":"SUM(B332:B336)","v":0},0,0,0,0,0,{"$f":"SUM(H333:H336)","v":373753}]
["West Nipissing Conversion"]
["Poles, Towers & Fixtures",null,null,null,null,null,null,90817]
["Overhead Conductors & Devices",null,null,null,null,null,null,45408]
["Line Transformers",null,null,null,null,null,null,136225]
["Services (Overhead & Underground)",null,null,null,null,null,null,30272]
["Sub-total",{"$f":"SUM(B338:B342)","v":0},0,0,0,0,0,{"$f":"SUM(H339:H342)","v":302722}]
["McFarlane Road"]
["Poles, Towers & Fixtures",null,null,null,null,null,87500,186245]
["Overhead Conductors & Devices",null,null,null,null,null,62500,133032]
["Line Transformers",null,null,null,null,null,37500,79819]
["Services (Overhead & Underground)",null,null,null,null,null,62500,133032]
["Sub-total",{"$f":"SUM(B344:B348)","v":0},{"$f":"SUM(C344:C348)","v":0},{"$f":"SUM(D344:D348)","v":0},{"$f":"SUM(E344:E348)","v":0},{"$f":"SUM(F344:F348)","v":0},{"$f":"SUM(G345:G348)","v":250000},{"$f":"SUM(H345:H348)","v":532128}]
["Beatty Street Rebuild"]
["Poles, Towers & Fixtures",null,null,null,null,null,null,{"$f":"95901","v":95901}]
["Overhead Conductors & Devices",null,null,null,null,null,null,65573]
["Underground Conduit, Conductors & Devices",null,null,null,null,null,null,{"$f":"12705+5000","v":17705}]
["Line Transformers",null,null,null,null,null,null,3279]
["Services (Overhead & Underground)",null,null,null,null,null,null,22459]
["Sub-total",{"$f":"SUM(B350:B355)","v":0},0,0,0,0,0,{"$f":"SUM(H351:H355)","v":204917}]
["Renewable Generation Connections"]
["Distribution Station Equipment <50kV",null,null,null,null,null,null,284913]
["Overhead Conductors & Devices"]
["Line Transformers"]
["Services (Overhead & Underground)"]
["Sub-total",{"$f":"SUM(B357:B361)","v":0},0,0,0,0,0,{"$f":"SUM(H358:H361)","v":284913}]
["Copper Cliff Rebuild"]
["Poles, Towers & Fixtures",null,null,null,null,null,null,76873]
["Overhead Conductors & Devices",null,null,null,null,null,null,28648]
["Line Transformers",null,null,null,null,null,null,39869]
["Services (Overhead & Underground)",null,null,null,null,null,null,93345]
["Sub-total",{"$f":"SUM(B363:B367)","v":0},0,0,0,0,0,238735]
["Outage Management Systems"]
["Computer Software",null,null,null,null,null,90000,225000]
["Sub-total",{"$f":"SUM(B369:B370)","v":0},0,0,0,0,90000,225000]
["Arthur Substation"]
["Distribution Station Equipment <50kV",null,null,null,null,null,null,1811222]
["Underground Conduit, Conductors & Devices",null,null,null,null,null,null,129496]
["System Supervisory Equipment",null,null,null,null,null,null,33446]
["Sub-total",{"$f":"SUM(B372:B375)","v":0},0,0,0,0,0,1974164]
["Digital Relay Modernization"]
["System Supervisory Equipment",null,null,null,null,null,null,174165]
["Sub-total",{"$f":"SUM(B377:B378)","v":0},0,0,0,0,0,174165]
["Miscellaneous"]
["28M6 Montague to Whissell",null,null,1275]
["Centennial Load Area Voltage Conversion",null,null,93977]
["Webpage Design",null,16700,21337]
["Webbwood",null,null,70003]
["ERP/Warehouse Automation",null,null,null,null,null,null,75000]
["Barrydowne 44kV Conductor",null,null,114780]
["Bell Park Conversion",null,null,null,50676,7907]
["Building Maintenance",null,null,null,7963]
["Change Porcelain Cutouts",null,null,null,11341,92720]
["Southbay",null,null,null,69456]
["Asset Management",null,null,null,null,70000]
["Levert-New Feeder",null,null,null,null,57640]
["Falconbridge Hwy, Huntington to Lasalle",null,8065]
["SAP Customer Information System",null,{"$f":"1091+0.77","v":1091.77}]
["Kingsway/Levesque Restircted Conduit",null,null,null,null,null,{"$f":"16983-0.36","v":16982.64}]
["44kV Tie 28M4/9M4 Design"]
["WN-Sentinel Lights",{"$f":"2482.48-0.1","v":2482.38}]
["Algonquin (Culver to Regent) Rebuild",null,null,null,null,null,null,{"$f":"71295-0.38","v":71294.62}]
["Pine Street East",null,null,null,null,null,null,96240]
["Kelly Lake Road - 4/0 to 556mcm",null,null,null,null,null,null,33952]
["Fault Indicators",null,null,null,null,null,null,18287]
["Partnersoft/Fieldstaker Platform",null,null,null,null,null,66000]
["BPISI Project",null,null,null,null,null,null,75000]
["Ministry of Transportation Road Work",{"$f":"15677+0.79","v":15677.79}]
["Sub-Total",{"$f":"SUM(B381:B404)","v":18160.170000000002},25856.77,301372,139436,228267,82982.64,369773.62]
["Construction Work in Progress",17498,822832,8220.5400000000009,228308,430859,1669878,101536]
["Capital Inventory Work in Progress",null,null,null,1022658,105162]
["Total",{"$f":"SUMPRODUCT(--($A15:$A405=\"Sub-Total\"), B$15:B$405)+B406+B407","v":4849749.68},6061818.5099999998,7746423.6900000004,8002088.6600000001,6762310.4699999997,10113765.640000001,10964347.619999999]
["Per Capital Asset Continuities",{"$f":"'App.2-B_Fixed Asset Con''ty 2007'!F54","v":4849749.7000000011},{"$f":"'App.2-B_Fixed Asset Con''ty 2008'!F54","v":6061818.5099999988},{"$f":"'App.2-B_Fixed Asset Con''ty 2009'!F54","v":7746423.6899999976},{"$f":"'App.2-B_Fixed Asset Con''ty 2010'!F57","v":8002088.6550959991},{"$f":"'App.2-B_Fixed Asset Con''ty 2011'!F57","v":6762310.4701119997},{"$f":"'App.2-B_FA Con''ty 2012 CGAAP'!F57","v":10113765.642382115},{"$f":"'App.2-B_Fixed Asset Con''ty 2013'!F57","v":10964347.607844815}]
["Difference",{"$f":"ROUND((B408-B409),1)","v":0},0,0,0,0,0,0]
[]
["Notes:"]
[]
["1   Please provide a breakdown of the major components of each capital project.  Please ensure that all projects below the materiality threshold are included in the miscellaneous line.  Add more projects as required."]

{"sheet":"App.2-B_Fixed Asset Con'ty 2007","index":3,"n_rows":71,"n_cols":14,"rows_kept":71,"cut":false,"hidden":false,"merged":[[68,1,68,13],[8,0,8,13],[9,0,9,13],[13,4,13,7],[62,1,63,13],[65,1,66,13]]}
[null,null,null,null,null,null,null,null,null,null,null,null,"File Number:",{"$f":"'LDC Info'!$E$18","v":"EB-2012-0126"}]
[null,null,null,null,null,null,null,null,null,null,null,null,"Exhibit:",2]
[null,null,null,null,null,null,null,null,null,null,null,null,"Tab:",3]
[null,null,null,null,null,null,null,null,null,null,null,null,"Schedule:",2]
[null,null,null,null,null,null,null,null,null,null,null,null,"Attachment:",2]
[]
[null,null,null,null,null,null,null,null,null,null,null,null,"Date:","9 November, 2012"]
[]
["Appendix 2-B"]
["Fixed Asset Continuity Schedule-CGAAP"]
[]
[null,null,null,null,null,"Year ",2007]
[]
[null,null,null,null,"Cost",null,null,null,null,null,"Accumulated Depreciation"]
["CCA Class","OEB","Description","Depreciation Rate","Opening Balance","Additions","Disposals","Closing Balance",null,"Opening Balance","Additions","Disposals","Closing Balance","Net Book Value"]
[12,1611,"Computer Software (Formally known as Account 1925)",null,1896349.54,null,null,{"$f":"E16+F16+G16","v":1896349.54},null,-1868085.24,-11340.17,null,{"$f":"J16+K16+L16","v":-1879425.41},{"$f":"H16+M16","v":16924.130000000121}]
["CEC",1612,"Land Rights (Formally known as Account 1906)",null,null,null,null,{"$f":"E17+F17+G17","v":0},null,null,null,null,{"$f":"J17+K17+L17","v":0},{"$f":"H17+M17","v":0}]
["N/A",1805,"Land",null,890771.88,null,null,890771.88,null,0,null,null,{"$f":"J18+K18+L18","v":0},{"$f":"H18+M18","v":890771.88}]
[47,1808,"Buildings",null,8965817.6199999992,264775,null,9230592.6199999992,null,-3394280.51,-180649.07,null,{"$f":"J19+K19+L19","v":-3574929.5799999996},{"$f":"H19+M19","v":5655663.0399999991}]
[13,1808,"Buildings Improvements",null,0,null,null,0,null,0,0,null,0,0]
[47,1815,"Transformer Station Equipment >50 kV",null,0,0,null,0,null,0,null,null,0,0]
[47,1820,"Distribution Station Equipment <50 kV",null,14800135.960000001,303274.59999999998,null,15103410.560000001,null,-8659571.1099999994,-400772.61,null,-9060343.7199999988,6043066.8400000017]
[47,1825,"Storage Battery Equipment",null,0,0,null,0,null,0,null,null,0,0]
[47,1830,"Poles, Towers & Fixtures",null,11362943.949999999,959653.45,null,12322597.399999999,null,-4619697.97,-848321.1,null,-5468019.0699999994,6854578.3299999991]
[47,1835,"Overhead Conductors & Devices",null,34902132.810000002,1805898,null,36708030.810000002,null,-22291173.850000001,-811056.12,null,-23102229.970000003,13605800.84]
[47,1840,"Underground Conduit",null,16439256.17,767574.05,null,17206830.219999999,null,-8196552.9299999997,-618195.05000000005,null,-8814747.9800000004,8392082.2399999984]
[47,1845,"Underground Conductors & Devices",null,{"$f":"16258082.16","v":16258082.16},612581.78,null,16870663.940000001,null,-7435179.5599999996,-620520.06000000006,null,-8055699.6199999992,8814964.3200000022]
[47,1850,"Line Transformers",null,22229712.699999999,1005091.38,null,23234804.079999998,null,-13130756.77,-735564.68,null,-13866321.449999999,9368482.629999999]
[47,1855,"Services (Overhead & Underground)",null,{"$f":"3565128.92+4743411.15","v":8308540.0700000003},{"$f":"162974.93+197268.99","v":360243.92},null,8668783.9900000002,null,{"$f":"-1847175.51-3110037.5","v":-4957213.01},{"$f":"-133069.2-25993.81","v":-159063.01},null,-5116276.0199999996,3552507.9700000007]
[47,1860,"Meters",null,8424114.0999999996,228697.82,null,8652811.9199999999,null,-5309403.21,-258490.03,null,-5567893.2400000002,3084918.6799999997]
[47,1860,"Meters (Smart Meters)",null,0,0,null,0,null,0,null,null,0,0]
["N/A",1905,"Land",null,0,0,null,0,null,0,null,null,0,0]
[47,1908,"Buildings & Fixtures",null,0,0,null,0,null,null,null,null,0,0]
[13,1910,"Leasehold Improvements",null,0,0,null,0,null,null,null,null,0,0]
[8,1915,"Office Furniture & Equipment (10 years)",null,44314.559999999998,0,null,44314.559999999998,null,-36082.46,-938.52,null,-37020.979999999996,7293.5800000000017]
[8,1915,"Office Furniture & Equipment (5 years)",null,0,0,null,0,null,null,null,null,0,0]
[10,1920,"Computer Equipment - Hardware",null,93648.76,0,null,93648.76,null,-93648.76,null,null,-93648.76,0]
[45,1920,"Computer Equip.-Hardware(Post Mar. 22/04)",null,0,0,null,0,null,null,null,null,0,0]
[45.1,1920,"Computer Equip.-Hardware(Post Mar. 19/07)",null,0,0,null,0,null,null,null,null,0,0]
[10,1930,"Transportation Equipment",null,3745966.56,255826.86,-291505.59000000003,3710287.83,null,-3081758.62,-219733.23,291505.59000000003,-3009986.2600000002,700301.56999999983]
[8,1935,"Stores Equipment",null,null,0,null,0,null,0,null,null,0,0]
[8,1940,"Tools, Shop & Garage Equipment",null,1282361.48,89423.7,null,1371785.18,null,-979136.24,-71190.55,null,-1050326.79,321458.3899999999]
[8,1945,"Measurement & Testing Equipment",null,0,0,null,0,null,0,null,null,0,0]
[8,1950,"Power Operated Equipment",null,0,0,null,0,null,0,null,null,0,0]
[8,1955,"Communications Equipment",null,2185673.5499999998,null,null,2185673.5499999998,null,-830932.85,-78219.360000000001,null,-909152.21,1276521.3399999999]
[8,1955,"Communication Equipment (Smart Meters)",null,0,0,null,0,null,0,null,null,0,0]
[8,1960,"Miscellaneous Equipment ",null,0,0,null,0,null,0,null,null,0,0]
[47,1975,"Load Management Controls Utility Premises",null,0,0,null,0,null,0,null,null,0,0]
[47,1980,"System Supervisory Equipment",null,1245223.47,0,null,1245223.47,null,-939214,-59189.79,null,-998403.79,246819.67999999993]
[47,1985,"Miscellaneous Fixed Assets",null,39634.379999999997,2482.48,null,42116.86,null,-38144.480000000003,-620.72,null,-38765.200000000004,3351.6599999999962]
[47,1995,"Contributions & Grants",null,-7772883.5899999999,-1823271.54,null,-9596155.129999999,null,1011853.72,383846.2,null,1395699.92,-8200455.209999999]
[null,2055,"Work in Process",null,127923.12,17498.2,-71749.06,73672.260000000009,null,0,null,null,0,73672.260000000009]
[]
[null,null,"Total",null,{"$f":"SUM(E16:E52)","v":145469719.25},{"$f":"SUM(F16:F52)","v":4849749.7000000011},-363254.65,149956214.30000001,null,-84848977.849999994,-4690017.87,291505.59000000003,-89247490.13000001,60708724.170000002]
[]
[null,null,null,null,null,null,null,null,null,"Less: Fully Allocated Depreciation"]
[10,null,"Transportation",null,null,null,null,null,null,"Transportation",null,-219733.2]
[8,null,"Stores Equipment",null,null,null,null,null,null,"Stores Equipment",null,-67004.399999999994]
[null,null,null,null,null,null,null,null,null,"Net Depreciation",null,{"$f":"K54-L57-L58","v":-4403280.2699999996}]
[]
["Notes:"]
[]
[1,"Tables in the format outlined above covering all fixed asset accounts should be submitted for the Test Year, Bridge Year and all relevant historical years.  At a minimum , the applicant must provide data for the earlier of: 1) all historical years back to its last rebasing; or 2) at least three years of historical actuals, in addition to Bridge Year and Test Year forecasts."]
[]
[]
[2,"The \"CCA Class\" for fixed assets should agree with the CCA Class used for tax purposes in Tax Returns. Fixed Assets sub-components may be used where the underlying asset components are classified under multiple CCA Classes for tax purposes. If an applicant uses any different classes from those shown in the table, an explanation should be provided. (also see note 3 below)."]
[]
[]
[3,"The table may need to be customized for a utility's asset categories or for any new asset accounts announced or authorized by the Board."]
[]
[4,"The depreciation column (D) is not required as the relevant information will be provided in the following 2-C series of appendices."]

{"sheet":"App.2-B_Fixed Asset Con'ty 2008","index":4,"n_rows":71,"n_cols":14,"rows_kept":71,"cut":false,"hidden":false,"merged":[[68,1,68,13],[8,0,8,13],[9,0,9,13],[13,4,13,7],[62,1,63,13],[65,1,66,13]]}
[null,null,null,null,null,null,null,null,null,null,null,null,"File Number:",{"$f":"'LDC Info'!$E$18","v":"EB-2012-0126"}]
[null,null,null,null,null,null,null,null,null,null,null,null,"Exhibit:",2]
[null,null,null,null,null,null,null,null,null,null,null,null,"Tab:",3]
[null,null,null,null,null,null,null,null,null,null,null,null,"Schedule:",2]
[null,null,null,null,null,null,null,null,null,null,null,null,"Attachment:",2]
[]
[null,null,null,null,null,null,null,null,null,null,null,null,"Date:","9 November, 2012"]
[]
["Appendix 2-B"]
["Fixed Asset Continuity Schedule-CGAAP"]
[]
[null,null,null,null,null,"Year ",2008]
[]
[null,null,null,null,"Cost",null,null,null,null,null,"Accumulated Depreciation"]
["CCA Class","OEB","Description","Depreciation Rate","Opening Balance","Additions","Disposals","Closing Balance",null,"Opening Balance","Additions","Disposals","Closing Balance","Net Book Value"]
[12,1611,"Computer Software (Formally known as Account 1925)",null,{"$f":"'App.2-B_Fixed Asset Con''ty 2007'!H16","v":1896349.54},30075.570000000123,-395541.18,{"$f":"E16+F16+G16","v":1530883.9300000002},null,{"$f":"'App.2-B_Fixed Asset Con''ty 2007'!M16","v":-1879425.41},-17355.270000000077,395541.18,{"$f":"J16+K16+L16","v":-1501239.5},{"$f":"H16+M16","v":29644.430000000168}]
["CEC",1612,"Land Rights (Formally known as Account 1906)",null,{"$f":"'App.2-B_Fixed Asset Con''ty 2007'!H17","v":0},0,null,{"$f":"E17+F17+G17","v":0},null,{"$f":"'App.2-B_Fixed Asset Con''ty 2007'!M17","v":0},0,null,{"$f":"J17+K17+L17","v":0},{"$f":"H17+M17","v":0}]
["N/A",1805,"Land",null,{"$f":"'App.2-B_Fixed Asset Con''ty 2007'!H18","v":890771.88},0,null,890771.88,null,{"$f":"'App.2-B_Fixed Asset Con''ty 2007'!M18","v":0},0,null,{"$f":"J18+K18+L18","v":0},{"$f":"H18+M18","v":890771.88}]
[47,1808,"Buildings",null,{"$f":"'App.2-B_Fixed Asset Con''ty 2007'!H19","v":9230592.6199999992},0,null,9230592.6199999992,null,{"$f":"'App.2-B_Fixed Asset Con''ty 2007'!M19","v":-3574929.5799999996},-175968.98000000045,null,{"$f":"J19+K19+L19","v":-3750898.56},{"$f":"H19+M19","v":5479694.0599999987}]
[13,1808,"Buildings Improvements",null,{"$f":"'App.2-B_Fixed Asset Con''ty 2007'!H20","v":0},166005,null,166005,null,{"$f":"'App.2-B_Fixed Asset Con''ty 2007'!M20","v":0},-11066.99,null,-11066.99,154938.01]
[47,1815,"Transformer Station Equipment >50 kV",null,{"$f":"'App.2-B_Fixed Asset Con''ty 2007'!H21","v":0},0,null,0,null,{"$f":"'App.2-B_Fixed Asset Con''ty 2007'!M21","v":0},0,null,0,0]
[47,1820,"Distribution Station Equipment <50 kV",null,{"$f":"'App.2-B_Fixed Asset Con''ty 2007'!H22","v":15103410.560000001},545456.99000000022,null,15648867.550000001,null,{"$f":"'App.2-B_Fixed Asset Con''ty 2007'!M22","v":-9060343.7199999988},-418954.55000000075,null,-9479298.2699999996,6169569.2800000012]
[47,1825,"Storage Battery Equipment",null,{"$f":"'App.2-B_Fixed Asset Con''ty 2007'!H23","v":0},0,null,0,null,{"$f":"'App.2-B_Fixed Asset Con''ty 2007'!M23","v":0},0,null,0,0]
[47,1830,"Poles, Towers & Fixtures",null,{"$f":"'App.2-B_Fixed Asset Con''ty 2007'!H24","v":12322597.399999999},984389.00999999978,null,13306986.409999998,null,{"$f":"'App.2-B_Fixed Asset Con''ty 2007'!M24","v":-5468019.0699999994},-886086.04000000097,null,-6354105.1100000003,6952881.299999998]
[47,1835,"Overhead Conductors & Devices",null,{"$f":"'App.2-B_Fixed Asset Con''ty 2007'!H25","v":36708030.810000002},1542681.05,null,38250711.859999999,null,{"$f":"'App.2-B_Fixed Asset Con''ty 2007'!M25","v":-23102229.970000003},-832003.73,null,-23934233.700000003,14316478.159999996]
[47,1840,"Underground Conduit",null,{"$f":"'App.2-B_Fixed Asset Con''ty 2007'!H26","v":17206830.219999999},538884.5,null,17745714.719999999,null,{"$f":"'App.2-B_Fixed Asset Con''ty 2007'!M26","v":-8814747.9800000004},-639750.43000000005,null,-9454498.4100000001,8291216.3099999987]
[47,1845,"Underground Conductors & Devices",null,{"$f":"'App.2-B_Fixed Asset Con''ty 2007'!H27","v":16870663.940000001},1130090.71,null,18000754.650000002,null,{"$f":"'App.2-B_Fixed Asset Con''ty 2007'!M27","v":-8055699.6199999992},-665723.68000000005,null,-8721423.2999999989,9279331.3500000034]
[47,1850,"Line Transformers",null,{"$f":"'App.2-B_Fixed Asset Con''ty 2007'!H28","v":23234804.079999998},612938.73999999836,null,23847742.819999997,null,{"$f":"'App.2-B_Fixed Asset Con''ty 2007'!M28","v":-13866321.449999999},-759009.94999999925,null,-14625331.399999999,9222411.4199999981]
[47,1855,"Services (Overhead & Underground)",null,{"$f":"'App.2-B_Fixed Asset Con''ty 2007'!H29","v":8668783.9900000002},{"$f":"212369.23+207077.15","v":419446.38},null,9088230.370000001,null,{"$f":"'App.2-B_Fixed Asset Con''ty 2007'!M29","v":-5116276.0199999996},{"$f":"-30108.45-141563.97","v":-171672.42},null,-5287948.4399999995,3800281.9300000016]
[47,1860,"Meters",null,{"$f":"'App.2-B_Fixed Asset Con''ty 2007'!H30","v":8652811.9199999999},88699.199999999255,null,8741511.1199999992,null,{"$f":"'App.2-B_Fixed Asset Con''ty 2007'!M30","v":-5567893.2400000002},-261718.16999999993,null,-5829611.4100000001,2911899.709999999]
[47,1860,"Meters (Smart Meters)",null,{"$f":"'App.2-B_Fixed Asset Con''ty 2007'!H31","v":0},0,null,0,null,{"$f":"'App.2-B_Fixed Asset Con''ty 2007'!M31","v":0},0,null,0,0]
["N/A",1905,"Land",null,{"$f":"'App.2-B_Fixed Asset Con''ty 2007'!H32","v":0},0,null,0,null,{"$f":"'App.2-B_Fixed Asset Con''ty 2007'!M32","v":0},0,null,0,0]
[47,1908,"Buildings & Fixtures",null,{"$f":"'App.2-B_Fixed Asset Con''ty 2007'!H33","v":0},0,null,0,null,{"$f":"'App.2-B_Fixed Asset Con''ty 2007'!M33","v":0},0,null,0,0]
[13,1910,"Leasehold Improvements",null,{"$f":"'App.2-B_Fixed Asset Con''ty 2007'!H34","v":0},0,null,0,null,{"$f":"'App.2-B_Fixed Asset Con''ty 2007'!M34","v":0},0,null,0,0]
[8,1915,"Office Furniture & Equipment (10 years)",null,{"$f":"'App.2-B_Fixed Asset Con''ty 2007'!H35","v":44314.559999999998},0,null,44314.559999999998,null,{"$f":"'App.2-B_Fixed Asset Con''ty 2007'!M35","v":-37020.979999999996},-938.52000000000407,null,-37959.5,6355.0599999999977]
[8,1915,"Office Furniture & Equipment (5 years)",null,{"$f":"'App.2-B_Fixed Asset Con''ty 2007'!H36","v":0},0,null,0,null,{"$f":"'App.2-B_Fixed Asset Con''ty 2007'!M36","v":0},0,null,0,0]
[10,1920,"Computer Equipment - Hardware",null,{"$f":"'App.2-B_Fixed Asset Con''ty 2007'!H37","v":93648.76},0,-93648.76,0,null,{"$f":"'App.2-B_Fixed Asset Con''ty 2007'!M37","v":-93648.76},0,93648.76,0,0]
[45,1920,"Computer Equip.-Hardware(Post Mar. 22/04)",null,{"$f":"'App.2-B_Fixed Asset Con''ty 2007'!H38","v":0},0,null,0,null,{"$f":"'App.2-B_Fixed Asset Con''ty 2007'!M38","v":0},0,null,0,0]
[45.1,1920,"Computer Equip.-Hardware(Post Mar. 19/07)",null,{"$f":"'App.2-B_Fixed Asset Con''ty 2007'!H39","v":0},0,null,0,null,{"$f":"'App.2-B_Fixed Asset Con''ty 2007'!M39","v":0},0,null,0,0]
[10,1930,"Transportation Equipment",null,{"$f":"'App.2-B_Fixed Asset Con''ty 2007'!H40","v":3710287.83},859349.61000000034,-513355.67,4056281.7700000005,null,{"$f":"'App.2-B_Fixed Asset Con''ty 2007'!M40","v":-3009986.2600000002},-333319.14999999991,513356,-2829949.41,1226332.3600000003]
[8,1935,"Stores Equipment",null,{"$f":"'App.2-B_Fixed Asset Con''ty 2007'!H41","v":0},0,null,0,null,{"$f":"'App.2-B_Fixed Asset Con''ty 2007'!M41","v":0},0,null,0,0]
[8,1940,"Tools, Shop & Garage Equipment",null,{"$f":"'App.2-B_Fixed Asset Con''ty 2007'!H42","v":1371785.18},180931.46999999997,null,1552716.65,null,{"$f":"'App.2-B_Fixed Asset Con''ty 2007'!M42","v":-1050326.79},-84234.070000000065,null,-1134560.8600000001,418155.7899999998]
[8,1945,"Measurement & Testing Equipment",null,{"$f":"'App.2-B_Fixed Asset Con''ty 2007'!H43","v":0},0,null,0,null,{"$f":"'App.2-B_Fixed Asset Con''ty 2007'!M43","v":0},0,null,0,0]
[8,1950,"Power Operated Equipment",null,{"$f":"'App.2-B_Fixed Asset Con''ty 2007'!H44","v":0},0,null,0,null,{"$f":"'App.2-B_Fixed Asset Con''ty 2007'!M44","v":0},0,null,0,0]
[8,1955,"Communications Equipment",null,{"$f":"'App.2-B_Fixed Asset Con''ty 2007'!H45","v":2185673.5499999998},7335.1800000001676,null,2193008.73,null,{"$f":"'App.2-B_Fixed Asset Con''ty 2007'!M45","v":-909152.21},-78952.859999999986,null,-988105.07,1204903.6600000001]
[8,1955,"Communication Equipment (Smart Meters)",null,{"$f":"'App.2-B_Fixed Asset Con''ty 2007'!H46","v":0},0,null,0,null,{"$f":"'App.2-B_Fixed Asset Con''ty 2007'!M46","v":0},0,null,0,0]
[8,1960,"Miscellaneous Equipment ",null,{"$f":"'App.2-B_Fixed Asset Con''ty 2007'!H47","v":0},0,null,0,null,{"$f":"'App.2-B_Fixed Asset Con''ty 2007'!M47","v":0},0,null,0,0]
[47,1975,"Load Management Controls Utility Premises",null,{"$f":"'App.2-B_Fixed Asset Con''ty 2007'!H48","v":0},0,null,0,null,{"$f":"'App.2-B_Fixed Asset Con''ty 2007'!M48","v":0},0,null,0,0]
[47,1980,"System Supervisory Equipment",null,{"$f":"'App.2-B_Fixed Asset Con''ty 2007'!H49","v":1245223.47},0,null,1245223.47,null,{"$f":"'App.2-B_Fixed Asset Con''ty 2007'!M49","v":-998403.79},-50626.040000000037,null,-1049029.83,196193.6399999999]
[47,1985,"Miscellaneous Fixed Assets",null,{"$f":"'App.2-B_Fixed Asset Con''ty 2007'!H50","v":42116.86},0,null,42116.86,null,{"$f":"'App.2-B_Fixed Asset Con''ty 2007'!M50","v":-38765.200000000004},-3351.6599999999962,null,-42116.86,0]
[47,1995,"Contributions & Grants",null,{"$f":"'App.2-B_Fixed Asset Con''ty 2007'!H51","v":-9596155.129999999},-1867297.0199999996,null,-11463452.149999999,null,{"$f":"'App.2-B_Fixed Asset Con''ty 2007'!M51","v":1395699.92},458538.07000000007,null,1854237.99,-9609214.1599999983]
[null,2055,"Work in Process",null,{"$f":"'App.2-B_Fixed Asset Con''ty 2007'!H52","v":73672.260000000009},{"$f":"822832.12","v":822832.12},-56174.06,840330.32000000007,null,{"$f":"'App.2-B_Fixed Asset Con''ty 2007'!M52","v":0},null,null,0,840330.32000000007]
[]
[null,null,"Total",null,{"$f":"SUM(E16:E52)","v":149956214.30000001},{"$f":"SUM(F16:F52)","v":6061818.5099999988},-1058719.67,154959313.14000002,null,-89247490.090000018,-4932194.4400000013,1002545.94,-93177138.629999995,61782174.509999998]
[]
[null,null,null,null,null,null,null,null,null,"Less: Fully Allocated Depreciation"]
[10,null,"Transportation",null,null,null,null,null,null,"Transportation",null,-333318.82]
[8,null,"Stores Equipment",null,null,null,null,null,null,"Stores Equipment",null,-84234.06]
[null,null,null,null,null,null,null,null,null,"Net Depreciation",null,{"$f":"K54-L57-L58","v":-4514641.5600000015}]
[]
["Notes:"]
[]
[1,"Tables in the format outlined above covering all fixed asset accounts should be submitted for the Test Year, Bridge Year and all relevant historical years.  At a minimum , the applicant must provide data for the earlier of: 1) all historical years back to its last rebasing; or 2) at least three years of historical actuals, in addition to Bridge Year and Test Year forecasts."]
[]
[]
[2,"The \"CCA Class\" for fixed assets should agree with the CCA Class used for tax purposes in Tax Returns. Fixed Assets sub-components may be used where the underlying asset components are classified under multiple CCA Classes for tax purposes. If an applicant uses any different classes from those shown in the table, an explanation should be provided. (also see note 3 below)."]
[]
[]
[3,"The table may need to be customized for a utility's asset categories or for any new asset accounts announced or authorized by the Board."]
[]
[4,"The depreciation column (D) is not required as the relevant information will be provided in the following 2-C series of appendices."]

{"sheet":"App.2-B_Fixed Asset Con'ty 2009","index":5,"n_rows":71,"n_cols":14,"rows_kept":71,"cut":false,"hidden":false,"merged":[[68,1,68,13],[8,0,8,13],[9,0,9,13],[13,4,13,7],[62,1,63,13],[65,1,66,13]]}
[null,null,null,null,null,null,null,null,null,null,null,null,"File Number:",{"$f":"'LDC Info'!$E$18","v":"EB-2012-0126"}]
[null,null,null,null,null,null,null,null,null,null,null,null,"Exhibit:",2]
[null,null,null,null,null,null,null,null,null,null,null,null,"Tab:",3]
[null,null,null,null,null,null,null,null,null,null,null,null,"Schedule:",2]
[null,null,null,null,null,null,null,null,null,null,null,null,"Attachment:",2]
[]
[null,null,null,null,null,null,null,null,null,null,null,null,"Date:","9 November, 2012"]
[]
["Appendix 2-B"]
["Fixed Asset Continuity Schedule-CGAAP"]
[]
[null,null,null,null,null,"Year ",2009]
[]
[null,null,null,null,"Cost",null,null,null,null,null,"Accumulated Depreciation"]
["CCA Class","OEB","Description","Depreciation Rate","Opening Balance","Additions","Disposals","Closing Balance",null,"Opening Balance","Additions","Disposals","Closing Balance","Net Book Value"]
[12,1611,"Computer Software (Formally known as Account 1925)",null,{"$f":"'App.2-B_Fixed Asset Con''ty 2008'!H16","v":1530883.9300000002},323775.47000000003,-1090.57,{"$f":"E16+F16+G16","v":1853568.83},null,{"$f":"'App.2-B_Fixed Asset Con''ty 2008'!M16","v":-1501239.5},-43757.32,109,{"$f":"J16+K16+L16","v":-1544887.82},{"$f":"H16+M16","v":308681.01}]
["CEC",1612,"Land Rights (Formally known as Account 1906)",null,{"$f":"'App.2-B_Fixed Asset Con''ty 2008'!H17","v":0},null,null,{"$f":"E17+F17+G17","v":0},null,{"$f":"'App.2-B_Fixed Asset Con''ty 2008'!M17","v":0},null,null,{"$f":"J17+K17+L17","v":0},{"$f":"H17+M17","v":0}]
["N/A",1805,"Land",null,{"$f":"'App.2-B_Fixed Asset Con''ty 2008'!H18","v":890771.88},186.05,null,{"$f":"E18+F18+G18","v":890957.93},null,{"$f":"'App.2-B_Fixed Asset Con''ty 2008'!M18","v":0},null,null,{"$f":"J18+K18+L18","v":0},{"$f":"H18+M18","v":890957.93}]
[47,1808,"Buildings",null,{"$f":"'App.2-B_Fixed Asset Con''ty 2008'!H19","v":9230592.6199999992},0,null,{"$f":"E19+F19+G19","v":9230592.6199999992},null,{"$f":"'App.2-B_Fixed Asset Con''ty 2008'!M19","v":-3750898.56},-175805.42,null,{"$f":"J19+K19+L19","v":-3926703.98},{"$f":"H19+M19","v":5303888.6399999987}]
[13,1808,"Buildings Improvements",null,{"$f":"'App.2-B_Fixed Asset Con''ty 2008'!H20","v":166005},240168.52,null,406173.52,null,{"$f":"'App.2-B_Fixed Asset Con''ty 2008'!M20","v":-11066.99},-19072.61,null,-30139.599999999999,376033.92000000004]
[47,1815,"Transformer Station Equipment >50 kV",null,{"$f":"'App.2-B_Fixed Asset Con''ty 2008'!H21","v":0},null,null,0,null,{"$f":"'App.2-B_Fixed Asset Con''ty 2008'!M21","v":0},null,null,0,0]
[47,1820,"Distribution Station Equipment <50 kV",null,{"$f":"'App.2-B_Fixed Asset Con''ty 2008'!H22","v":15648867.550000001},437621.15,null,16086488.700000001,null,{"$f":"'App.2-B_Fixed Asset Con''ty 2008'!M22","v":-9479298.2699999996},-426248.20999999996,null,-9905546.4800000004,6180942.2200000007]
[47,1825,"Storage Battery Equipment",null,{"$f":"'App.2-B_Fixed Asset Con''ty 2008'!H23","v":0},null,null,0,null,{"$f":"'App.2-B_Fixed Asset Con''ty 2008'!M23","v":0},null,null,0,0]
[47,1830,"Poles, Towers & Fixtures",null,{"$f":"'App.2-B_Fixed Asset Con''ty 2008'!H24","v":13306986.409999998},2004152.65,null,15311139.059999999,null,{"$f":"'App.2-B_Fixed Asset Con''ty 2008'!M24","v":-6354105.1100000003},-919046.33,null,-7273151.4400000004,8037987.6199999982]
[47,1835,"Overhead Conductors & Devices",null,{"$f":"'App.2-B_Fixed Asset Con''ty 2008'!H25","v":38250711.859999999},1395457.51,null,39646169.369999997,null,{"$f":"'App.2-B_Fixed Asset Con''ty 2008'!M25","v":-23934233.700000003},-838387.4,null,-24772621.100000001,14873548.269999996]
[47,1840,"Underground Conduit",null,{"$f":"'App.2-B_Fixed Asset Con''ty 2008'!H26","v":17745714.719999999},733233.62,null,18478948.34,null,{"$f":"'App.2-B_Fixed Asset Con''ty 2008'!M26","v":-9454498.4100000001},-654415.1,null,-10108913.51,8370034.8300000001]
[47,1845,"Underground Conductors & Devices",null,{"$f":"'App.2-B_Fixed Asset Con''ty 2008'!H27","v":18000754.650000002},968524.56,null,18969279.210000001,null,{"$f":"'App.2-B_Fixed Asset Con''ty 2008'!M27","v":-8721423.2999999989},-685094.17,null,-9406517.4699999988,9562761.7400000021]
[47,1850,"Line Transformers",null,{"$f":"'App.2-B_Fixed Asset Con''ty 2008'!H28","v":23847742.819999997},1103841.6299999999,null,24951584.449999996,null,{"$f":"'App.2-B_Fixed Asset Con''ty 2008'!M28","v":-14625331.399999999},-776793.41,null,-15402124.809999999,9549459.6399999969]
[47,1855,"Services (Overhead & Underground)",null,{"$f":"'App.2-B_Fixed Asset Con''ty 2008'!H29","v":9088230.370000001},{"$f":"193021.31+160293.66","v":353314.97},null,9441545.3400000017,null,{"$f":"'App.2-B_Fixed Asset Con''ty 2008'!M29","v":-5287948.4399999995},{"$f":"-31292.86-144769.84","v":-176062.7},null,-5464011.1399999997,3977534.200000002]
[47,1860,"Meters",null,{"$f":"'App.2-B_Fixed Asset Con''ty 2008'!H30","v":8741511.1199999992},38347.509999999776,null,8779858.629999999,null,{"$f":"'App.2-B_Fixed Asset Con''ty 2008'!M30","v":-5829611.4100000001},-262260.42,null,-6091871.8300000001,2687986.7999999989]
[47,1860,"Meters (Smart Meters)",null,{"$f":"'App.2-B_Fixed Asset Con''ty 2008'!H31","v":0},null,null,0,null,{"$f":"'App.2-B_Fixed Asset Con''ty 2008'!M31","v":0},null,null,0,0]
["N/A",1905,"Land",null,{"$f":"'App.2-B_Fixed Asset Con''ty 2008'!H32","v":0},null,null,0,null,{"$f":"'App.2-B_Fixed Asset Con''ty 2008'!M32","v":0},null,null,0,0]
[47,1908,"Buildings & Fixtures",null,{"$f":"'App.2-B_Fixed Asset Con''ty 2008'!H33","v":0},null,null,0,null,{"$f":"'App.2-B_Fixed Asset Con''ty 2008'!M33","v":0},null,null,0,0]
[13,1910,"Leasehold Improvements",null,{"$f":"'App.2-B_Fixed Asset Con''ty 2008'!H34","v":0},null,null,0,null,{"$f":"'App.2-B_Fixed Asset Con''ty 2008'!M34","v":0},null,null,0,0]
[8,1915,"Office Furniture & Equipment (10 years)",null,{"$f":"'App.2-B_Fixed Asset Con''ty 2008'!H35","v":44314.559999999998},null,null,44314.559999999998,null,{"$f":"'App.2-B_Fixed Asset Con''ty 2008'!M35","v":-37959.5},-938.52,null,-38898.019999999997,5416.5400000000009]
[8,1915,"Office Furniture & Equipment (5 years)",null,{"$f":"'App.2-B_Fixed Asset Con''ty 2008'!H36","v":0},null,null,0,null,{"$f":"'App.2-B_Fixed Asset Con''ty 2008'!M36","v":0},null,null,0,0]
[10,1920,"Computer Equipment - Hardware",null,{"$f":"'App.2-B_Fixed Asset Con''ty 2008'!H37","v":0},null,null,0,null,{"$f":"'App.2-B_Fixed Asset Con''ty 2008'!M37","v":0},null,null,0,0]
[45,1920,"Computer Equip.-Hardware(Post Mar. 22/04)",null,{"$f":"'App.2-B_Fixed Asset Con''ty 2008'!H38","v":0},null,null,0,null,{"$f":"'App.2-B_Fixed Asset Con''ty 2008'!M38","v":0},null,null,0,0]
[45.1,1920,"Computer Equip.-Hardware(Post Mar. 19/07)",null,{"$f":"'App.2-B_Fixed Asset Con''ty 2008'!H39","v":0},null,null,0,null,{"$f":"'App.2-B_Fixed Asset Con''ty 2008'!M39","v":0},null,null,0,0]
[10,1930,"Transportation Equipment",null,{"$f":"'App.2-B_Fixed Asset Con''ty 2008'!H40","v":4056281.7700000005},495784.05,-51563.68,4500502.1400000006,null,{"$f":"'App.2-B_Fixed Asset Con''ty 2008'!M40","v":-2829949.41},-352036.49,51563.68,-3130422.22,1370079.9200000004]
[8,1935,"Stores Equipment",null,{"$f":"'App.2-B_Fixed Asset Con''ty 2008'!H41","v":0},null,null,0,null,{"$f":"'App.2-B_Fixed Asset Con''ty 2008'!M41","v":0},null,null,0,0]
[8,1940,"Tools, Shop & Garage Equipment",null,{"$f":"'App.2-B_Fixed Asset Con''ty 2008'!H42","v":1552716.65},114714.62,null,1667431.27,null,{"$f":"'App.2-B_Fixed Asset Con''ty 2008'!M42","v":-1134560.8600000001},-82322.42,null,-1216883.28,450547.99]
[8,1945,"Measurement & Testing Equipment",null,{"$f":"'App.2-B_Fixed Asset Con''ty 2008'!H43","v":0},null,null,0,null,{"$f":"'App.2-B_Fixed Asset Con''ty 2008'!M43","v":0},null,null,0,0]
[8,1950,"Power Operated Equipment",null,{"$f":"'App.2-B_Fixed Asset Con''ty 2008'!H44","v":0},null,null,0,null,{"$f":"'App.2-B_Fixed Asset Con''ty 2008'!M44","v":0},null,null,0,0]
[8,1955,"Communications Equipment",null,{"$f":"'App.2-B_Fixed Asset Con''ty 2008'!H45","v":2193008.73},19821.13,null,2212829.86,null,{"$f":"'App.2-B_Fixed Asset Con''ty 2008'!M45","v":-988105.07},-79943.92,null,-1068048.99,1144780.8699999999]
[8,1955,"Communication Equipment (Smart Meters)",null,{"$f":"'App.2-B_Fixed Asset Con''ty 2008'!H46","v":0},null,null,0,null,{"$f":"'App.2-B_Fixed Asset Con''ty 2008'!M46","v":0},null,null,0,0]
[8,1960,"Miscellaneous Equipment ",null,{"$f":"'App.2-B_Fixed Asset Con''ty 2008'!H47","v":0},null,null,0,null,{"$f":"'App.2-B_Fixed Asset Con''ty 2008'!M47","v":0},null,null,0,0]
[47,1975,"Load Management Controls Utility Premises",null,{"$f":"'App.2-B_Fixed Asset Con''ty 2008'!H48","v":0},null,null,0,null,{"$f":"'App.2-B_Fixed Asset Con''ty 2008'!M48","v":0},null,null,0,0]
[47,1980,"System Supervisory Equipment",null,{"$f":"'App.2-B_Fixed Asset Con''ty 2008'!H49","v":1245223.47},297471.74,null,1542695.21,null,{"$f":"'App.2-B_Fixed Asset Con''ty 2008'!M49","v":-1049029.83},-53749.599999999999,null,-1102779.4300000002,439915.7799999998]
[47,1985,"Miscellaneous Fixed Assets",null,{"$f":"'App.2-B_Fixed Asset Con''ty 2008'!H50","v":42116.86},null,null,42116.86,null,{"$f":"'App.2-B_Fixed Asset Con''ty 2008'!M50","v":-42116.86},null,null,-42116.86,0]
[47,1995,"Contributions & Grants",null,{"$f":"'App.2-B_Fixed Asset Con''ty 2008'!H51","v":-11463452.149999999},-788212.03,null,-12251664.179999998,null,{"$f":"'App.2-B_Fixed Asset Con''ty 2008'!M51","v":1854237.99},474302.32,null,2328540.31,-9923123.8699999973]
[null,2055,"Work in Process",null,{"$f":"'App.2-B_Fixed Asset Con''ty 2008'!H52","v":840330.32000000007},8220.5400000000009,-840330,8220.8600000001024,null,{"$f":"'App.2-B_Fixed Asset Con''ty 2008'!M52","v":0},null,null,0,8220.8600000001024]
[]
[null,null,"Total",null,{"$f":"SUM(E16:E52)","v":154959313.14000002},{"$f":"SUM(F16:F52)","v":7746423.6899999976},-892984.25,161812752.58000004,null,-93177138.629999995,-5071631.7199999988,51672.68,-98197097.669999987,63615654.910000004]
[]
[null,null,null,null,null,null,null,null,null,"Less: Fully Allocated Depreciation"]
[10,null,"Transportation",null,null,null,null,null,null,"Transportation",null,{"$f":"-358466.27+109","v":-358357.27}]
[8,null,"Stores Equipment",null,null,null,null,null,null,"Stores Equipment",null,-78664.039999999994]
[null,null,null,null,null,null,null,null,null,"Net Depreciation",null,{"$f":"K54-L57-L58","v":-4634610.4099999992}]
[]
["Notes:"]
[]
[1,"Tables in the format outlined above covering all fixed asset accounts should be submitted for the Test Year, Bridge Year and all relevant historical years.  At a minimum , the applicant must provide data for the earlier of: 1) all historical years back to its last rebasing; or 2) at least three years of historical actuals, in addition to Bridge Year and Test Year forecasts."]
[]
[]
[2,"The \"CCA Class\" for fixed assets should agree with the CCA Class used for tax purposes in Tax Returns. Fixed Assets sub-components may be used where the underlying asset components are classified under multiple CCA Classes for tax purposes. If an applicant uses any different classes from those shown in the table, an explanation should be provided. (also see note 3 below)."]
[]
[]
[3,"The table may need to be customized for a utility's asset categories or for any new asset accounts announced or authorized by the Board."]
[]
[4,"The depreciation column (D) is not required as the relevant information will be provided in the following 2-C series of appendices."]

{"sheet":"App.2-B_Fixed Asset Con'ty 2010","index":6,"n_rows":74,"n_cols":14,"rows_kept":74,"cut":false,"hidden":false,"merged":[[68,1,69,13],[71,1,71,13],[8,0,8,13],[9,0,9,13],[13,4,13,7],[54,0,54,2],[56,0,56,2],[65,1,66,13]]}
[null,null,null,null,null,null,null,null,null,null,null,null,"File Number:",{"$f":"'LDC Info'!$E$18","v":"EB-2012-0126"}]
[null,null,null,null,null,null,null,null,null,null,null,null,"Exhibit:",2]
[null,null,null,null,null,null,null,null,null,null,null,null,"Tab:",3]
[null,null,null,null,null,null,null,null,null,null,null,null,"Schedule:",2]
[null,null,null,null,null,null,null,null,null,null,null,null,"Attachment:",2]
[]
[null,null,null,null,null,null,null,null,null,null,null,null,"Date:","9 November, 2012"]
[]
["Appendix 2-B"]
["Fixed Asset Continuity Schedule-CGAAP"]
[]
[null,null,null,null,null,"Year ",2010]
[]
[null,null,null,null,"Cost",null,null,null,null,null,"Accumulated Depreciation"]
["CCA Class","OEB","Description","Depreciation Rate","Opening Balance","Additions","Disposals","Closing Balance",null,"Opening Balance","Additions","Disposals","Closing Balance","Net Book Value"]
[12,1611,"Computer Software (Formally known as Account 1925)",null,{"$f":"'App.2-B_Fixed Asset Con''ty 2009'!H16","v":1853568.83},651780.67000000004,null,{"$f":"E16+F16+G16","v":2505349.5},null,{"$f":"'App.2-B_Fixed Asset Con''ty 2009'!M16","v":-1544887.82},-135730.16,null,{"$f":"J16+K16+L16","v":-1680617.98},{"$f":"H16+M16","v":824731.52}]
["CEC",1612,"Land Rights (Formally known as Account 1906)",null,{"$f":"'App.2-B_Fixed Asset Con''ty 2009'!H17","v":0},null,null,{"$f":"E17+F17+G17","v":0},null,{"$f":"'App.2-B_Fixed Asset Con''ty 2009'!M17","v":0},null,null,{"$f":"J17+K17+L17","v":0},{"$f":"H17+M17","v":0}]
["N/A",1805,"Land",null,{"$f":"'App.2-B_Fixed Asset Con''ty 2009'!H18","v":890957.93},32744.71,-66404.399999999994,{"$f":"E18+F18+G18","v":857298.24},null,{"$f":"'App.2-B_Fixed Asset Con''ty 2009'!M18","v":0},null,null,{"$f":"J18+K18+L18","v":0},{"$f":"H18+M18","v":857298.24}]
[47,1808,"Buildings",null,{"$f":"'App.2-B_Fixed Asset Con''ty 2009'!H19","v":9230592.6199999992},null,null,{"$f":"E19+F19+G19","v":9230592.6199999992},null,{"$f":"'App.2-B_Fixed Asset Con''ty 2009'!M19","v":-3926703.98},-170576.89,null,{"$f":"J19+K19+L19","v":-4097280.87},{"$f":"H19+M19","v":5133311.7499999991}]
[13,1808,"Buildings Improvements",null,{"$f":"'App.2-B_Fixed Asset Con''ty 2009'!H20","v":406173.52},161354.82999999999,null,567528.35,null,{"$f":"'App.2-B_Fixed Asset Con''ty 2009'!M20","v":-30139.599999999999},-32456.720000000001,null,-62596.32,504932.02999999997]
[47,1815,"Transformer Station Equipment >50 kV",null,{"$f":"'App.2-B_Fixed Asset Con''ty 2009'!H21","v":0},null,null,0,null,{"$f":"'App.2-B_Fixed Asset Con''ty 2009'!M21","v":0},null,null,0,0]
[47,1820,"Distribution Station Equipment <50 kV",null,{"$f":"'App.2-B_Fixed Asset Con''ty 2009'!H22","v":16086488.700000001},213181.65,null,16299670.350000001,null,{"$f":"'App.2-B_Fixed Asset Con''ty 2009'!M22","v":-9905546.4800000004},-442557.14,null,-10348103.620000001,5951566.7300000004]
[47,1825,"Storage Battery Equipment",null,{"$f":"'App.2-B_Fixed Asset Con''ty 2009'!H23","v":0},null,null,0,null,{"$f":"'App.2-B_Fixed Asset Con''ty 2009'!M23","v":0},null,null,0,0]
[47,1830,"Poles, Towers & Fixtures",null,{"$f":"'App.2-B_Fixed Asset Con''ty 2009'!H24","v":15311139.059999999},1072043.6200000001,null,16383182.68,null,{"$f":"'App.2-B_Fixed Asset Con''ty 2009'!M24","v":-7273151.4400000004},-562387.23,null,-7835538.6699999999,8547644.0099999998]
[47,1835,"Overhead Conductors & Devices",null,{"$f":"'App.2-B_Fixed Asset Con''ty 2009'!H25","v":39646169.369999997},1220522.06,null,40866691.43,null,{"$f":"'App.2-B_Fixed Asset Con''ty 2009'!M25","v":-24772621.100000001},-1155368.3999999999,null,-25927989.5,14938701.93]
[47,1840,"Underground Conduit",null,{"$f":"'App.2-B_Fixed Asset Con''ty 2009'!H26","v":18478948.34},616101.56000000006,null,19095049.899999999,null,{"$f":"'App.2-B_Fixed Asset Con''ty 2009'!M26","v":-10108913.51},-689250.92,null,-10798164.43,8296885.4699999988]
[47,1845,"Underground Conductors & Devices",null,{"$f":"'App.2-B_Fixed Asset Con''ty 2009'!H27","v":18969279.210000001},1019872.03,null,19989151.240000002,null,{"$f":"'App.2-B_Fixed Asset Con''ty 2009'!M27","v":-9406517.4699999988},-722401.72,null,-10128919.189999999,9860232.0500000026]
[47,1850,"Line Transformers",null,{"$f":"'App.2-B_Fixed Asset Con''ty 2009'!H28","v":24951584.449999996},1957831.08,null,26909415.529999994,null,{"$f":"'App.2-B_Fixed Asset Con''ty 2009'!M28","v":-15402124.809999999},-840186.72,null,-16242311.529999999,10667103.999999994]
[47,1855,"Services (Overhead & Underground)",null,{"$f":"'App.2-B_Fixed Asset Con''ty 2009'!H29","v":9441545.3400000017},{"$f":"262123.77+273570.59","v":535694.36},null,9977239.7000000011,null,{"$f":"'App.2-B_Fixed Asset Con''ty 2009'!M29","v":-5464011.1399999997},{"$f":"-164104.07-155236.53","v":-319340.59999999998},null,-5783351.7399999993,4193887.9600000018]
[47,1860,"Meters",null,{"$f":"'App.2-B_Fixed Asset Con''ty 2009'!H30","v":8779858.629999999},30166.68,null,8810025.3099999987,null,{"$f":"'App.2-B_Fixed Asset Con''ty 2009'!M30","v":-6091871.8300000001},-263282.8,null,-6355154.6299999999,2454870.6799999988]
[47,1860,"Meters (Smart Meters)",null,{"$f":"'App.2-B_Fixed Asset Con''ty 2009'!H31","v":0},null,null,0,null,{"$f":"'App.2-B_Fixed Asset Con''ty 2009'!M31","v":0},null,null,0,0]
["N/A",1905,"Land",null,{"$f":"'App.2-B_Fixed Asset Con''ty 2009'!H32","v":0},null,null,0,null,{"$f":"'App.2-B_Fixed Asset Con''ty 2009'!M32","v":0},null,null,0,0]
[47,1908,"Buildings & Fixtures",null,{"$f":"'App.2-B_Fixed Asset Con''ty 2009'!H33","v":0},null,null,0,null,{"$f":"'App.2-B_Fixed Asset Con''ty 2009'!M33","v":0},null,null,0,0]
[13,1910,"Leasehold Improvements",null,{"$f":"'App.2-B_Fixed Asset Con''ty 2009'!H34","v":0},null,null,0,null,{"$f":"'App.2-B_Fixed Asset Con''ty 2009'!M34","v":0},null,null,0,0]
[8,1915,"Office Furniture & Equipment (10 years)",null,{"$f":"'App.2-B_Fixed Asset Con''ty 2009'!H35","v":44314.559999999998},null,null,44314.559999999998,null,{"$f":"'App.2-B_Fixed Asset Con''ty 2009'!M35","v":-38898.019999999997},-938.52,null,-39836.539999999994,4478.0200000000041]
[8,1915,"Office Furniture & Equipment (5 years)",null,{"$f":"'App.2-B_Fixed Asset Con''ty 2009'!H36","v":0},null,null,0,null,{"$f":"'App.2-B_Fixed Asset Con''ty 2009'!M36","v":0},null,null,0,0]
[10,1920,"Computer Equipment - Hardware",null,{"$f":"'App.2-B_Fixed Asset Con''ty 2009'!H37","v":0},null,null,0,null,{"$f":"'App.2-B_Fixed Asset Con''ty 2009'!M37","v":0},null,null,0,0]
[45,1920,"Computer Equip.-Hardware(Post Mar. 22/04)",null,{"$f":"'App.2-B_Fixed Asset Con''ty 2009'!H38","v":0},null,null,0,null,{"$f":"'App.2-B_Fixed Asset Con''ty 2009'!M38","v":0},null,null,0,0]
[45.1,1920,"Computer Equip.-Hardware(Post Mar. 19/07)",null,{"$f":"'App.2-B_Fixed Asset Con''ty 2009'!H39","v":0},null,null,0,null,{"$f":"'App.2-B_Fixed Asset Con''ty 2009'!M39","v":0},null,null,0,0]
[10,1930,"Transportation Equipment",null,{"$f":"'App.2-B_Fixed Asset Con''ty 2009'!H40","v":4500502.1400000006},540987.26,null,5041489.4000000004,null,{"$f":"'App.2-B_Fixed Asset Con''ty 2009'!M40","v":-3130422.22},-423415.19,null,-3553837.41,1487651.9900000002]
[8,1935,"Stores Equipment",null,{"$f":"'App.2-B_Fixed Asset Con''ty 2009'!H41","v":0},null,null,0,null,{"$f":"'App.2-B_Fixed Asset Con''ty 2009'!M41","v":0},null,null,0,0]
[8,1940,"Tools, Shop & Garage Equipment",null,{"$f":"'App.2-B_Fixed Asset Con''ty 2009'!H42","v":1667431.27},74324.509999999995,null,1741755.78,null,{"$f":"'App.2-B_Fixed Asset Con''ty 2009'!M42","v":-1216883.28},-78563.839999999997,null,-1295447.1200000001,446308.65999999992]
[8,1945,"Measurement & Testing Equipment",null,{"$f":"'App.2-B_Fixed Asset Con''ty 2009'!H43","v":0},null,null,0,null,{"$f":"'App.2-B_Fixed Asset Con''ty 2009'!M43","v":0},null,null,0,0]
[8,1950,"Power Operated Equipment",null,{"$f":"'App.2-B_Fixed Asset Con''ty 2009'!H44","v":0},null,null,0,null,{"$f":"'App.2-B_Fixed Asset Con''ty 2009'!M44","v":0},null,null,0,0]
[8,1955,"Communications Equipment",null,{"$f":"'App.2-B_Fixed Asset Con''ty 2009'!H45","v":2212829.86},null,null,2212829.86,null,{"$f":"'App.2-B_Fixed Asset Con''ty 2009'!M45","v":-1068048.99},-80934.98,null,-1148983.97,1063845.8899999999]
[8,1955,"Communication Equipment (Smart Meters)",null,{"$f":"'App.2-B_Fixed Asset Con''ty 2009'!H46","v":0},null,null,0,null,{"$f":"'App.2-B_Fixed Asset Con''ty 2009'!M46","v":0},null,null,0,0]
[8,1960,"Miscellaneous Equipment ",null,{"$f":"'App.2-B_Fixed Asset Con''ty 2009'!H47","v":0},null,null,0,null,{"$f":"'App.2-B_Fixed Asset Con''ty 2009'!M47","v":0},null,null,0,0]
[47,1975,"Load Management Controls Utility Premises",null,{"$f":"'App.2-B_Fixed Asset Con''ty 2009'!H48","v":0},null,null,0,null,{"$f":"'App.2-B_Fixed Asset Con''ty 2009'!M48","v":0},null,null,0,0]
[47,1980,"System Supervisory Equipment",null,{"$f":"'App.2-B_Fixed Asset Con''ty 2009'!H49","v":1542695.21},12747.92,null,1555443.13,null,{"$f":"'App.2-B_Fixed Asset Con''ty 2009'!M49","v":-1102779.4300000002},-59725.64,null,-1162505.07,392938.05999999982]
[47,1985,"Miscellaneous Fixed Assets",null,{"$f":"'App.2-B_Fixed Asset Con''ty 2009'!H50","v":42116.86},null,null,42116.86,null,{"$f":"'App.2-B_Fixed Asset Con''ty 2009'!M50","v":-42116.86},null,null,-42116.86,0]
[47,1995,"Contributions & Grants",null,{"$f":"'App.2-B_Fixed Asset Con''ty 2009'!H51","v":-12251664.179999998},-1261433.8799999999,null,-13513098.059999999,null,{"$f":"'App.2-B_Fixed Asset Con''ty 2009'!M51","v":2328540.31},515295.24,null,2843835.55,-10669262.509999998]
[null,1330,"WIP - Capital Inventory",null,0,1022658,null,1022658,null,{"$f":"'App.2-B_Fixed Asset Con''ty 2009'!M52","v":0},null,null,0,1022658]
[null,2055,"Work in Process",null,{"$f":"'App.2-B_Fixed Asset Con''ty 2009'!H52","v":8220.8600000001024},228308,{"$f":"-E53","v":-8220.8600000001024},228308,null,{"$f":"'App.2-B_Fixed Asset Con''ty 2009'!M52","v":0},null,null,0,228308]
[null,null,null,null,{"$f":"'App.2-B_Fixed Asset Con''ty 2009'!H53","v":0},null,null,0,null,{"$f":"'App.2-B_Fixed Asset Con''ty 2009'!M53","v":0},null,null,0,0]
["Total prior to Board ordered removal of CIS related to water billing",null,null,null,{"$f":"SUM(E16:E54)","v":161812752.58000004},{"$f":"SUM(F16:F54)","v":8128885.0599999996},{"$f":"SUM(G16:G54)","v":-74625.260000000097},{"$f":"SUM(H16:H54)","v":169867012.38000003},null,{"$f":"SUM(J16:J54)","v":-98197097.669999987},{"$f":"SUM(K16:K54)","v":-5461822.2299999986},0,-103658919.89999999,{"$f":"SUM(N16:N54)","v":66208092.479999982}]
[12,1611,"Computer Software",null,{"$f":"'App.2-B_Fixed Asset Con''ty 2009'!H55","v":0},{"$f":"-602644.51*0.2104","v":-126796.40490400001},null,-126796.40490400001,null,{"$f":"'App.2-B_Fixed Asset Con''ty 2009'!M55","v":0},12679.64,null,12679.64,-114116.76490400001]
["Total subsequent to Board ordered removal of CIS related to water billing",null,null,null,{"$f":"SUM(E55:E56)","v":161812752.58000004},{"$f":"SUM(F55:F56)","v":8002088.6550959991},{"$f":"SUM(G55:G56)","v":-74625.260000000097},{"$f":"SUM(H55:H56)","v":169740215.97509602},null,{"$f":"SUM(J55:J56)","v":-98197097.669999987},{"$f":"SUM(K55:K56)","v":-5449142.5899999989},0,-103646240.25999999,66093975.715095982]
[]
[null,null,null,null,null,null,null,null,null,"Less: Fully Allocated Depreciation"]
[10,null,"Transportation",null,null,null,null,null,null,"Transportation",null,-423415.19]
[8,null,"Stores Equipment",null,null,null,null,null,null,"Stores Equipment",null,-78563.839999999997]
[null,null,null,null,null,null,null,null,null,"Net Depreciation",null,{"$f":"K55-L60-L61","v":-4959843.1999999983}]
[]
["Notes:"]
[]
[1,"Tables in the format outlined above covering all fixed asset accounts should be submitted for the Test Year, Bridge Year and all relevant historical years.  At a minimum , the applicant must provide data for the earlier of: 1) all historical years back to its last rebasing; or 2) at least three years of historical actuals, in addition to Bridge Year and Test Year forecasts."]
[]
[]
[2,"The \"CCA Class\" for fixed assets should agree with the CCA Class used for tax purposes in Tax Returns. Fixed Assets sub-components may be used where the underlying asset components are classified under multiple CCA Classes for tax purposes. If an applicant uses any different classes from those shown in the table, an explanation should be provided. (also see note 3 below)."]
[]
[]
[3,"The table may need to be customized for a utility's asset categories or for any new asset accounts announced or authorized by the Board."]
[]
[4,"The depreciation column (D) is not required as the relevant information will be provided in the following 2-C series of appendices."]

{"sheet":"App.2-B_Fixed Asset Con'ty 2011","index":7,"n_rows":74,"n_cols":14,"rows_kept":74,"cut":false,"hidden":false,"merged":[[68,1,69,13],[71,1,71,13],[8,0,8,13],[9,0,9,13],[13,4,13,7],[54,0,54,2],[56,0,56,2],[65,1,66,13]]}
[null,null,null,null,null,null,null,null,null,null,null,null,"File Number:",{"$f":"'LDC Info'!$E$18","v":"EB-2012-0126"}]
[null,null,null,null,null,null,null,null,null,null,null,null,"Exhibit:",2]
[null,null,null,null,null,null,null,null,null,null,null,null,"Tab:",3]
[null,null,null,null,null,null,null,null,null,null,null,null,"Schedule:",2]
[null,null,null,null,null,null,null,null,null,null,null,null,"Attachment:",2]
[]
[null,null,null,null,null,null,null,null,null,null,null,null,"Date:","9 November, 2012"]
[]
["Appendix 2-B"]
["Fixed Asset Continuity Schedule-CGAAP"]
[]
[null,null,null,null,null,"Year ",2011]
[]
[null,null,null,null,"Cost",null,null,null,null,null,"Accumulated Depreciation"]
["CCA Class","OEB","Description","Depreciation Rate","Opening Balance","Additions","Disposals","Closing Balance",null,"Opening Balance","Additions","Disposals","Closing Balance","Net Book Value"]
[12,1611,"Computer Software (Formally known as Account 1925)",null,{"$f":"'App.2-B_Fixed Asset Con''ty 2010'!H16","v":2505349.5},138685.47,null,{"$f":"E16+F16+G16","v":2644034.9700000002},null,{"$f":"'App.2-B_Fixed Asset Con''ty 2010'!M16","v":-1680617.98},{"$f":"-214776.78","v":-214776.78},null,{"$f":"J16+K16+L16","v":-1895394.76},{"$f":"H16+M16","v":748640.2100000002}]
["CEC",1612,"Land Rights (Formally known as Account 1906)",null,{"$f":"'App.2-B_Fixed Asset Con''ty 2010'!H17","v":0},null,null,{"$f":"E17+F17+G17","v":0},null,{"$f":"'App.2-B_Fixed Asset Con''ty 2010'!M17","v":0},null,null,{"$f":"J17+K17+L17","v":0},{"$f":"H17+M17","v":0}]
["N/A",1805,"Land",null,{"$f":"'App.2-B_Fixed Asset Con''ty 2010'!H18","v":857298.24},null,null,{"$f":"E18+F18+G18","v":857298.24},null,{"$f":"'App.2-B_Fixed Asset Con''ty 2010'!M18","v":0},null,null,{"$f":"J18+K18+L18","v":0},{"$f":"H18+M18","v":857298.24}]
[47,1808,"Buildings",null,{"$f":"'App.2-B_Fixed Asset Con''ty 2010'!H19","v":9230592.6199999992},null,null,{"$f":"E19+F19+G19","v":9230592.6199999992},null,{"$f":"'App.2-B_Fixed Asset Con''ty 2010'!M19","v":-4097280.87},-183886.11,null,{"$f":"J19+K19+L19","v":-4281166.9800000004},{"$f":"H19+M19","v":4949425.6399999987}]
[13,1808,"Buildings Improvements",null,{"$f":"'App.2-B_Fixed Asset Con''ty 2010'!H20","v":567528.35},159351.34,null,726879.69,null,{"$f":"'App.2-B_Fixed Asset Con''ty 2010'!M20","v":-62596.32},-43146.92,null,-105743.23999999999,621136.44999999995]
[47,1815,"Transformer Station Equipment >50 kV",null,{"$f":"'App.2-B_Fixed Asset Con''ty 2010'!H21","v":0},null,null,0,null,{"$f":"'App.2-B_Fixed Asset Con''ty 2010'!M21","v":0},null,null,0,0]
[47,1820,"Distribution Station Equipment <50 kV",null,{"$f":"'App.2-B_Fixed Asset Con''ty 2010'!H22","v":16299670.350000001},161491.04999999999,null,16461161.400000002,null,{"$f":"'App.2-B_Fixed Asset Con''ty 2010'!M22","v":-10348103.620000001},-436762.62,null,-10784866.24,5676295.160000002]
[47,1825,"Storage Battery Equipment",null,{"$f":"'App.2-B_Fixed Asset Con''ty 2010'!H23","v":0},null,null,0,null,{"$f":"'App.2-B_Fixed Asset Con''ty 2010'!M23","v":0},null,null,0,0]
[47,1830,"Poles, Towers & Fixtures",null,{"$f":"'App.2-B_Fixed Asset Con''ty 2010'!H24","v":16383182.68},1607668.4,null,17990851.079999998,null,{"$f":"'App.2-B_Fixed Asset Con''ty 2010'!M24","v":-7835538.6699999999},-607615.34,null,-8443154.0099999998,9547697.0699999984]
[47,1835,"Overhead Conductors & Devices",null,{"$f":"'App.2-B_Fixed Asset Con''ty 2010'!H25","v":40866691.43},836176.62,null,41702868.049999997,null,{"$f":"'App.2-B_Fixed Asset Con''ty 2010'!M25","v":-25927989.5},-1173922.6100000001,null,-27101912.109999999,14600955.939999998]
[47,1840,"Underground Conduit",null,{"$f":"'App.2-B_Fixed Asset Con''ty 2010'!H26","v":19095049.899999999},862067.59,null,19957117.489999998,null,{"$f":"'App.2-B_Fixed Asset Con''ty 2010'!M26","v":-10798164.43},-707708.22,null,-11505872.65,8451244.839999998]
[47,1845,"Underground Conductors & Devices",null,{"$f":"'App.2-B_Fixed Asset Con''ty 2010'!H27","v":19989151.240000002},676951.37,null,20666102.610000003,null,{"$f":"'App.2-B_Fixed Asset Con''ty 2010'!M27","v":-10128919.189999999},-746852.59,null,-10875771.779999999,9790330.8300000038]
[47,1850,"Line Transformers",null,{"$f":"'App.2-B_Fixed Asset Con''ty 2010'!H28","v":26909415.529999994},1019439.58,null,27928855.109999992,null,{"$f":"'App.2-B_Fixed Asset Con''ty 2010'!M28","v":-16242311.529999999},-863400.9,null,-17105712.43,10823142.679999992]
[47,1855,"Services (Overhead & Underground)",null,{"$f":"'App.2-B_Fixed Asset Con''ty 2010'!H29","v":9977239.7000000011},{"$f":"549972.74+443838.51","v":993811.25},null,10971050.950000001,null,{"$f":"'App.2-B_Fixed Asset Con''ty 2010'!M29","v":-5783351.7399999993},{"$f":"-177083.18-166874.42","v":-343957.6},null,-6127309.3399999989,4843741.6100000022]
[47,1860,"Meters",null,{"$f":"'App.2-B_Fixed Asset Con''ty 2010'!H30","v":8810025.3099999987},18979.8,null,8829005.1099999994,null,{"$f":"'App.2-B_Fixed Asset Con''ty 2010'!M30","v":-6355154.6299999999},-237974.5,null,-6593129.1299999999,2235875.9799999995]
[47,1860,"Meters (Smart Meters)",null,{"$f":"'App.2-B_Fixed Asset Con''ty 2010'!H31","v":0},null,null,0,null,{"$f":"'App.2-B_Fixed Asset Con''ty 2010'!M31","v":0},null,null,0,0]
["N/A",1905,"Land",null,{"$f":"'App.2-B_Fixed Asset Con''ty 2010'!H32","v":0},null,null,0,null,{"$f":"'App.2-B_Fixed Asset Con''ty 2010'!M32","v":0},null,null,0,0]
[47,1908,"Buildings & Fixtures",null,{"$f":"'App.2-B_Fixed Asset Con''ty 2010'!H33","v":0},null,null,0,null,{"$f":"'App.2-B_Fixed Asset Con''ty 2010'!M33","v":0},null,null,0,0]
[13,1910,"Leasehold Improvements",null,{"$f":"'App.2-B_Fixed Asset Con''ty 2010'!H34","v":0},null,null,0,null,{"$f":"'App.2-B_Fixed Asset Con''ty 2010'!M34","v":0},null,null,0,0]
[8,1915,"Office Furniture & Equipment (10 years)",null,{"$f":"'App.2-B_Fixed Asset Con''ty 2010'!H35","v":44314.559999999998},null,null,44314.559999999998,null,{"$f":"'App.2-B_Fixed Asset Con''ty 2010'!M35","v":-39836.539999999994},-938.52,null,-40775.05999999999,3539.5000000000073]
[8,1915,"Office Furniture & Equipment (5 years)",null,{"$f":"'App.2-B_Fixed Asset Con''ty 2010'!H36","v":0},null,null,0,null,{"$f":"'App.2-B_Fixed Asset Con''ty 2010'!M36","v":0},null,null,0,0]
[10,1920,"Computer Equipment - Hardware",null,{"$f":"'App.2-B_Fixed Asset Con''ty 2010'!H37","v":0},{"$f":"153986.72","v":153986.72},null,153986.72,null,{"$f":"'App.2-B_Fixed Asset Con''ty 2010'!M37","v":0},{"$f":"-15398.67","v":-15398.67},null,-15398.67,138588.04999999999]
[45,1920,"Computer Equip.-Hardware(Post Mar. 22/04)",null,{"$f":"'App.2-B_Fixed Asset Con''ty 2010'!H38","v":0},null,null,0,null,{"$f":"'App.2-B_Fixed Asset Con''ty 2010'!M38","v":0},null,null,0,0]
[45.1,1920,"Computer Equip.-Hardware(Post Mar. 19/07)",null,{"$f":"'App.2-B_Fixed Asset Con''ty 2010'!H39","v":0},null,null,0,null,{"$f":"'App.2-B_Fixed Asset Con''ty 2010'!M39","v":0},null,null,0,0]
[10,1930,"Transportation Equipment",null,{"$f":"'App.2-B_Fixed Asset Con''ty 2010'!H40","v":5041489.4000000004},562950.06999999995,-441360.72,5163078.7500000009,null,{"$f":"'App.2-B_Fixed Asset Con''ty 2010'!M40","v":-3553837.41},-419479.02,441360.72,-3531955.71,1631123.040000001]
[8,1935,"Stores Equipment",null,{"$f":"'App.2-B_Fixed Asset Con''ty 2010'!H41","v":0},null,null,0,null,{"$f":"'App.2-B_Fixed Asset Con''ty 2010'!M41","v":0},null,null,0,0]
[8,1940,"Tools, Shop & Garage Equipment",null,{"$f":"'App.2-B_Fixed Asset Con''ty 2010'!H42","v":1741755.78},77853.63,null,1819609.4100000001,null,{"$f":"'App.2-B_Fixed Asset Con''ty 2010'!M42","v":-1295447.1200000001},-82930.460000000006,null,-1378377.58,441231.83000000007]
[8,1945,"Measurement & Testing Equipment",null,{"$f":"'App.2-B_Fixed Asset Con''ty 2010'!H43","v":0},null,null,0,null,{"$f":"'App.2-B_Fixed Asset Con''ty 2010'!M43","v":0},null,null,0,0]
[8,1950,"Power Operated Equipment",null,{"$f":"'App.2-B_Fixed Asset Con''ty 2010'!H44","v":0},null,null,0,null,{"$f":"'App.2-B_Fixed Asset Con''ty 2010'!M44","v":0},null,null,0,0]
[8,1955,"Communications Equipment",null,{"$f":"'App.2-B_Fixed Asset Con''ty 2010'!H45","v":2212829.86},7757,null,2220586.86,null,{"$f":"'App.2-B_Fixed Asset Con''ty 2010'!M45","v":-1148983.97},-78788.239999999991,null,-1227772.21,992814.64999999991]
[8,1955,"Communication Equipment (Smart Meters)",null,{"$f":"'App.2-B_Fixed Asset Con''ty 2010'!H46","v":0},null,null,0,null,{"$f":"'App.2-B_Fixed Asset Con''ty 2010'!M46","v":0},null,null,0,0]
[8,1960,"Miscellaneous Equipment ",null,{"$f":"'App.2-B_Fixed Asset Con''ty 2010'!H47","v":0},null,null,0,null,{"$f":"'App.2-B_Fixed Asset Con''ty 2010'!M47","v":0},null,null,0,0]
[47,1975,"Load Management Controls Utility Premises",null,{"$f":"'App.2-B_Fixed Asset Con''ty 2010'!H48","v":0},null,null,0,null,{"$f":"'App.2-B_Fixed Asset Con''ty 2010'!M48","v":0},null,null,0,0]
[47,1980,"System Supervisory Equipment",null,{"$f":"'App.2-B_Fixed Asset Con''ty 2010'!H49","v":1555443.13},17265,null,1572708.13,null,{"$f":"'App.2-B_Fixed Asset Con''ty 2010'!M49","v":-1162505.07},-56753.42,null,-1219258.49,353449.6399999999]
[47,1985,"Miscellaneous Fixed Assets",null,{"$f":"'App.2-B_Fixed Asset Con''ty 2010'!H50","v":42116.86},null,null,42116.86,null,{"$f":"'App.2-B_Fixed Asset Con''ty 2010'!M50","v":-42116.86},null,null,-42116.86,0]
[47,1995,"Contributions & Grants",null,{"$f":"'App.2-B_Fixed Asset Con''ty 2010'!H51","v":-13513098.059999999},-1065202.67,null,-14578300.729999999,null,{"$f":"'App.2-B_Fixed Asset Con''ty 2010'!M51","v":2843835.55},561827.97,null,3405663.5199999996,-11172637.209999999]
[null,1330,"WIP - Capital Inventory",null,{"$f":"'App.2-B_Fixed Asset Con''ty 2010'!H52","v":1022658},105162,null,1127820,null,{"$f":"'App.2-B_Fixed Asset Con''ty 2010'!M52","v":0},null,null,0,1127820]
[null,2055,"Work in Process",null,{"$f":"'App.2-B_Fixed Asset Con''ty 2010'!H53","v":228308},430858.53,-228308.38,430858.15,null,{"$f":"'App.2-B_Fixed Asset Con''ty 2010'!M53","v":0},null,null,0,430858.15]
[null,null,null,null,{"$f":"'App.2-B_Fixed Asset Con''ty 2010'!H54","v":0},null,null,null,null,{"$f":"'App.2-B_Fixed Asset Con''ty 2010'!M54","v":0}]
["Total prior to Board ordered removal of CIS related to water billing",null,null,null,{"$f":"SUM(E16:E54)","v":169867012.38000003},{"$f":"SUM(F16:F54)","v":6765252.75},{"$f":"SUM(G16:G54)","v":-669669.1},{"$f":"SUM(H16:H54)","v":175962596.03000003},null,{"$f":"SUM(J16:J53)","v":-103658919.89999999},-5652464.5499999989,441360.72,-108870023.72999997,67092572.299999997]
[12,1611,"Computer Software",null,{"$f":"'App.2-B_Fixed Asset Con''ty 2010'!H56","v":-126796.40490400001},{"$f":"-13984.22*(1*0.2104)","v":-2942.279888},null,{"$f":"E56+F56+G56","v":-129738.68479200001},null,{"$f":"'App.2-B_Fixed Asset Con''ty 2010'!M56","v":12679.64},25653.51,null,{"$f":"J56+K56+L56","v":38333.149999999994},{"$f":"H56+M56","v":-91405.53479200002}]
["Total subsequent to Board ordered removal of CIS related to water billing",null,null,null,{"$f":"SUM(E55:E56)","v":169740215.97509602},{"$f":"SUM(F55:F56)","v":6762310.4701119997},{"$f":"SUM(G55:G56)","v":-669669.1},{"$f":"SUM(H55:H56)","v":175832857.34520802},null,{"$f":"SUM(J55:J56)","v":-103646240.25999999},{"$f":"SUM(K55:K56)","v":-5626811.0399999991},441360.72,-108831690.57999997,67001166.765207998]
[]
[null,null,null,null,null,null,null,null,null,"Less: Fully Allocated Depreciation"]
[10,null,"Transportation",null,null,null,null,null,null,"Transportation",null,-419479.02]
[8,null,"Stores Equipment",null,null,null,null,null,null,"Stores Equipment",null,-82930.460000000006]
[null,null,null,null,null,null,null,null,null,"Net Depreciation",null,{"$f":"K57-L60-L61","v":-5124401.5599999996}]
[]
["Notes:"]
[]
[1,"Tables in the format outlined above covering all fixed asset accounts should be submitted for the Test Year, Bridge Year and all relevant historical years.  At a minimum , the applicant must provide data for the earlier of: 1) all historical years back to its last rebasing; or 2) at least three years of historical actuals, in addition to Bridge Year and Test Year forecasts."]
[]
[]
[2,"The \"CCA Class\" for fixed assets should agree with the CCA Class used for tax purposes in Tax Returns. Fixed Assets sub-components may be used where the underlying asset components are classified under multiple CCA Classes for tax purposes. If an applicant uses any different classes from those shown in the table, an explanation should be provided. (also see note 3 below)."]
[]
[]
[3,"The table may need to be customized for a utility's asset categories or for any new asset accounts announced or authorized by the Board."]
[]
[4,"The depreciation column (D) is not required as the relevant information will be provided in the following 2-C series of appendices."]

{"sheet":"App.2-B_FA Con'ty 2012 CGAAP","index":8,"n_rows":74,"n_cols":14,"rows_kept":74,"cut":false,"hidden":false,"merged":[[68,1,69,13],[71,1,71,13],[8,0,8,13],[9,0,9,13],[13,4,13,7],[54,0,54,2],[56,0,56,2],[65,1,66,13]]}
[null,null,null,null,null,null,null,null,null,null,null,null,"File Number:",{"$f":"'LDC Info'!$E$18","v":"EB-2012-0126"}]
[null,null,null,null,null,null,null,null,null,null,null,null,"Exhibit:",2]
[null,null,null,null,null,null,null,null,null,null,null,null,"Tab:",3]
[null,null,null,null,null,null,null,null,null,null,null,null,"Schedule:",2]
[null,null,null,null,null,null,null,null,null,null,null,null,"Attachment:",2]
[]
[null,null,null,null,null,null,null,null,null,null,null,null,"Date:","9 November, 2012"]
[]
["Appendix 2-B"]
["Fixed Asset Continuity Schedule-CGAAP"]
[]
[null,null,null,null,null,"Year ",2012]
[]
[null,null,null,null,"Cost",null,null,null,null,null,"Accumulated Depreciation"]
["CCA Class","OEB","Description","Depreciation Rate","Opening Balance","Additions","Disposals","Closing Balance",null,"Opening Balance","Additions","Disposals","Closing Balance","Net Book Value"]
[12,1611,"Computer Software (Formally known as Account 1925)",null,{"$f":"'App.2-B_Fixed Asset Con''ty 2011'!H16","v":2644034.9700000002},248175.35,null,{"$f":"E16+F16+G16","v":2892210.3200000003},null,{"$f":"'App.2-B_Fixed Asset Con''ty 2011'!M16","v":-1895394.76},-253462.85700000002,null,{"$f":"J16+K16+L16","v":-2148857.6170000001},{"$f":"H16+M16","v":743352.70300000021}]
["CEC",1612,"Land Rights (Formally known as Account 1906)",null,{"$f":"'App.2-B_Fixed Asset Con''ty 2011'!H17","v":0},null,null,{"$f":"E17+F17+G17","v":0},null,{"$f":"'App.2-B_Fixed Asset Con''ty 2011'!M17","v":0},null,null,{"$f":"J17+K17+L17","v":0},{"$f":"H17+M17","v":0}]
["N/A",1805,"Land",null,{"$f":"'App.2-B_Fixed Asset Con''ty 2011'!H18","v":857298.24},5569.21,null,{"$f":"E18+F18+G18","v":862867.45},null,{"$f":"'App.2-B_Fixed Asset Con''ty 2011'!M18","v":0},null,null,{"$f":"J18+K18+L18","v":0},{"$f":"H18+M18","v":862867.45}]
[47,1808,"Buildings",null,{"$f":"'App.2-B_Fixed Asset Con''ty 2011'!H19","v":9230592.6199999992},null,null,{"$f":"E19+F19+G19","v":9230592.6199999992},null,{"$f":"'App.2-B_Fixed Asset Con''ty 2011'!M19","v":-4281166.9800000004},-183562.17645017616,null,{"$f":"J19+K19+L19","v":-4464729.1564501766},{"$f":"H19+M19","v":4765863.4635498226}]
[47,1808,"Buildings Improvements",null,{"$f":"'App.2-B_Fixed Asset Con''ty 2011'!H20","v":726879.69},310378.69,null,1037258.3799999999,null,{"$f":"'App.2-B_Fixed Asset Con''ty 2011'!M20","v":-105743.23999999999},-58804.601333333332,null,-164547.84133333332,872710.5386666666]
[47,1815,"Transformer Station Equipment >50 kV",null,{"$f":"'App.2-B_Fixed Asset Con''ty 2011'!H21","v":0},null,null,0,null,{"$f":"'App.2-B_Fixed Asset Con''ty 2011'!M21","v":0},null,null,0,0]
[47,1820,"Distribution Station Equipment <50 kV",null,{"$f":"'App.2-B_Fixed Asset Con''ty 2011'!H22","v":16461161.400000002},1379969.21,null,17841130.610000003,null,{"$f":"'App.2-B_Fixed Asset Con''ty 2011'!M22","v":-10784866.24},-446812.10248243716,null,-11231678.342482436,6609452.2675175667]
[47,1825,"Storage Battery Equipment",null,{"$f":"'App.2-B_Fixed Asset Con''ty 2011'!H23","v":0},null,null,0,null,{"$f":"'App.2-B_Fixed Asset Con''ty 2011'!M23","v":0},null,null,0,0]
[47,1830,"Poles, Towers & Fixtures",null,{"$f":"'App.2-B_Fixed Asset Con''ty 2011'!H24","v":17990851.079999998},1272073.0730144987,null,19262924.153014496,null,{"$f":"'App.2-B_Fixed Asset Con''ty 2011'!M24","v":-8443154.0099999998},-622917.3358634304,null,-9066071.3458634298,10196852.807151066]
[47,1835,"Overhead Conductors & Devices",null,{"$f":"'App.2-B_Fixed Asset Con''ty 2011'!H25","v":41702868.049999997},1001640.7206515232,null,42704508.770651519,null,{"$f":"'App.2-B_Fixed Asset Con''ty 2011'!M25","v":-27101912.109999999},-1225299.9878833438,null,-28327212.097883344,14377296.672768176]
[47,1840,"Underground Conduit",null,{"$f":"'App.2-B_Fixed Asset Con''ty 2011'!H26","v":19957117.489999998},1001464.8190448342,null,20958582.309044834,null,{"$f":"'App.2-B_Fixed Asset Con''ty 2011'!M26","v":-11505872.65},-672533.91484324122,null,-12178406.564843241,8780175.7442015931]
[47,1845,"Underground Conductors & Devices",null,{"$f":"'App.2-B_Fixed Asset Con''ty 2011'!H27","v":20666102.610000003},778816.20620152948,null,21444918.816201534,null,{"$f":"'App.2-B_Fixed Asset Con''ty 2011'!M27","v":-10875771.779999999},-790089.9934730347,null,-11665861.773473034,9779057.0427285004]
[47,1850,"Line Transformers",null,{"$f":"'App.2-B_Fixed Asset Con''ty 2011'!H28","v":27928855.109999992},1587403.0363836461,null,29516258.146383639,null,{"$f":"'App.2-B_Fixed Asset Con''ty 2011'!M28","v":-17105712.43},-853584.08068461192,null,-17959296.510684613,11556961.635699026]
[47,1855,"Services (Overhead & Underground)",null,{"$f":"'App.2-B_Fixed Asset Con''ty 2011'!H29","v":10971050.950000001},1040786.5894194156,null,12011837.539419416,null,{"$f":"'App.2-B_Fixed Asset Con''ty 2011'!M29","v":-6127309.3399999989},-366530.5517088084,null,-6493839.8917088071,5517997.6477106092]
[47,1860,"Meters",null,{"$f":"'App.2-B_Fixed Asset Con''ty 2011'!H30","v":8829005.1099999994},107254.1,null,8936259.209999999,null,{"$f":"'App.2-B_Fixed Asset Con''ty 2011'!M30","v":-6593129.1299999999},-224692.8464857142,null,-6817821.9764857143,2118437.2335142847]
[47,1860,"Meters (Smart Meters)",null,{"$f":"'App.2-B_Fixed Asset Con''ty 2011'!H31","v":0},null,null,0,null,{"$f":"'App.2-B_Fixed Asset Con''ty 2011'!M31","v":0},null,null,0,0]
["N/A",1905,"Land",null,{"$f":"'App.2-B_Fixed Asset Con''ty 2011'!H32","v":0},null,null,0,null,{"$f":"'App.2-B_Fixed Asset Con''ty 2011'!M32","v":0},null,null,0,0]
[47,1908,"Buildings & Fixtures",null,{"$f":"'App.2-B_Fixed Asset Con''ty 2011'!H33","v":0},null,null,0,null,{"$f":"'App.2-B_Fixed Asset Con''ty 2011'!M33","v":0},null,null,0,0]
[13,1910,"Leasehold Improvements",null,{"$f":"'App.2-B_Fixed Asset Con''ty 2011'!H34","v":0},null,null,0,null,{"$f":"'App.2-B_Fixed Asset Con''ty 2011'!M34","v":0},null,null,0,0]
[8,1915,"Office Furniture & Equipment (10 years)",null,{"$f":"'App.2-B_Fixed Asset Con''ty 2011'!H35","v":44314.559999999998},null,null,44314.559999999998,null,{"$f":"'App.2-B_Fixed Asset Con''ty 2011'!M35","v":-40775.05999999999},-938.51849999999945,null,-41713.578499999989,2600.981500000009]
[8,1915,"Office Furniture & Equipment (5 years)",null,{"$f":"'App.2-B_Fixed Asset Con''ty 2011'!H36","v":0},null,null,0,null,{"$f":"'App.2-B_Fixed Asset Con''ty 2011'!M36","v":0},null,null,0,0]
[10,1920,"Computer Equipment - Hardware",null,{"$f":"'App.2-B_Fixed Asset Con''ty 2011'!H37","v":153986.72},371510.34,null,525497.06000000006,null,{"$f":"'App.2-B_Fixed Asset Con''ty 2011'!M37","v":-15398.67},-67948.377999999997,null,-83347.047999999995,442150.01200000005]
[45,1920,"Computer Equip.-Hardware(Post Mar. 22/04)",null,{"$f":"'App.2-B_Fixed Asset Con''ty 2011'!H38","v":0},null,null,0,null,{"$f":"'App.2-B_Fixed Asset Con''ty 2011'!M38","v":0},null,null,0,0]
[45.1,1920,"Computer Equip.-Hardware(Post Mar. 19/07)",null,{"$f":"'App.2-B_Fixed Asset Con''ty 2011'!H39","v":0},null,null,0,null,{"$f":"'App.2-B_Fixed Asset Con''ty 2011'!M39","v":0},null,null,0,0]
[10,1930,"Transportation Equipment",null,{"$f":"'App.2-B_Fixed Asset Con''ty 2011'!H40","v":5163078.7500000009},193455.65000000002,-91190.54,5265343.8600000013,null,{"$f":"'App.2-B_Fixed Asset Con''ty 2011'!M40","v":-3531955.71},-430191.42059523816,87823.64,-3874323.4905952378,1391020.3694047634]
[8,1935,"Stores Equipment",null,{"$f":"'App.2-B_Fixed Asset Con''ty 2011'!H41","v":0},null,null,0,null,{"$f":"'App.2-B_Fixed Asset Con''ty 2011'!M41","v":0},null,null,0,0]
[8,1940,"Tools, Shop & Garage Equipment",null,{"$f":"'App.2-B_Fixed Asset Con''ty 2011'!H42","v":1819609.4100000001},152809.49,null,1972418.9000000001,null,{"$f":"'App.2-B_Fixed Asset Con''ty 2011'!M42","v":-1378377.58},-89459.364999999991,null,-1467836.9450000001,504581.95500000007]
[8,1945,"Measurement & Testing Equipment",null,{"$f":"'App.2-B_Fixed Asset Con''ty 2011'!H43","v":0},null,null,0,null,{"$f":"'App.2-B_Fixed Asset Con''ty 2011'!M43","v":0},null,null,0,0]
[8,1950,"Power Operated Equipment",null,{"$f":"'App.2-B_Fixed Asset Con''ty 2011'!H44","v":0},null,null,0,null,{"$f":"'App.2-B_Fixed Asset Con''ty 2011'!M44","v":0},null,null,0,0]
[8,1955,"Communications Equipment",null,{"$f":"'App.2-B_Fixed Asset Con''ty 2011'!H45","v":2220586.86},66925.459999999992,null,2287512.3199999998,null,{"$f":"'App.2-B_Fixed Asset Con''ty 2011'!M45","v":-1227772.21},-81293.505699999994,null,-1309065.7157000001,978446.60429999977]
[8,1955,"Communication Equipment (Smart Meters)",null,{"$f":"'App.2-B_Fixed Asset Con''ty 2011'!H46","v":0},null,null,0,null,{"$f":"'App.2-B_Fixed Asset Con''ty 2011'!M46","v":0},null,null,0,0]
[8,1960,"Miscellaneous Equipment ",null,{"$f":"'App.2-B_Fixed Asset Con''ty 2011'!H47","v":0},null,null,0,null,{"$f":"'App.2-B_Fixed Asset Con''ty 2011'!M47","v":0},null,null,0,0]
[47,1975,"Load Management Controls Utility Premises",null,{"$f":"'App.2-B_Fixed Asset Con''ty 2011'!H48","v":0},null,null,0,null,{"$f":"'App.2-B_Fixed Asset Con''ty 2011'!M48","v":0},null,null,0,0]
[47,1980,"System Supervisory Equipment",null,{"$f":"'App.2-B_Fixed Asset Con''ty 2011'!H49","v":1572708.13},null,null,1572708.13,null,{"$f":"'App.2-B_Fixed Asset Con''ty 2011'!M49","v":-1219258.49},-55343.852666666658,null,-1274602.3426666667,298105.78733333317]
[47,1985,"Miscellaneous Fixed Assets",null,{"$f":"'App.2-B_Fixed Asset Con''ty 2011'!H50","v":42116.86},null,null,42116.86,null,{"$f":"'App.2-B_Fixed Asset Con''ty 2011'!M50","v":-42116.86},null,null,-42116.86,0]
[47,1995,"Contributions & Grants",null,{"$f":"'App.2-B_Fixed Asset Con''ty 2011'!H51","v":-14578300.729999999},-1074344.3023333333,null,-15652645.032333331,null,{"$f":"'App.2-B_Fixed Asset Con''ty 2011'!M51","v":3405663.5199999996},604618.90240000002,null,4010282.4223999996,-11642362.609933332]
[null,1330,"WIP - Capital Inventory",null,{"$f":"'App.2-B_Fixed Asset Con''ty 2011'!H52","v":1127820},null,null,1127820,null,{"$f":"'App.2-B_Fixed Asset Con''ty 2011'!M52","v":0},null,null,0,1127820]
[null,2055,"Work in Process",null,{"$f":"'App.2-B_Fixed Asset Con''ty 2011'!H53","v":430858.15},1669878,null,2100736.15,null,{"$f":"'App.2-B_Fixed Asset Con''ty 2011'!M53","v":0},null,null,0,2100736.15]
[null,null,null,null,{"$f":"'App.2-B_Fixed Asset Con''ty 2011'!H54","v":0},null,null,null,null,{"$f":"'App.2-B_Fixed Asset Con''ty 2011'!M54","v":0}]
["Total prior to Board ordered removal of CIS related to water billing",null,null,null,{"$f":"SUM(E16:E54)","v":175962596.03000003},{"$f":"SUM(F16:F54)","v":10113765.642382115},{"$f":"SUM(G16:G54)","v":-91190.54},{"$f":"SUM(H16:H54)","v":185985171.13238215},null,{"$f":"SUM(J16:J53)","v":-108870023.72999997},-5818846.5862700352,87823.64,-114601046.67627002,71384124.456112072]
[12,1611,"Computer Software",null,{"$f":"'App.2-B_Fixed Asset Con''ty 2011'!H56","v":-129738.68479200001},null,null,{"$f":"E56+F56+G56","v":-129738.68479200001},null,{"$f":"'App.2-B_Fixed Asset Con''ty 2011'!M56","v":38333.149999999994},{"$f":"25947.74","v":25947.74},null,{"$f":"J56+K56+L56","v":64280.89},{"$f":"H56+M56","v":-65457.794792000015}]
["Total subsequent to Board ordered removal of CIS related to water billing",null,null,null,{"$f":"SUM(E55:E56)","v":175832857.34520802},{"$f":"SUM(F55:F56)","v":10113765.642382115},{"$f":"SUM(G55:G56)","v":-91190.54},{"$f":"SUM(H55:H56)","v":185855432.44759014},null,{"$f":"SUM(J55:J56)","v":-108831690.57999997},{"$f":"SUM(K55:K56)","v":-5792898.846270035},87823.64,-114536765.78627002,71318666.661320075]
[]
[null,null,null,null,null,null,null,null,null,"Less: Fully Allocated Depreciation"]
[10,null,"Transportation",null,null,null,null,null,null,"Transportation",null,{"$f":"K40","v":-430191.42059523816}]
[8,null,"Stores Equipment",null,null,null,null,null,null,"Stores Equipment",null,{"$f":"K42","v":-89459.364999999991}]
[null,null,null,null,null,null,null,null,null,"Net Depreciation",null,{"$f":"K57-L60-L61","v":-5273248.0606747968}]
[]
["Notes:"]
[]
[1,"Tables in the format outlined above covering all fixed asset accounts should be submitted for the Test Year, Bridge Year and all relevant historical years.  At a minimum , the applicant must provide data for the earlier of: 1) all historical years back to its last rebasing; or 2) at least three years of historical actuals, in addition to Bridge Year and Test Year forecasts."]
[]
[]
[2,"The \"CCA Class\" for fixed assets should agree with the CCA Class used for tax purposes in Tax Returns. Fixed Assets sub-components may be used where the underlying asset components are classified under multiple CCA Classes for tax purposes. If an applicant uses any different classes from those shown in the table, an explanation should be provided. (also see note 3 below)."]
[]
[]
[3,"The table may need to be customized for a utility's asset categories or for any new asset accounts announced or authorized by the Board."]
[]
[4,"The depreciation column (D) is not required as the relevant information will be provided in the following 2-C series of appendices."]

{"sheet":"App.2-B_Fixed Asset Con'ty 2013","index":9,"n_rows":74,"n_cols":16,"rows_kept":74,"cut":false,"hidden":false,"merged":[[68,1,69,15],[71,1,71,15],[8,0,8,15],[9,0,9,15],[13,4,13,8],[54,0,54,2],[56,0,56,2],[65,1,66,15]]}
[null,null,null,null,null,null,null,null,null,null,null,null,null,null,"File Number:",{"$f":"'LDC Info'!$E$18","v":"EB-2012-0126"}]
[null,null,null,null,null,null,null,null,null,null,null,null,null,null,"Exhibit:",2]
[null,null,null,null,null,null,null,null,null,null,null,null,null,null,"Tab:",3]
[null,null,null,null,null,null,null,null,null,null,null,null,null,null,"Schedule:",2]
[null,null,null,null,null,null,null,null,null,null,null,null,null,null,"Attachment:",2]
[]
[null,null,null,null,null,null,null,null,null,null,null,null,null,null,"Date:","9 November, 2012"]
[]
["Appendix 2-B"]
["Fixed Asset Continuity Schedule-CGAAP"]
[]
[null,null,null,null,null,"Year ",null,2013]
[]
[null,null,null,null,"Cost",null,null,null,null,null,null,"Accumulated Depreciation"]
["CCA Class","OEB","Description","Depreciation Rate","Opening Balance","Additions","Smart Meter & Stranded Meters","Disposals","Closing Balance",null,"Opening Balance","Additions","Smart Meter & Stranded Meters","Disposals","Closing Balance","Net Book Value"]
[12,1611,"Computer Software (Formally known as Account 1925)",null,{"$f":"'App.2-B_FA Con''ty 2012 CGAAP'!H16","v":2892210.3200000003},375000,275347,null,{"$f":"E16+F16+G16+H16","v":3542557.3200000003},null,{"$f":"'App.2-B_FA Con''ty 2012 CGAAP'!M16","v":-2148857.6170000001},{"$f":"-'App.2-CG_EUL_DepExp_2013'!M16","v":-364834.64799999999},-81979,null,{"$f":"K16+L16+M16+N16","v":-2595671.2650000001},{"$f":"I16+O16","v":946886.05500000017}]
["CEC",1612,"Land Rights (Formally known as Account 1906)",null,{"$f":"'App.2-B_FA Con''ty 2012 CGAAP'!H17","v":0},null,null,null,{"$f":"E17+F17+G17+H17","v":0},null,{"$f":"'App.2-B_FA Con''ty 2012 CGAAP'!M17","v":0},null,null,null,{"$f":"K17+L17+M17+N17","v":0},{"$f":"I17+O17","v":0}]
["N/A",1805,"Land",null,{"$f":"'App.2-B_FA Con''ty 2012 CGAAP'!H18","v":862867.45},null,null,null,862867.45,null,{"$f":"'App.2-B_FA Con''ty 2012 CGAAP'!M18","v":0},null,null,null,0,{"$f":"I18+O18","v":862867.45}]
[47,1808,"Buildings",null,{"$f":"'App.2-B_FA Con''ty 2012 CGAAP'!H19","v":9230592.6199999992},null,null,null,9230592.6199999992,null,{"$f":"'App.2-B_FA Con''ty 2012 CGAAP'!M19","v":-4464729.1564501766},{"$f":"-'App.2-CG_EUL_DepExp_2013'!M19","v":-235990.15415234448},null,null,-4700719.3106025215,{"$f":"I19+O19","v":4529873.3093974777}]
[47,1808,"Buildings Improvements",null,{"$f":"'App.2-B_FA Con''ty 2012 CGAAP'!H20","v":1037258.3799999999},966000,null,null,2003258.38,null,{"$f":"'App.2-B_FA Con''ty 2012 CGAAP'!M20","v":-164547.84133333332},{"$f":"-'App.2-CG_EUL_DepExp_2013'!M20","v":-94009.954337606832},null,null,-258557.79567094013,1744700.5843290598]
[47,1815,"Transformer Station Equipment >50 kV",null,{"$f":"'App.2-B_FA Con''ty 2012 CGAAP'!H21","v":0},null,null,null,0,null,{"$f":"'App.2-B_FA Con''ty 2012 CGAAP'!M21","v":0},null,null,null,0,0]
[47,1820,"Distribution Station Equipment <50 kV",null,{"$f":"'App.2-B_FA Con''ty 2012 CGAAP'!H22","v":17841130.610000003},2449100.0068652998,null,null,20290230.616865303,null,{"$f":"'App.2-B_FA Con''ty 2012 CGAAP'!M22","v":-11231678.342482436},{"$f":"-'App.2-CG_EUL_DepExp_2013'!M22-'App.2-CG_EUL_DepExp_2013'!M23-'App.2-CG_EUL_DepExp_2013'!M24","v":-519388.24133642286},null,null,-11751066.583818858,8539164.0330464449]
[47,1825,"Storage Battery Equipment",null,{"$f":"'App.2-B_FA Con''ty 2012 CGAAP'!H23","v":0},null,null,null,0,null,{"$f":"'App.2-B_FA Con''ty 2012 CGAAP'!M23","v":0},null,null,null,0,0]
[47,1830,"Poles, Towers & Fixtures",null,{"$f":"'App.2-B_FA Con''ty 2012 CGAAP'!H24","v":19262924.153014496},1456391.2782894776,null,null,20719315.431303974,null,{"$f":"'App.2-B_FA Con''ty 2012 CGAAP'!M24","v":-9066071.3458634298},{"$f":"-'App.2-CG_EUL_DepExp_2013'!M26","v":-375934.66842450819},null,null,-9442006.0142879374,11277309.417016037]
[47,1835,"Overhead Conductors & Devices",null,{"$f":"'App.2-B_FA Con''ty 2012 CGAAP'!H25","v":42704508.770651519},1336039.828288645,null,null,44040548.598940164,null,{"$f":"'App.2-B_FA Con''ty 2012 CGAAP'!M25","v":-28327212.097883344},{"$f":"-'App.2-CG_EUL_DepExp_2013'!M27","v":-489367.65450994851},null,null,-28816579.75239329,15223968.846546873]
[47,1840,"Underground Conduit",null,{"$f":"'App.2-B_FA Con''ty 2012 CGAAP'!H26","v":20958582.309044834},482675.74718514731,null,null,21441258.056229983,null,{"$f":"'App.2-B_FA Con''ty 2012 CGAAP'!M26","v":-12178406.564843241},{"$f":"-'App.2-CG_EUL_DepExp_2013'!M28","v":-248290.52614170738},null,null,-12426697.090984948,9014560.9652450345]
[47,1845,"Underground Conductors & Devices",null,{"$f":"'App.2-B_FA Con''ty 2012 CGAAP'!H27","v":21444918.816201534},511039.06360249,null,null,21955957.879804023,null,{"$f":"'App.2-B_FA Con''ty 2012 CGAAP'!M27","v":-11665861.773473034},{"$f":"-'App.2-CG_EUL_DepExp_2013'!M29","v":-430507.66112310038},null,null,-12096369.434596134,9859588.4452078883]
[47,1850,"Line Transformers",null,{"$f":"'App.2-B_FA Con''ty 2012 CGAAP'!H28","v":29516258.146383639},1272686.0528473882,null,null,30788944.199231029,null,{"$f":"'App.2-B_FA Con''ty 2012 CGAAP'!M28","v":-17959296.510684613},{"$f":"-'App.2-CG_EUL_DepExp_2013'!M30","v":-487428.66791205929},null,null,-18446725.178596672,12342219.020634357]
[47,1855,"Services (Overhead & Underground)",null,{"$f":"'App.2-B_FA Con''ty 2012 CGAAP'!H29","v":12011837.539419416},909728.47299114894,null,null,12921566.012410566,null,{"$f":"'App.2-B_FA Con''ty 2012 CGAAP'!M29","v":-6493839.8917088071},{"$f":"-'App.2-CG_EUL_DepExp_2013'!M31","v":-210673.10476813407},null,null,-6704512.9964769408,6217053.0159336254]
[47,1860,"Meters",null,{"$f":"'App.2-B_FA Con''ty 2012 CGAAP'!H30","v":8936259.209999999},null,-7076701.2975999974,null,1859557.9124000017,null,{"$f":"'App.2-B_FA Con''ty 2012 CGAAP'!M30","v":-6817821.9764857143},{"$f":"-'App.2-CG_EUL_DepExp_2013'!M32-'App.2-CG_EUL_DepExp_2013'!M35-'App.2-CG_EUL_DepExp_2013'!M36","v":-44089.966880000276},5868346.9527874291,null,-993564.99057828542,865992.92182171624]
[47,1860,"Meters (Smart Meters)",null,{"$f":"'App.2-B_FA Con''ty 2012 CGAAP'!H31","v":0},100000.12410948519,6523624,null,6623624.1241094852,null,{"$f":"'App.2-B_FA Con''ty 2012 CGAAP'!M31","v":0},{"$f":"-'App.2-CG_EUL_DepExp_2013'!M34","v":-438241.60080364946},-1047818,null,-1486059.6008036495,5137564.5233058352]
["N/A",1905,"Land",null,{"$f":"'App.2-B_FA Con''ty 2012 CGAAP'!H32","v":0},null,null,null,0,null,{"$f":"'App.2-B_FA Con''ty 2012 CGAAP'!M32","v":0},null,null,null,0,0]
[47,1908,"Buildings & Fixtures",null,{"$f":"'App.2-B_FA Con''ty 2012 CGAAP'!H33","v":0},null,null,null,0,null,{"$f":"'App.2-B_FA Con''ty 2012 CGAAP'!M33","v":0},null,null,null,0,0]
[13,1910,"Leasehold Improvements",null,{"$f":"'App.2-B_FA Con''ty 2012 CGAAP'!H34","v":0},null,null,null,0,null,{"$f":"'App.2-B_FA Con''ty 2012 CGAAP'!M34","v":0},null,null,null,0,0]
[8,1915,"Office Furniture & Equipment (10 years)",null,{"$f":"'App.2-B_FA Con''ty 2012 CGAAP'!H35","v":44314.559999999998},null,null,null,44314.559999999998,null,{"$f":"'App.2-B_FA Con''ty 2012 CGAAP'!M35","v":-41713.578499999989},{"$f":"-'App.2-CG_EUL_DepExp_2013'!M40","v":-938.51849999999945},null,null,-42652.096999999987,1662.4630000000107]
[8,1915,"Office Furniture & Equipment (5 years)",null,{"$f":"'App.2-B_FA Con''ty 2012 CGAAP'!H36","v":0},null,null,null,0,null,{"$f":"'App.2-B_FA Con''ty 2012 CGAAP'!M36","v":0},null,null,null,0,0]
[10,1920,"Computer Equipment - Hardware",null,{"$f":"'App.2-B_FA Con''ty 2012 CGAAP'!H37","v":525497.06000000006},0,204815,null,730312.06,null,{"$f":"'App.2-B_FA Con''ty 2012 CGAAP'!M37","v":-83347.047999999995},{"$f":"-'App.2-CG_EUL_DepExp_2013'!M42","v":-146062.484},-101801,null,-331210.53200000001,399101.52800000005]
[45,1920,"Computer Equip.-Hardware(Post Mar. 22/04)",null,{"$f":"'App.2-B_FA Con''ty 2012 CGAAP'!H38","v":0},null,null,null,0,null,{"$f":"'App.2-B_FA Con''ty 2012 CGAAP'!M38","v":0},null,null,null,0,0]
[45.1,1920,"Computer Equip.-Hardware(Post Mar. 19/07)",null,{"$f":"'App.2-B_FA Con''ty 2012 CGAAP'!H39","v":0},null,null,null,0,null,{"$f":"'App.2-B_FA Con''ty 2012 CGAAP'!M39","v":0},null,null,null,0,0]
[10,1930,"Transportation Equipment",null,{"$f":"'App.2-B_FA Con''ty 2012 CGAAP'!H40","v":5265343.8600000013},1118450,null,{"$f":"-458502.24","v":-458502.24},5925291.620000001,null,{"$f":"'App.2-B_FA Con''ty 2012 CGAAP'!M40","v":-3874323.4905952378},{"$f":"-'App.2-CG_EUL_DepExp_2013'!M45-'App.2-CG_EUL_DepExp_2013'!M46","v":-215464.99463914768},null,458502.24,-3631286.2452343851,2294005.3747656159]
[8,1935,"Stores Equipment",null,{"$f":"'App.2-B_FA Con''ty 2012 CGAAP'!H41","v":0},null,null,null,0,null,{"$f":"'App.2-B_FA Con''ty 2012 CGAAP'!M41","v":0},null,null,null,0,0]
[8,1940,"Tools, Shop & Garage Equipment",null,{"$f":"'App.2-B_FA Con''ty 2012 CGAAP'!H42","v":1972418.9000000001},160000,null,null,2132418.9000000004,null,{"$f":"'App.2-B_FA Con''ty 2012 CGAAP'!M42","v":-1467836.9450000001},{"$f":"-'App.2-CG_EUL_DepExp_2013'!M48","v":-92164.853000000003},null,null,-1560001.798,572417.10200000042]
[8,1945,"Measurement & Testing Equipment",null,{"$f":"'App.2-B_FA Con''ty 2012 CGAAP'!H43","v":0},null,null,null,0,null,{"$f":"'App.2-B_FA Con''ty 2012 CGAAP'!M43","v":0},null,null,null,0,0]
[8,1950,"Power Operated Equipment",null,{"$f":"'App.2-B_FA Con''ty 2012 CGAAP'!H44","v":0},null,null,null,0,null,{"$f":"'App.2-B_FA Con''ty 2012 CGAAP'!M44","v":0},null,null,null,0,0]
[8,1955,"Communications Equipment",null,{"$f":"'App.2-B_FA Con''ty 2012 CGAAP'!H45","v":2287512.3199999998},50000,null,null,2337512.3199999998,null,{"$f":"'App.2-B_FA Con''ty 2012 CGAAP'!M45","v":-1309065.7157000001},{"$f":"-'App.2-CG_EUL_DepExp_2013'!M51","v":-87139.755699999994},null,null,-1396205.4714000002,941306.84859999968]
[8,1955,"Communication Equipment (Smart Meters)",null,{"$f":"'App.2-B_FA Con''ty 2012 CGAAP'!H46","v":0},null,null,null,0,null,{"$f":"'App.2-B_FA Con''ty 2012 CGAAP'!M46","v":0},null,null,null,0,0]
[8,1960,"Miscellaneous Equipment ",null,{"$f":"'App.2-B_FA Con''ty 2012 CGAAP'!H47","v":0},null,16502,null,16502,null,{"$f":"'App.2-B_FA Con''ty 2012 CGAAP'!M47","v":0},{"$f":"-'App.2-CG_EUL_DepExp_2013'!M53","v":-1650.1889999999999},-4125,null,-5775.1890000000003,10726.811]
[47,1975,"Load Management Controls Utility Premises",null,{"$f":"'App.2-B_FA Con''ty 2012 CGAAP'!H48","v":0},null,null,null,0,null,{"$f":"'App.2-B_FA Con''ty 2012 CGAAP'!M48","v":0},null,null,null,0,0]
[47,1980,"System Supervisory Equipment",null,{"$f":"'App.2-B_FA Con''ty 2012 CGAAP'!H49","v":1572708.13},379491.03366573114,null,null,1952199.163665731,null,{"$f":"'App.2-B_FA Con''ty 2012 CGAAP'!M49","v":-1274602.3426666667},{"$f":"-'App.2-CG_EUL_DepExp_2013'!M55","v":-30686.304496348639},null,null,-1305288.6471630153,646910.51650271565]
[47,1985,"Miscellaneous Fixed Assets",null,{"$f":"'App.2-B_FA Con''ty 2012 CGAAP'!H50","v":42116.86},null,null,null,42116.86,null,{"$f":"'App.2-B_FA Con''ty 2012 CGAAP'!M50","v":-42116.86},{"$f":"-'App.2-CG_EUL_DepExp_2013'!M56","v":0},null,null,-42116.86,0]
[47,1995,"Contributions & Grants",null,{"$f":"'App.2-B_FA Con''ty 2012 CGAAP'!H51","v":-15652645.032333331},-703790,null,null,-16356435.032333331,null,{"$f":"'App.2-B_FA Con''ty 2012 CGAAP'!M51","v":4010282.4223999996},{"$f":"-'App.2-CG_EUL_DepExp_2013'!M57","v":302422.09536764864},null,null,4312704.5177676482,-12043730.514565684]
[null,1330,"WIP - Capital Inventory",null,{"$f":"'App.2-B_FA Con''ty 2012 CGAAP'!H52","v":1127820},null,null,null,1127820,null,{"$f":"'App.2-B_FA Con''ty 2012 CGAAP'!M52","v":0},null,null,null,0,1127820]
[null,2055,"Work in Process",null,{"$f":"'App.2-B_FA Con''ty 2012 CGAAP'!H53","v":2100736.15},101536,null,-1735494,466778.14999999991,null,{"$f":"'App.2-B_FA Con''ty 2012 CGAAP'!M53","v":0},null,null,null,0,466778.14999999991]
[null,null,null,null,{"$f":"'App.2-B_FA Con''ty 2012 CGAAP'!H54","v":0},null,null,null,null,null,{"$f":"'App.2-B_FA Con''ty 2012 CGAAP'!M54","v":0}]
["Total prior to Board ordered removal of CIS related to water billing",null,null,null,{"$f":"SUM(E16:E54)","v":185985171.13238215},{"$f":"SUM(F16:F54)","v":10964347.607844815},{"$f":"SUM(G16:G54)","v":-56413.297599997371},{"$f":"SUM(H16:H54)","v":-2193996.2400000002},{"$f":"SUM(I16:I54)","v":194699109.20262697},null,{"$f":"SUM(K16:K53)","v":-114601046.67627002},{"$f":"SUM(L16:L53)","v":-4210441.8523573298},{"$f":"SUM(M16:M53)","v":4632623.9527874291},458502.24,-113720362.33583993,80978746.866787016]
[12,1611,"Computer Software",null,{"$f":"'App.2-B_FA Con''ty 2012 CGAAP'!H56","v":-129738.68479200001},null,null,null,{"$f":"E56+F56+H56","v":-129738.68479200001},null,{"$f":"'App.2-B_FA Con''ty 2012 CGAAP'!M56","v":64280.89},{"$f":"25947.74","v":25947.74},null,null,{"$f":"K56+L56+N56","v":90228.63},{"$f":"I56+O56","v":-39510.05479200001}]
["Total subsequent to Board ordered removal of CIS related to water billing",null,null,null,{"$f":"SUM(E55:E56)","v":185855432.44759014},{"$f":"SUM(F55:F56)","v":10964347.607844815},{"$f":"SUM(G55:G56)","v":-56413.297599997371},{"$f":"SUM(H55:H56)","v":-2193996.2400000002},{"$f":"SUM(I55:I56)","v":194569370.51783496},null,{"$f":"SUM(K55:K56)","v":-114536765.78627002},{"$f":"SUM(L55:L56)","v":-4184494.1123573296},{"$f":"SUM(M55:M56)","v":4632623.9527874291},458502.24,-113630133.70583993,80939236.811995015]
[]
[null,null,null,null,null,null,null,null,"Less: Fully Allocated Depreciation"]
[10,null,"Transportation",null,null,null,null,null,"Transportation",null,null,{"$f":"L40","v":-215464.99463914768}]
[8,null,"Stores Equipment",null,null,null,null,null,"Stores Equipment",null,null,{"$f":"L42","v":-92164.853000000003}]
[null,null,null,null,null,null,null,null,"Net Depreciation",null,null,{"$f":"L57-L60-L61","v":-3876864.2647181819}]
[]
["Notes:"]
[]
[1,"Tables in the format outlined above covering all fixed asset accounts should be submitted for the Test Year, Bridge Year and all relevant historical years.  At a minimum , the applicant must provide data for the earlier of: 1) all historical years back to its last rebasing; or 2) at least three years of historical actuals, in addition to Bridge Year and Test Year forecasts."]
[]
[]
[2,"The \"CCA Class\" for fixed assets should agree with the CCA Class used for tax purposes in Tax Returns. Fixed Assets sub-components may be used where the underlying asset components are classified under multiple CCA Classes for tax purposes. If an applicant uses any different classes from those shown in the table, an explanation should be provided. (also see note 3 below)."]
[]
[]
[3,"The table may need to be customized for a utility's asset categories or for any new asset accounts announced or authorized by the Board."]
[]
[4,"The depreciation column (D) is not required as the relevant information will be provided in the following 2-C series of appendices."]

{"sheet":"App.2-CE_CGAAP_DepExp_2011","index":10,"n_rows":62,"n_cols":12,"rows_kept":62,"cut":false,"hidden":false,"merged":[[61,1,63,11],[9,0,9,11],[8,0,8,11],[60,1,60,11],[59,1,59,11],[13,0,14,0],[13,1,14,1],[13,10,14,10],[10,0,10,11],[54,0,54,1],[56,0,56,1]]}
[null,null,null,null,null,null,null,null,null,null,"File Number:",{"$f":"'LDC Info'!$E$18","v":"EB-2012-0126"}]
[null,null,null,null,null,null,null,null,null,null,"Exhibit:",4]
[null,null,null,null,null,null,null,null,null,null,"Tab:",7]
[null,null,null,null,null,null,null,null,null,null,"Schedule:",1]
[null,null,null,null,null,null,null,null,null,null,"Attachment:",2]
[]
[null,null,null,null,null,null,null,null,null,null,"Date:","9 November, 2012"]
[]
["Appendix 2-CE"]
["Depreciation and Amortization Expense"]
["Assumes the applicant adopted IFRS for financial reporting purposes January 1, 2014"]
[null,null,"Year",2011,"CGAAP"]
[]
["Account","Description","Opening Regulatory Gross PP&E as at Jan 1, 2011","Less Fully Depreciated","Net for Depreciation","Additions","Total for Depreciation","Years","Depreciation Rate","2011 Depreciation Expense","2011 Depreciation Expense per Appendix 2-B Fixed Assets, Column K\n (l)","Variance 2"]
[null,null,"(a)","(b)","(c)","(d)","(e) = (c) + ½ x (d) 1","(f)","(g) = 1 / (f)","(h) = (e) / (f)",null,"(m) = (h) - (l)"]
[1611,"Computer Software (Formally known as Account 1925)",{"$f":"VLOOKUP(A16,'App.2-B_Fixed Asset Con''ty 2011'!$B$16:$E$53,4,FALSE)","v":2505349.5},-1500808.3599999999,{"$f":"C16+D16","v":1004541.1400000001},{"$f":"VLOOKUP(A16,'App.2-B_Fixed Asset Con''ty 2011'!$B$16:$F$53,5,FALSE)","v":138685.47},{"$f":"E16+0.5*F16","v":1073883.8750000002},5,{"$f":"IF(H16=0,\"\",1/H16)","v":0.2},{"$f":"IF(H16=0,0,G16/H16)","v":214776.77500000005},{"$f":"-'App.2-B_Fixed Asset Con''ty 2011'!K16","v":214776.78},{"$f":"IF(ISERROR(+J16-K16), \"\", +J16-K16)","v":-4.999999946448952E-3}]
[1612,"Land Rights (Formally known as Account 1906)",{"$f":"VLOOKUP(A17,'App.2-B_Fixed Asset Con''ty 2011'!$B$16:$E$53,4,FALSE)","v":0},null,{"$f":"C17+D17","v":0},{"$f":"VLOOKUP(A17,'App.2-B_Fixed Asset Con''ty 2011'!$B$16:$F$53,5,FALSE)","v":0},{"$f":"E17+0.5*F17","v":0},null,"",0,{"$f":"-'App.2-B_Fixed Asset Con''ty 2011'!K17","v":0},{"$f":"IF(ISERROR(+J17-K17), \"\", +J17-K17)","v":0}]
[1805,"Land",{"$f":"VLOOKUP(A18,'App.2-B_Fixed Asset Con''ty 2011'!$B$16:$E$53,4,FALSE)","v":857298.24},null,857298.24,{"$f":"VLOOKUP(A18,'App.2-B_Fixed Asset Con''ty 2011'!$B$16:$F$53,5,FALSE)","v":0},857298.24,null,"",0,{"$f":"-'App.2-B_Fixed Asset Con''ty 2011'!K18","v":0},0]
[1808,"Buildings",{"$f":"VLOOKUP(A19,'App.2-B_Fixed Asset Con''ty 2011'!$B$16:$E$53,4,FALSE)","v":9230592.6199999992},-1213773.5900000017,8016819.0299999975,{"$f":"VLOOKUP(A19,'App.2-B_Fixed Asset Con''ty 2011'!$B$16:$F$53,5,FALSE)","v":0},8016819.0299999975,50,0.02,160336.38059999995,{"$f":"-'App.2-B_Fixed Asset Con''ty 2011'!K19","v":183886.11},-23549.72940000004]
[1808,"Leaseholds Improvements",{"$f":"'App.2-B_Fixed Asset Con''ty 2011'!E20","v":567528.35},null,567528.35,{"$f":"'App.2-B_Fixed Asset Con''ty 2011'!F20","v":159351.34},647204.02,15,6.6666666666666666E-2,43146.934666666668,{"$f":"-'App.2-B_Fixed Asset Con''ty 2011'!K20","v":43146.92},1.466666666965466E-2]
[1815,"Transformer Station Equipment >50 kV",{"$f":"VLOOKUP(A21,'App.2-B_Fixed Asset Con''ty 2011'!$B$16:$E$53,4,FALSE)","v":0},null,0,{"$f":"VLOOKUP(A21,'App.2-B_Fixed Asset Con''ty 2011'!$B$16:$F$53,5,FALSE)","v":0},0,null,"",0,{"$f":"-'App.2-B_Fixed Asset Con''ty 2011'!K21","v":0},0]
[1820,"Distribution Station Equipment <50 kV",{"$f":"VLOOKUP(A22,'App.2-B_Fixed Asset Con''ty 2011'!$B$16:$E$53,4,FALSE)","v":16299670.350000001},-3109316.7462499999,13190353.603750002,{"$f":"VLOOKUP(A22,'App.2-B_Fixed Asset Con''ty 2011'!$B$16:$F$53,5,FALSE)","v":161491.04999999999},13271099.128750002,30,3.3333333333333333E-2,442369.9709583334,{"$f":"-'App.2-B_Fixed Asset Con''ty 2011'!K22","v":436762.62},5607.3509583334089]
[1825,"Storage Battery Equipment",{"$f":"VLOOKUP(A23,'App.2-B_Fixed Asset Con''ty 2011'!$B$16:$E$53,4,FALSE)","v":0},null,0,{"$f":"VLOOKUP(A23,'App.2-B_Fixed Asset Con''ty 2011'!$B$16:$F$53,5,FALSE)","v":0},0,null,"",0,{"$f":"-'App.2-B_Fixed Asset Con''ty 2011'!K23","v":0},0]
[1830,"Poles, Towers & Fixtures",{"$f":"VLOOKUP(A24,'App.2-B_Fixed Asset Con''ty 2011'!$B$16:$E$53,4,FALSE)","v":16383182.68},-2532569.9846000001,13850612.6954,{"$f":"VLOOKUP(A24,'App.2-B_Fixed Asset Con''ty 2011'!$B$16:$F$53,5,FALSE)","v":1607668.4},14654446.895399999,25,0.04,586177.87581599993,{"$f":"-'App.2-B_Fixed Asset Con''ty 2011'!K24","v":607615.34},-21437.46418400004]
[1835,"Overhead Conductors & Devices",{"$f":"VLOOKUP(A25,'App.2-B_Fixed Asset Con''ty 2011'!$B$16:$E$53,4,FALSE)","v":40866691.43},-11468376.482076198,29398314.947923802,{"$f":"VLOOKUP(A25,'App.2-B_Fixed Asset Con''ty 2011'!$B$16:$F$53,5,FALSE)","v":836176.62},29816403.2579238,25,0.04,1192656.130316952,{"$f":"-'App.2-B_Fixed Asset Con''ty 2011'!K25","v":1173922.6100000001},18733.520316951908]
[1840,"Underground Conduit",{"$f":"VLOOKUP(A26,'App.2-B_Fixed Asset Con''ty 2011'!$B$16:$E$53,4,FALSE)","v":19095049.899999999},-1040048.2878221695,18055001.61217783,{"$f":"VLOOKUP(A26,'App.2-B_Fixed Asset Con''ty 2011'!$B$16:$F$53,5,FALSE)","v":862067.59},18486035.407177832,25,0.04,739441.41628711333,{"$f":"-'App.2-B_Fixed Asset Con''ty 2011'!K26","v":707708.22},31733.196287113358]
[1845,"Underground Conductors & Devices",{"$f":"VLOOKUP(A27,'App.2-B_Fixed Asset Con''ty 2011'!$B$16:$E$53,4,FALSE)","v":19989151.240000002},-867333.37752823171,19121817.86247177,{"$f":"VLOOKUP(A27,'App.2-B_Fixed Asset Con''ty 2011'!$B$16:$F$53,5,FALSE)","v":676951.37},19460293.547471769,25,0.04,778411.74189887079,{"$f":"-'App.2-B_Fixed Asset Con''ty 2011'!K27","v":746852.59},31559.151898870827]
[1850,"Line Transformers",{"$f":"VLOOKUP(A28,'App.2-B_Fixed Asset Con''ty 2011'!$B$16:$E$53,4,FALSE)","v":26909415.529999994},-5955530.8989818189,20953884.631018177,{"$f":"VLOOKUP(A28,'App.2-B_Fixed Asset Con''ty 2011'!$B$16:$F$53,5,FALSE)","v":1019439.58},21463604.421018176,25,0.04,858544.17684072698,{"$f":"-'App.2-B_Fixed Asset Con''ty 2011'!K28","v":863400.9},-4856.7231592730386]
[1855,"Services (Overhead & Underground)",{"$f":"VLOOKUP(A29,'App.2-B_Fixed Asset Con''ty 2011'!$B$16:$E$53,4,FALSE)","v":9977239.7000000011},-1570156.2051238243,8407083.4948761761,{"$f":"VLOOKUP(A29,'App.2-B_Fixed Asset Con''ty 2011'!$B$16:$F$53,5,FALSE)","v":993811.25},8903989.1198761761,25,0.04,356159.56479504704,{"$f":"-'App.2-B_Fixed Asset Con''ty 2011'!K29","v":343957.6},12201.964795047068]
[1860,"Meters",{"$f":"VLOOKUP(A30,'App.2-B_Fixed Asset Con''ty 2011'!$B$16:$E$53,4,FALSE)","v":8810025.3099999987},-2462814.9506545453,6347210.3593454529,{"$f":"VLOOKUP(A30,'App.2-B_Fixed Asset Con''ty 2011'!$B$16:$F$53,5,FALSE)","v":18979.8},6356700.2593454532,25,0.04,254268.01037381814,{"$f":"-'App.2-B_Fixed Asset Con''ty 2011'!K30","v":237974.5},16293.510373818135]
[1860,"Meters (Smart Meters)",0,null,0,null,0,null,"",0,{"$f":"-'App.2-B_Fixed Asset Con''ty 2011'!K31","v":0},0]
[1905,"Land",{"$f":"VLOOKUP(A32,'App.2-B_Fixed Asset Con''ty 2011'!$B$16:$E$53,4,FALSE)","v":0},null,0,{"$f":"VLOOKUP(A32,'App.2-B_Fixed Asset Con''ty 2011'!$B$16:$F$53,5,FALSE)","v":0},0,null,"",0,{"$f":"-'App.2-B_Fixed Asset Con''ty 2011'!K32","v":0},0]
[1908,"Buildings & Fixtures",{"$f":"VLOOKUP(A33,'App.2-B_Fixed Asset Con''ty 2011'!$B$16:$E$53,4,FALSE)","v":0},null,0,{"$f":"VLOOKUP(A33,'App.2-B_Fixed Asset Con''ty 2011'!$B$16:$F$53,5,FALSE)","v":0},0,null,"",0,{"$f":"-'App.2-B_Fixed Asset Con''ty 2011'!K33","v":0},0]
[1910,"Leasehold Improvements",{"$f":"VLOOKUP(A34,'App.2-B_Fixed Asset Con''ty 2011'!$B$16:$E$53,4,FALSE)","v":0},null,0,{"$f":"VLOOKUP(A34,'App.2-B_Fixed Asset Con''ty 2011'!$B$16:$F$53,5,FALSE)","v":0},0,null,"",0,{"$f":"-'App.2-B_Fixed Asset Con''ty 2011'!K34","v":0},0]
[1915,"Office Furniture & Equipment (10 years)",{"$f":"VLOOKUP(A35,'App.2-B_Fixed Asset Con''ty 2011'!$B$16:$E$53,4,FALSE)","v":44314.559999999998},-35143.94,9170.6199999999953,{"$f":"VLOOKUP(A35,'App.2-B_Fixed Asset Con''ty 2011'!$B$16:$F$53,5,FALSE)","v":0},9170.6199999999953,10,0.1,917.06199999999956,{"$f":"-'App.2-B_Fixed Asset Con''ty 2011'!K35","v":938.52},-21.458000000000425]
[1915,"Office Furniture & Equipment (5 years)",0,null,0,{"$f":"VLOOKUP(A36,'App.2-B_Fixed Asset Con''ty 2011'!$B$16:$F$53,5,FALSE)","v":0},0,null,"",0,{"$f":"-'App.2-B_Fixed Asset Con''ty 2011'!K36","v":0},0]
[1920,"Computer Equipment - Hardware",{"$f":"VLOOKUP(A37,'App.2-B_Fixed Asset Con''ty 2011'!$B$16:$E$53,4,FALSE)","v":0},null,0,{"$f":"VLOOKUP(A37,'App.2-B_Fixed Asset Con''ty 2011'!$B$16:$F$53,5,FALSE)","v":153986.72},76993.36,5,0.2,15398.672,{"$f":"-'App.2-B_Fixed Asset Con''ty 2011'!K37","v":15398.67},2.0000000004074536E-3]
[1920,"Computer Equip.-Hardware(Post Mar. 22/04)",{"$f":"VLOOKUP(A38,'App.2-B_Fixed Asset Con''ty 2011'!$B$16:$E$53,4,FALSE)","v":0},null,0,0,0,null,"",0,{"$f":"-'App.2-B_Fixed Asset Con''ty 2011'!K38","v":0},0]
[1920,"Computer Equip.-Hardware(Post Mar. 19/07)",{"$f":"VLOOKUP(A39,'App.2-B_Fixed Asset Con''ty 2011'!$B$16:$E$53,4,FALSE)","v":0},null,0,0,0,null,"",0,{"$f":"-'App.2-B_Fixed Asset Con''ty 2011'!K39","v":0},0]
[1930,"Transportation Equipment",1439497.0600000003,-974132.73,465364.33000000031,58915.74,494822.2000000003,4,0.25,123705.55000000008,135293.01999999999,-11587.469999999914]
[1930,"Transportation Equipment",3601992.5100000007,-1616759.58,1985232.9300000006,504034.33,{"$f":"E41+0.5*F41","v":2237250.0950000007},8,{"$f":"IF(H41=0,\"\",1/H41)","v":0.125},{"$f":"IF(H41=0,0,G41/H41)","v":279656.26187500008},284186.01,{"$f":"IF(ISERROR(+J41-K41), \"\", +J41-K41)","v":-4529.7481249999255}]
[1935,"Stores Equipment",{"$f":"VLOOKUP(A42,'App.2-B_Fixed Asset Con''ty 2011'!$B$16:$E$53,4,FALSE)","v":0},null,0,{"$f":"VLOOKUP(A42,'App.2-B_Fixed Asset Con''ty 2011'!$B$16:$F$53,5,FALSE)","v":0},0,null,"",0,null,0]
[1940,"Tools, Shop & Garage Equipment",{"$f":"VLOOKUP(A43,'App.2-B_Fixed Asset Con''ty 2011'!$B$16:$E$53,4,FALSE)","v":1741755.78},-943943.62999999989,797812.15000000014,{"$f":"VLOOKUP(A43,'App.2-B_Fixed Asset Con''ty 2011'!$B$16:$F$53,5,FALSE)","v":77853.63},836738.96500000008,10,0.1,83673.896500000003,{"$f":"-'App.2-B_Fixed Asset Con''ty 2011'!K42","v":82930.460000000006},743.43649999999616]
[1945,"Measurement & Testing Equipment",{"$f":"VLOOKUP(A44,'App.2-B_Fixed Asset Con''ty 2011'!$B$16:$E$53,4,FALSE)","v":0},null,0,{"$f":"VLOOKUP(A44,'App.2-B_Fixed Asset Con''ty 2011'!$B$16:$F$53,5,FALSE)","v":0},0,null,"",0,{"$f":"-'App.2-B_Fixed Asset Con''ty 2011'!K43","v":0},0]
[1950,"Power Operated Equipment",{"$f":"VLOOKUP(A45,'App.2-B_Fixed Asset Con''ty 2011'!$B$16:$E$53,4,FALSE)","v":0},null,0,{"$f":"VLOOKUP(A45,'App.2-B_Fixed Asset Con''ty 2011'!$B$16:$F$53,5,FALSE)","v":0},0,null,"",0,{"$f":"-'App.2-B_Fixed Asset Con''ty 2011'!K44","v":0},0]
[1955,"Communications Equipment",{"$f":"VLOOKUP(A46,'App.2-B_Fixed Asset Con''ty 2011'!$B$16:$E$53,4,FALSE)","v":2212829.86},-25345.88,2187483.98,{"$f":"VLOOKUP(A46,'App.2-B_Fixed Asset Con''ty 2011'!$B$16:$F$53,5,FALSE)","v":7757},2191362.48,25,0.04,87654.499200000006,{"$f":"-'App.2-B_Fixed Asset Con''ty 2011'!K45","v":78788.239999999991},8866.259200000015]
[1955,"Communication Equipment (Smart Meters)",0,null,0,null,0,null,"",0,{"$f":"-'App.2-B_Fixed Asset Con''ty 2011'!K46","v":0},0]
[1960,"Miscellaneous Equipment ",{"$f":"VLOOKUP(A48,'App.2-B_Fixed Asset Con''ty 2011'!$B$16:$E$53,4,FALSE)","v":0},null,0,{"$f":"VLOOKUP(A48,'App.2-B_Fixed Asset Con''ty 2011'!$B$16:$F$53,5,FALSE)","v":0},0,null,"",0,{"$f":"-'App.2-B_Fixed Asset Con''ty 2011'!K47","v":0},0]
[1975,"Load Management Controls Utility Premises",{"$f":"VLOOKUP(A49,'App.2-B_Fixed Asset Con''ty 2011'!$B$16:$E$53,4,FALSE)","v":0},null,0,{"$f":"VLOOKUP(A49,'App.2-B_Fixed Asset Con''ty 2011'!$B$16:$F$53,5,FALSE)","v":0},0,null,"",0,{"$f":"-'App.2-B_Fixed Asset Con''ty 2011'!K48","v":0},0]
[1980,"System Supervisor Equipment",{"$f":"VLOOKUP(A50,'App.2-B_Fixed Asset Con''ty 2011'!$B$16:$E$53,4,FALSE)","v":1555443.13},-712774.26,842668.86999999988,{"$f":"VLOOKUP(A50,'App.2-B_Fixed Asset Con''ty 2011'!$B$16:$F$53,5,FALSE)","v":17265},851301.36999999988,15,6.6666666666666666E-2,56753.424666666659,{"$f":"-'App.2-B_Fixed Asset Con''ty 2011'!K49","v":56753.42},4.6666666603414342E-3]
[1985,"Miscellaneous Fixed Assets",{"$f":"VLOOKUP(A51,'App.2-B_Fixed Asset Con''ty 2011'!$B$16:$E$53,4,FALSE)","v":42116.86},-42116.860000000008,0,{"$f":"VLOOKUP(A51,'App.2-B_Fixed Asset Con''ty 2011'!$B$16:$F$53,5,FALSE)","v":0},0,null,"",0,{"$f":"-'App.2-B_Fixed Asset Con''ty 2011'!K50","v":0},0]
[1995,"Contributions & Grants",{"$f":"VLOOKUP(A52,'App.2-B_Fixed Asset Con''ty 2011'!$B$16:$E$53,4,FALSE)","v":-13513098.059999999},null,-13513098.059999999,{"$f":"VLOOKUP(A52,'App.2-B_Fixed Asset Con''ty 2011'!$B$16:$F$53,5,FALSE)","v":-1065202.67},-14045699.395,25,0.04,-561827.97580000001,{"$f":"-'App.2-B_Fixed Asset Con''ty 2011'!K51","v":-561827.97},-5.8000000426545739E-3]
[1330,"WIP - Capital Inventory",{"$f":"VLOOKUP(A53,'App.2-B_Fixed Asset Con''ty 2011'!$B$16:$E$53,4,FALSE)","v":1022658},null,1022658,{"$f":"VLOOKUP(A53,'App.2-B_Fixed Asset Con''ty 2011'!$B$16:$F$53,5,FALSE)","v":105162},{"$f":"E53+0.5*F53","v":1075239},null,{"$f":"IF(H53=0,\"\",1/H53)","v":""},{"$f":"IF(H53=0,0,G53/H53)","v":0},{"$f":"-'App.2-B_Fixed Asset Con''ty 2011'!K52","v":0},{"$f":"IF(ISERROR(+J53-K53), \"\", +J53-K53)","v":0}]
[2055,"Work In Process",{"$f":"VLOOKUP(A54,'App.2-B_Fixed Asset Con''ty 2011'!$B$16:$E$53,4,FALSE)","v":228308},null,228308,{"$f":"VLOOKUP(A54,'App.2-B_Fixed Asset Con''ty 2011'!$B$16:$F$53,5,FALSE)","v":430858.53},443737.26500000001,null,"",0,{"$f":"-'App.2-B_Fixed Asset Con''ty 2011'!K53","v":0},0]
["Total prior to Board ordered removal of CIS related to water billing",null,{"$f":"SUM(C15:C54)","v":169867012.55000001},{"$f":"SUM(D15:D54)","v":-36070945.763036788},{"$f":"SUM(E15:E54)","v":133796066.78696322},{"$f":"SUM(F15:F54)","v":6765252.75},{"$f":"SUM(G15:G54)","v":137178693.16196319},null,null,{"$f":"SUM(J15:J54)","v":5712220.3679951942},5652464.5599999987,59755.807995195108]
[1611,"Computer Software",{"$f":"'App.2-B_Fixed Asset Con''ty 2011'!E56","v":-126796.40490400001},null,{"$f":"C56+D56","v":-126796.40490400001},{"$f":"'App.2-B_Fixed Asset Con''ty 2011'!F56","v":-2942.279888},{"$f":"E56+0.5*F56","v":-128267.54484800001},5,{"$f":"IF(H56=0,\"\",1/H56)","v":0.2},{"$f":"IF(H56=0,0,G56/H56)","v":-25653.5089696},{"$f":"-'App.2-B_Fixed Asset Con''ty 2011'!K56","v":-25653.51},{"$f":"IF(ISERROR(+J56-K56), \"\", +J56-K56)","v":1.0303999988536816E-3}]
["Total subsequent to Board ordered removal of CIS related to water billing",null,{"$f":"SUM(C55:C56)","v":169740216.145096},{"$f":"SUM(D55:D56)","v":-36070945.763036788},133669270.38205923,6762310.4701119997,137050425.6171152,null,null,{"$f":"SUM(J55:J56)","v":5686566.8590255938},5626811.0499999989,59755.80902559511]
[]
["Notes:"]
[1,"Board policy of the \"half-year\" rule - the applicant must ensure that additions in the year attract a half-year depreciation expense in the first year.  Deviations from this standard practice must be supported in the application."]
[2,"The applicant must provide an explanation of material variances in evidence"]
["General:","Applicants must provide a breakdown of depreciation and amortization expense in the above format for all relevant accounts.  Asset Retirement Obligations (AROs), depreciation and accretion expense should be disclosed separately consistent with the Notes of historical Audited Financial Statements."]

{"sheet":"App.2-CF_CGAAP_DepExp_2012","index":11,"n_rows":63,"n_cols":12,"rows_kept":63,"cut":false,"hidden":false,"merged":[[9,0,9,11],[8,0,8,11],[59,1,59,11],[60,1,60,11],[62,1,63,11],[13,0,14,0],[13,1,14,1],[13,10,14,10],[10,0,10,11],[56,0,56,1],[54,0,54,1]]}
[null,null,null,null,null,null,null,null,null,null,"File Number:",{"$f":"'LDC Info'!$E$18","v":"EB-2012-0126"}]
[null,null,null,null,null,null,null,null,null,null,"Exhibit:",4]
[null,null,null,null,null,null,null,null,null,null,"Tab:",7]
[null,null,null,null,null,null,null,null,null,null,"Schedule:",1]
[null,null,null,null,null,null,null,null,null,null,"Attachment:",3]
[]
[null,null,null,null,null,null,null,null,null,null,"Date:","9 November, 2012"]
[]
["Appendix 2-CF"]
["Depreciation and Amortization Expense"]
["Assumes the applicant adopted IFRS for financial reporting purposes January 1, 2014"]
[null,null,"Year",2012,"CGAAP"]
[]
["Account","Description","Opening Regulatory Gross PP&E as at Jan 1, 2012","Less Fully Depreciated","Net for Depreciation","Additions","Total for Depreciation","Years","Depreciation Rate","2012 Depreciation Expense","2012 Depreciation Expense per Appendix 2-B Fixed Assets, Column K\n (l)","Variance 2"]
[null,null,"(a)","(b)","(c)","(d)","(e) = (c) + ½ x (d) 1","(f)","(g) = 1 / (f)","(h) = (e) / (f)",null,"(m) = (h) - (l)"]
[1611,"Computer Software (Formally known as Account 1925)",{"$f":"VLOOKUP(A16,'App.2-B_FA Con''ty 2012 CGAAP'!$B$15:$H$57,4,FALSE)","v":2644034.9700000002},-1500807.36,{"$f":"C16+D16","v":1143227.6100000001},{"$f":"VLOOKUP(A16,'App.2-B_FA Con''ty 2012 CGAAP'!$B$15:$H$57,5,FALSE)","v":248175.35},{"$f":"E16+0.5*F16","v":1267315.2850000001},5,{"$f":"IF(H16=0,\" \",1/H16)","v":0.2},{"$f":"IF(H16=0,0,G16/H16)","v":253463.05700000003},{"$f":"-VLOOKUP(A16,'App.2-B_FA Con''ty 2012 CGAAP'!$B$16:$K$53,10,FALSE)","v":253462.85700000002},{"$f":"IF(ISERROR(+J16-K16), 0, +J16-K16)","v":0.20000000001164153}]
[1612,"Land Rights (Formally known as Account 1906)",{"$f":"VLOOKUP(A17,'App.2-B_FA Con''ty 2012 CGAAP'!$B$15:$H$57,4,FALSE)","v":0},null,{"$f":"C17+D17","v":0},{"$f":"VLOOKUP(A17,'App.2-B_FA Con''ty 2012 CGAAP'!$B$15:$H$57,5,FALSE)","v":0},{"$f":"E17+0.5*F17","v":0},null,{"$f":"IF(H17=0,\" \",1/H17)","v":" "},0,{"$f":"-VLOOKUP(A17,'App.2-B_FA Con''ty 2012 CGAAP'!$B$16:$K$53,10,FALSE)","v":0},0]
[1805,"Land",{"$f":"VLOOKUP(A18,'App.2-B_FA Con''ty 2012 CGAAP'!$B$15:$H$57,4,FALSE)","v":857298.24},null,857298.24,{"$f":"VLOOKUP(A18,'App.2-B_FA Con''ty 2012 CGAAP'!$B$15:$H$57,5,FALSE)","v":5569.21},860082.84499999997,null," ",0,{"$f":"-VLOOKUP(A18,'App.2-B_FA Con''ty 2012 CGAAP'!$B$16:$K$53,10,FALSE)","v":0},0]
[1808,"Buildings",{"$f":"VLOOKUP(A19,'App.2-B_FA Con''ty 2012 CGAAP'!$B$15:$H$57,4,FALSE)","v":9230592.6199999992},-1225941.4125000013,8004651.2074999977,{"$f":"VLOOKUP(A19,'App.2-B_FA Con''ty 2012 CGAAP'!$B$15:$H$57,5,FALSE)","v":0},8004651.2074999977,50,0.02,160093.02414999995,{"$f":"-VLOOKUP(A19,'App.2-B_FA Con''ty 2012 CGAAP'!$B$16:$K$53,10,FALSE)","v":183562.17645017616},-23469.152300176211]
[1808,"Buildings Improvements",{"$f":"'App.2-B_FA Con''ty 2012 CGAAP'!E20","v":726879.69},null,726879.69,{"$f":"'App.2-B_FA Con''ty 2012 CGAAP'!F20","v":310378.69},882069.03499999992,15,6.6666666666666666E-2,58804.602333333329,{"$f":"-'App.2-B_FA Con''ty 2012 CGAAP'!K20","v":58804.601333333332},9.9999999656574801E-4]
[1815,"Transformer Station Equipment >50 kV",{"$f":"VLOOKUP(A21,'App.2-B_FA Con''ty 2012 CGAAP'!$B$15:$H$57,4,FALSE)","v":0},null,0,{"$f":"VLOOKUP(A21,'App.2-B_FA Con''ty 2012 CGAAP'!$B$15:$H$57,5,FALSE)","v":0},0,null," ",0,{"$f":"-VLOOKUP(A21,'App.2-B_FA Con''ty 2012 CGAAP'!$B$16:$K$53,10,FALSE)","v":0},0]
[1820,"Distribution Station Equipment <50 kV",{"$f":"VLOOKUP(A22,'App.2-B_FA Con''ty 2012 CGAAP'!$B$15:$H$57,4,FALSE)","v":16461161.400000002},-3526054.2399999998,12935107.160000002,{"$f":"VLOOKUP(A22,'App.2-B_FA Con''ty 2012 CGAAP'!$B$15:$H$57,5,FALSE)","v":1379969.21},13625091.765000002,30,3.3333333333333333E-2,454169.72550000006,{"$f":"-VLOOKUP(A22,'App.2-B_FA Con''ty 2012 CGAAP'!$B$16:$K$53,10,FALSE)","v":446812.10248243716},7357.6230175629025]
[1825,"Storage Battery Equipment",{"$f":"VLOOKUP(A23,'App.2-B_FA Con''ty 2012 CGAAP'!$B$15:$H$57,4,FALSE)","v":0},null,0,{"$f":"VLOOKUP(A23,'App.2-B_FA Con''ty 2012 CGAAP'!$B$15:$H$57,5,FALSE)","v":0},0,null," ",0,{"$f":"-VLOOKUP(A23,'App.2-B_FA Con''ty 2012 CGAAP'!$B$16:$K$53,10,FALSE)","v":0},0]
[1830,"Poles, Towers & Fixtures",{"$f":"VLOOKUP(A24,'App.2-B_FA Con''ty 2012 CGAAP'!$B$15:$H$57,4,FALSE)","v":17990851.079999998},-2731938.3446,15258912.735399999,{"$f":"VLOOKUP(A24,'App.2-B_FA Con''ty 2012 CGAAP'!$B$15:$H$57,5,FALSE)","v":1272073.0730144987},15894949.271907248,25,0.04,635797.97087628988,{"$f":"-VLOOKUP(A24,'App.2-B_FA Con''ty 2012 CGAAP'!$B$16:$K$53,10,FALSE)","v":622917.3358634304},12880.635012859479]
[1835,"Overhead Conductors & Devices",{"$f":"VLOOKUP(A25,'App.2-B_FA Con''ty 2012 CGAAP'!$B$15:$H$57,4,FALSE)","v":41702868.049999997},-11468376.482076198,30234491.567923799,{"$f":"VLOOKUP(A25,'App.2-B_FA Con''ty 2012 CGAAP'!$B$15:$H$57,5,FALSE)","v":1001640.7206515232},30735311.92824956,25,0.04,1229412.4771299823,{"$f":"-VLOOKUP(A25,'App.2-B_FA Con''ty 2012 CGAAP'!$B$16:$K$53,10,FALSE)","v":1225299.9878833438},4112.4892466384917]
[1840,"Underground Conduit",{"$f":"VLOOKUP(A26,'App.2-B_FA Con''ty 2012 CGAAP'!$B$15:$H$57,4,FALSE)","v":19957117.489999998},-1410813.651630285,18546303.838369712,{"$f":"VLOOKUP(A26,'App.2-B_FA Con''ty 2012 CGAAP'!$B$15:$H$57,5,FALSE)","v":1001464.8190448342},19047036.24789213,25,0.04,761881.44991568523,{"$f":"-VLOOKUP(A26,'App.2-B_FA Con''ty 2012 CGAAP'!$B$16:$K$53,10,FALSE)","v":672533.91484324122},89347.535072444007]
[1845,"Underground Conductors & Devices",{"$f":"VLOOKUP(A27,'App.2-B_FA Con''ty 2012 CGAAP'!$B$15:$H$57,4,FALSE)","v":20666102.610000003},-1168562.9586801329,19497539.651319869,{"$f":"VLOOKUP(A27,'App.2-B_FA Con''ty 2012 CGAAP'!$B$15:$H$57,5,FALSE)","v":778816.20620152948},19886947.754420634,25,0.04,795477.91017682536,{"$f":"-VLOOKUP(A27,'App.2-B_FA Con''ty 2012 CGAAP'!$B$16:$K$53,10,FALSE)","v":790089.9934730347},5387.9167037906591]
[1850,"Line Transformers",{"$f":"VLOOKUP(A28,'App.2-B_FA Con''ty 2012 CGAAP'!$B$15:$H$57,4,FALSE)","v":27928855.109999992},-6747654.7089818185,21181200.401018173,{"$f":"VLOOKUP(A28,'App.2-B_FA Con''ty 2012 CGAAP'!$B$15:$H$57,5,FALSE)","v":1587403.0363836461},21974901.919209994,25,0.04,878996.0767683998,{"$f":"-VLOOKUP(A28,'App.2-B_FA Con''ty 2012 CGAAP'!$B$16:$K$53,10,FALSE)","v":853584.08068461192},25411.996083787875]
[1855,"Services (Overhead & Underground)",{"$f":"VLOOKUP(A29,'App.2-B_FA Con''ty 2012 CGAAP'!$B$15:$H$57,4,FALSE)","v":10971050.950000001},-1895152.2641197769,9075898.6858802252,{"$f":"VLOOKUP(A29,'App.2-B_FA Con''ty 2012 CGAAP'!$B$15:$H$57,5,FALSE)","v":1040786.5894194156},9596291.9805899337,25,0.04,383851.67922359734,{"$f":"-VLOOKUP(A29,'App.2-B_FA Con''ty 2012 CGAAP'!$B$16:$K$53,10,FALSE)","v":366530.5517088084},17321.127514788939]
[1860,"Meters",{"$f":"VLOOKUP(A30,'App.2-B_FA Con''ty 2012 CGAAP'!$B$15:$H$57,4,FALSE)","v":8829005.1099999994},-2837800.7100831168,5991204.3999168826,{"$f":"VLOOKUP(A30,'App.2-B_FA Con''ty 2012 CGAAP'!$B$15:$H$57,5,FALSE)","v":107254.1},6044831.4499168824,25,0.04,241793.2579966753,{"$f":"-VLOOKUP(A30,'App.2-B_FA Con''ty 2012 CGAAP'!$B$16:$K$53,10,FALSE)","v":224692.8464857142},17100.411510961101]
[1860,"Meters (Smart Meters)",0,null,0,0,0,null," ",0,null,0]
[1905,"Land",{"$f":"VLOOKUP(A32,'App.2-B_FA Con''ty 2012 CGAAP'!$B$15:$H$57,4,FALSE)","v":0},null,0,{"$f":"VLOOKUP(A32,'App.2-B_FA Con''ty 2012 CGAAP'!$B$15:$H$57,5,FALSE)","v":0},0,null," ",0,{"$f":"-VLOOKUP(A32,'App.2-B_FA Con''ty 2012 CGAAP'!$B$16:$K$53,10,FALSE)","v":0},0]
[1908,"Buildings & Fixtures",{"$f":"VLOOKUP(A33,'App.2-B_FA Con''ty 2012 CGAAP'!$B$15:$H$57,4,FALSE)","v":0},null,0,{"$f":"VLOOKUP(A33,'App.2-B_FA Con''ty 2012 CGAAP'!$B$15:$H$57,5,FALSE)","v":0},0,null," ",0,{"$f":"-VLOOKUP(A33,'App.2-B_FA Con''ty 2012 CGAAP'!$B$16:$K$53,10,FALSE)","v":0},0]
[1910,"Leasehold Improvements",{"$f":"VLOOKUP(A34,'App.2-B_FA Con''ty 2012 CGAAP'!$B$15:$H$57,4,FALSE)","v":0},null,0,{"$f":"VLOOKUP(A34,'App.2-B_FA Con''ty 2012 CGAAP'!$B$15:$H$57,5,FALSE)","v":0},0,null," ",0,{"$f":"-VLOOKUP(A34,'App.2-B_FA Con''ty 2012 CGAAP'!$B$16:$K$53,10,FALSE)","v":0},0]
[1915,"Office Furniture & Equipment (10 years)",{"$f":"VLOOKUP(A35,'App.2-B_FA Con''ty 2012 CGAAP'!$B$15:$H$57,4,FALSE)","v":44314.559999999998},-35143.94,9170.6199999999953,{"$f":"VLOOKUP(A35,'App.2-B_FA Con''ty 2012 CGAAP'!$B$15:$H$57,5,FALSE)","v":0},9170.6199999999953,10,0.1,917.06199999999956,{"$f":"-VLOOKUP(A35,'App.2-B_FA Con''ty 2012 CGAAP'!$B$16:$K$53,10,FALSE)","v":938.51849999999945},-21.456499999999892]
[1915,"Office Furniture & Equipment (5 years)",0,null,0,{"$f":"VLOOKUP(A36,'App.2-B_FA Con''ty 2012 CGAAP'!$B$15:$H$57,5,FALSE)","v":0},0,null," ",0,null,0]
[1920,"Computer Equipment - Hardware",{"$f":"VLOOKUP(A37,'App.2-B_FA Con''ty 2012 CGAAP'!$B$15:$H$57,4,FALSE)","v":153986.72},0,153986.72,{"$f":"VLOOKUP(A37,'App.2-B_FA Con''ty 2012 CGAAP'!$B$15:$H$57,5,FALSE)","v":371510.34},339741.89,5,0.2,67948.377999999997,{"$f":"-VLOOKUP(A37,'App.2-B_FA Con''ty 2012 CGAAP'!$B$16:$K$53,10,FALSE)","v":67948.377999999997},0]
[1920,"Computer Equip.-Hardware(Post Mar. 22/04)",0,null,0,0,0,null," ",0,null,0]
[1920,"Computer Equip.-Hardware(Post Mar. 19/07)",0,null,0,0,0,null," ",0,null,0]
[1930,"Transportation Equipment",1422755.3599999999,-1010999.8399999999,411755.52000000002,180000,501755.52,4,0.25,125438.88,115191.35,10247.529999999999]
[1930,"Transportation Equipment",3740323.5600000005,-1238456.3,2501867.2600000007,20000,2511867.2600000007,8,0.125,{"$f":"IF(H41=0,0,G41/H41)","v":313983.40750000009},319246.43,-5263.0224999999045]
[1935,"Stores Equipment",{"$f":"VLOOKUP(A42,'App.2-B_FA Con''ty 2012 CGAAP'!$B$15:$H$57,4,FALSE)","v":0},null,0,{"$f":"VLOOKUP(A42,'App.2-B_FA Con''ty 2012 CGAAP'!$B$15:$H$57,5,FALSE)","v":0},0,null," ",0,{"$f":"-VLOOKUP(A42,'App.2-B_FA Con''ty 2012 CGAAP'!$B$16:$K$53,10,FALSE)","v":0},0]
[1940,"Tools, Shop & Garage Equipment",{"$f":"VLOOKUP(A43,'App.2-B_FA Con''ty 2012 CGAAP'!$B$15:$H$57,4,FALSE)","v":1819609.4100000001},-993985.8899999999,825623.52000000025,{"$f":"VLOOKUP(A43,'App.2-B_FA Con''ty 2012 CGAAP'!$B$15:$H$57,5,FALSE)","v":152809.49},902028.26500000025,10,0.1,90202.826500000025,{"$f":"-VLOOKUP(A43,'App.2-B_FA Con''ty 2012 CGAAP'!$B$16:$K$53,10,FALSE)","v":89459.364999999991},743.46150000003399]
[1945,"Measurement & Testing Equipment",{"$f":"VLOOKUP(A44,'App.2-B_FA Con''ty 2012 CGAAP'!$B$15:$H$57,4,FALSE)","v":0},null,0,{"$f":"VLOOKUP(A44,'App.2-B_FA Con''ty 2012 CGAAP'!$B$15:$H$57,5,FALSE)","v":0},0,null," ",0,{"$f":"-VLOOKUP(A44,'App.2-B_FA Con''ty 2012 CGAAP'!$B$16:$K$53,10,FALSE)","v":0},0]
[1950,"Power Operated Equipment",{"$f":"VLOOKUP(A45,'App.2-B_FA Con''ty 2012 CGAAP'!$B$15:$H$57,4,FALSE)","v":0},null,0,{"$f":"VLOOKUP(A45,'App.2-B_FA Con''ty 2012 CGAAP'!$B$15:$H$57,5,FALSE)","v":0},0,null," ",0,{"$f":"-VLOOKUP(A45,'App.2-B_FA Con''ty 2012 CGAAP'!$B$16:$K$53,10,FALSE)","v":0},0]
[1955,"Communications Equipment",{"$f":"VLOOKUP(A46,'App.2-B_FA Con''ty 2012 CGAAP'!$B$15:$H$57,4,FALSE)","v":2220586.86},-37634.22,2182952.6399999997,{"$f":"VLOOKUP(A46,'App.2-B_FA Con''ty 2012 CGAAP'!$B$15:$H$57,5,FALSE)","v":66925.459999999992},2216415.3699999996,25,0.04,88656.614799999981,{"$f":"-VLOOKUP(A46,'App.2-B_FA Con''ty 2012 CGAAP'!$B$16:$K$53,10,FALSE)","v":81293.505699999994},7363.1090999999869]
[1955,"Communication Equipment (Smart Meters)",0,null,0,0,0,null," ",0,null,0]
[1960,"Miscellaneous Equipment ",{"$f":"VLOOKUP(A48,'App.2-B_FA Con''ty 2012 CGAAP'!$B$15:$H$57,4,FALSE)","v":0},null,0,{"$f":"VLOOKUP(A48,'App.2-B_FA Con''ty 2012 CGAAP'!$B$15:$H$57,5,FALSE)","v":0},0,null," ",0,{"$f":"-VLOOKUP(A48,'App.2-B_FA Con''ty 2012 CGAAP'!$B$16:$K$53,10,FALSE)","v":0},0]
[1975,"Load Management Controls Utility Premises",{"$f":"VLOOKUP(A49,'App.2-B_FA Con''ty 2012 CGAAP'!$B$15:$H$57,4,FALSE)","v":0},null,0,{"$f":"VLOOKUP(A49,'App.2-B_FA Con''ty 2012 CGAAP'!$B$15:$H$57,5,FALSE)","v":0},0,null," ",0,{"$f":"-VLOOKUP(A49,'App.2-B_FA Con''ty 2012 CGAAP'!$B$16:$K$53,10,FALSE)","v":0},0]
[1980,"System Supervisor Equipment",{"$f":"VLOOKUP(A50,'App.2-B_FA Con''ty 2012 CGAAP'!$B$15:$H$57,4,FALSE)","v":1572708.13},-742550.34,830157.78999999992,{"$f":"VLOOKUP(A50,'App.2-B_FA Con''ty 2012 CGAAP'!$B$15:$H$57,5,FALSE)","v":0},830157.78999999992,15,6.6666666666666666E-2,55343.852666666658,{"$f":"-VLOOKUP(A50,'App.2-B_FA Con''ty 2012 CGAAP'!$B$16:$K$53,10,FALSE)","v":55343.852666666658},0]
[1985,"Miscellaneous Fixed Assets",{"$f":"VLOOKUP(A51,'App.2-B_FA Con''ty 2012 CGAAP'!$B$15:$H$57,4,FALSE)","v":42116.86},{"$f":"'App.2-CE_CGAAP_DepExp_2011'!D51","v":-42116.860000000008},0,{"$f":"VLOOKUP(A51,'App.2-B_FA Con''ty 2012 CGAAP'!$B$15:$H$57,5,FALSE)","v":0},0,null," ",0,{"$f":"-VLOOKUP(A51,'App.2-B_FA Con''ty 2012 CGAAP'!$B$16:$K$53,10,FALSE)","v":0},0]
[1995,"Contributions & Grants",{"$f":"VLOOKUP(A52,'App.2-B_FA Con''ty 2012 CGAAP'!$B$15:$H$57,4,FALSE)","v":-14578300.729999999},null,-14578300.729999999,{"$f":"VLOOKUP(A52,'App.2-B_FA Con''ty 2012 CGAAP'!$B$15:$H$57,5,FALSE)","v":-1074344.3023333333},-15115472.881166665,25,0.04,-604618.91524666664,{"$f":"-VLOOKUP(A52,'App.2-B_FA Con''ty 2012 CGAAP'!$B$16:$K$53,10,FALSE)","v":-604618.90240000002},-1.2846666621044278E-2]
[1330,"WIP - Capital Inventory",{"$f":"'App.2-B_FA Con''ty 2012 CGAAP'!E52","v":1127820},null,1127820,{"$f":"VLOOKUP(A53,'App.2-B_FA Con''ty 2012 CGAAP'!$B$15:$H$57,5,FALSE)","v":0},1127820,null," ",0,{"$f":"-VLOOKUP(A53,'App.2-B_FA Con''ty 2012 CGAAP'!$B$16:$K$53,10,FALSE)","v":0},0]
[2055,"Work In Process",{"$f":"VLOOKUP(A54,'App.2-B_FA Con''ty 2012 CGAAP'!$B$15:$H$57,4,FALSE)","v":430858.15},null,{"$f":"C54+D54","v":430858.15},{"$f":"VLOOKUP(A54,'App.2-B_FA Con''ty 2012 CGAAP'!$B$15:$H$57,5,FALSE)","v":1669878},1265797.1499999999,null,{"$f":"IF(H54=0,\"\",1/H54)","v":""},0,null,0]
["Total prior to Board ordered removal of CIS related to water billing",null,{"$f":"SUM(C16:C54)","v":175962596.20000005},{"$f":"SUM(D16:D54)","v":-38613989.522671327},{"$f":"SUM(E16:E54)","v":137348606.67732868},{"$f":"SUM(F16:F54)","v":10120309.992382115},{"$f":"SUM(G16:G54)","v":142408761.67351967},null,null,{"$f":"SUM(J16:J54)","v":5991613.3372907881},{"$f":"SUM(K16:K54)","v":5823092.9456747966},{"$f":"SUM(L16:L54)","v":168520.39161599072}]
[1611,"Computer Software",{"$f":"'App.2-B_FA Con''ty 2012 CGAAP'!E56","v":-129738.68479200001},null,{"$f":"C56+D56","v":-129738.68479200001},{"$f":"'App.2-B_FA Con''ty 2012 CGAAP'!F56","v":0},{"$f":"E56+0.5*F56","v":-129738.68479200001},5,{"$f":"IF(H56=0,\"\",1/H56)","v":0.2},{"$f":"IF(H56=0,0,G56/H56)","v":-25947.736958400004},{"$f":"-'App.2-B_FA Con''ty 2012 CGAAP'!K56","v":-25947.74},{"$f":"IF(ISERROR(+J56-K56), \"\", +J56-K56)","v":3.0415999972319696E-3}]
["Total subsequent to Board ordered removal of CIS related to water billing",null,{"$f":"SUM(C55:C56)","v":175832857.51520804},{"$f":"SUM(D55:D56)","v":-38613989.522671327},137218867.99253666,10120309.992382115,142279022.98872766,null,null,{"$f":"SUM(J55:J56)","v":5965665.6003323877},5797145.2056747964,168520.39465759072]
[]
["Notes:"]
[1,"Board policy of the \"half-year\" rule - the applicant must ensure that additions in the year attract a half-year depreciation expense in the first year.  Deviations from this standard practice must be supported in the application."]
[2,"The applicant must provide an explanation of material variances in evidence"]
[]
["General:","Applicants must provide a breakdown of depreciation and amortization expense in the above format for all relevant accounts.  Asset Retirement Obligations (AROs), depreciation and accretion expense should be disclosed separately consistent with the Notes of historical Audited Financial Statements."]

{"sheet":"App.2-CG_EUL_DepExp_2013","index":12,"n_rows":73,"n_cols":18,"rows_kept":73,"cut":false,"hidden":false,"merged":[[72,1,74,14],[9,0,9,17],[8,0,8,17],[10,0,10,17],[69,1,69,17],[68,1,68,17],[67,1,67,17],[66,1,66,17],[65,1,65,17],[13,0,14,0],[13,1,14,1],[13,13,14,13],[13,16,14,16],[70,1,70,17],[59,0,59,1],[61,0,61,1]]}
[null,null,null,null,null,null,null,null,null,null,null,null,null,null,null,null,"File Number:",{"$f":"'LDC Info'!$E$18","v":"EB-2012-0126"}]
[null,null,null,null,null,null,null,null,null,null,null,null,null,null,null,null,"Exhibit:",4]
[null,null,null,null,null,null,null,null,null,null,null,null,null,null,null,null,"Tab:",7]
[null,null,null,null,null,null,null,null,null,null,null,null,null,null,null,null,"Schedule:",1]
[null,null,null,null,null,null,null,null,null,null,null,null,null,null,null,null,"Attachment:",4]
[]
[null,null,null,null,null,null,null,null,null,null,null,null,null,null,null,null,"Date:","9 November, 2012"]
[]
["Appendix 2-CG"]
["Depreciation and Amortization Expense"]
["Assumes the applicant adopted IFRS for financial reporting purposes January 1, 2014"]
[null,null,"Year",null,2013,"CGAAP - EUL"]
[]
["Account","Description","Opening NBV as at Jan 1, 2013 5","Smart Meter & Stranded Meter NBV Adjustment","Additions","Average Remaining Life of Opening NBV 4","Average Remaining Life of Smart Meter Adjustment NBV 4","Years (new additions only) 3","Depreciation Rate on New Additions","Depreciation Expense on Opening NBV","Depreciation Expense on Opening NBV Adjustment Smart Meters","Depreciation Expense on Additions 1","2013 Depreciation Expense","2013 Depreciation Expense per Appendix 2-B Fixed Assets, Column K\n (l)","Variance 2","Depreciation Expense on 2013 Full Year Additions","Less Depreciation Expense on Assets Fully Depreciated during the year\n(o)","2013 Full Year Depreciation 6"]
[null,null,"(a)",null,"(d)","(i)",null,"(f)","(g) = 1 / (f)","(j) = (a) / (i)",null,"(h)=((d)*0.5)/(f) ","(k) = (j) + (h)",null,"(m) = (k) - (l)","(n)=((d))/(f) ",null,"(p) = (j) + (n) - (o)"]
[1611,"Computer Software (Formally known as Account 1925)",{"$f":"'App.2-B_FA Con''ty 2012 CGAAP'!N16","v":743352.70300000021},{"$f":"'App.2-B_Fixed Asset Con''ty 2013'!G16+'App.2-B_Fixed Asset Con''ty 2013'!M16","v":193368},{"$f":"'App.2-B_Fixed Asset Con''ty 2013'!F16","v":375000},2.730251571043151,3.5113530443511523,5,{"$f":"IF(H16=0,0,1/H16)","v":0.2},{"$f":"IF(F16=0,0,+C16/F16)","v":272265.27799999999},{"$f":"IF(G16=0,0,+D16/G16)","v":55069.369999999995},{"$f":"IF(H16=0,0,+(E16*0.5)/H16)","v":37500},{"$f":"IF(ISERROR(+J16+L16), 0, +J16+K16+L16)","v":364834.64799999999},{"$f":"-'App.2-B_Fixed Asset Con''ty 2013'!L16","v":364834.64799999999},{"$f":"IF(ISERROR(+M16-N16), 0, +M16-N16)","v":0},{"$f":"IF(H16=0,0,+(E16)/H16)","v":75000},null,{"$f":"IF(ISERROR(+P16+J16-Q16), 0, +P16+J16-Q16)","v":347265.27799999999}]
[1612,"Land Rights (Formally known as Account 1906)",{"$f":"'App.2-B_FA Con''ty 2012 CGAAP'!N17","v":0},null,{"$f":"'App.2-B_Fixed Asset Con''ty 2013'!F17","v":0},null,null,null,0,{"$f":"IF(F17=0,0,+C17/F17)","v":0},{"$f":"IF(G17=0,0,+D17/G17)","v":0},0,{"$f":"IF(ISERROR(+J17+L17), 0, +J17+K17+L17)","v":0},null,0,0,null,{"$f":"IF(ISERROR(+P17+J17-Q17), 0, +P17+J17-Q17)","v":0}]
[1805,"Land",{"$f":"'App.2-B_FA Con''ty 2012 CGAAP'!N18","v":862867.45},null,{"$f":"'App.2-B_Fixed Asset Con''ty 2013'!F18","v":0},null,null,null,0,0,0,0,0,null,0,0,null,0]
[1808,"Buildings",{"$f":"'App.2-B_FA Con''ty 2012 CGAAP'!N19","v":4765863.4635498226},null,{"$f":"'App.2-B_Fixed Asset Con''ty 2013'!F19","v":0},20.195179246644326,null,50,0.02,235990.15415234448,0,0,235990.15415234448,{"$f":"-'App.2-B_Fixed Asset Con''ty 2013'!L19","v":235990.15415234448},0,0,null,235990.15415234448]
[1808,"Buildings Improvements",{"$f":"'App.2-B_FA Con''ty 2012 CGAAP'!N20","v":872710.5386666666},null,{"$f":"'App.2-B_Fixed Asset Con''ty 2013'!F20","v":966000},11.68444332850866,null,25,0.04,74689.954337606832,0,19320,94009.954337606832,{"$f":"-'App.2-B_Fixed Asset Con''ty 2013'!L20","v":94009.954337606832},0,38640,null,113329.95433760683]
[1815,"Transformer Station Equipment >50 kV",{"$f":"'App.2-B_FA Con''ty 2012 CGAAP'!N21","v":0},null,{"$f":"'App.2-B_Fixed Asset Con''ty 2013'!F21","v":0},null,null,null,0,0,0,0,0,null,0,0,null,0]
[1820,"Distribution Station Equipment <50 kV",{"$f":"'App.2-B_FA Con''ty 2012 CGAAP'!N22","v":6609452.2675175667},null,{"$f":"'App.2-B_Fixed Asset Con''ty 2013'!F22-E23-E24","v":637878.06438680971},13.698969217733717,null,20,0.05,482478.07279991818,0,15946.951609670243,498425.02440958843,498425.02440958843,0,31893.903219340486,null,514371.97601925867]
[1820,"Distribution Station Equipment <50 kV",0,null,94334.476170754671,null,null,25,0.04,0,0,{"$f":"IF(H23=0,0,+(E23*0.5)/H23)","v":1886.6895234150934},1886.6895234150934,1886.6895234150934,{"$f":"IF(ISERROR(+M23-N23), 0, +M23-N23)","v":0},{"$f":"IF(H23=0,0,+(E23)/H23)","v":3773.3790468301868},null,3773.3790468301868]
[1820,"Distribution Station Equipment <50 kV",0,null,1716887.4663077355,null,null,45,2.2222222222222223E-2,0,0,19076.527403419284,19076.527403419284,19076.527403419284,0,38153.054806838569,null,38153.054806838569]
[1825,"Storage Battery Equipment",{"$f":"'App.2-B_FA Con''ty 2012 CGAAP'!N23","v":0},null,{"$f":"'App.2-B_Fixed Asset Con''ty 2013'!F23","v":0},null,null,null,0,0,0,0,0,null,0,0,null,0]
[1830,"Poles, Towers & Fixtures",{"$f":"'App.2-B_FA Con''ty 2012 CGAAP'!N24","v":10196852.807151066},null,{"$f":"'App.2-B_Fixed Asset Con''ty 2013'!F24","v":1456391.2782894776},28.50434448022277,null,40,2.5000000000000001E-2,357729.77744588972,0,18204.89097861847,375934.66842450819,{"$f":"-'App.2-B_Fixed Asset Con''ty 2013'!L24","v":375934.66842450819},0,36409.781957236941,null,394139.55940312665]
[1835,"Overhead Conductors & Devices",{"$f":"'App.2-B_FA Con''ty 2012 CGAAP'!N25","v":14377296.672768176},null,{"$f":"'App.2-B_Fixed Asset Con''ty 2013'!F25","v":1336039.828288645},30.203944340524938,null,50,0.02,476007.25622706208,0,13360.39828288645,489367.65450994851,{"$f":"-'App.2-B_Fixed Asset Con''ty 2013'!L25","v":489367.65450994851},0,26720.7965657729,null,502728.05279283499]
[1840,"Underground Conduit",{"$f":"'App.2-B_FA Con''ty 2012 CGAAP'!N26","v":8780175.7442015931},null,{"$f":"'App.2-B_Fixed Asset Con''ty 2013'!F26","v":482675.74718514731},36.063582652036295,null,50,0.02,243463.7686698559,0,4826.7574718514734,248290.52614170738,{"$f":"-'App.2-B_Fixed Asset Con''ty 2013'!L26","v":248290.52614170738},0,9653.5149437029468,null,253117.28361355886]
[1845,"Underground Conductors & Devices",{"$f":"'App.2-B_FA Con''ty 2012 CGAAP'!N27","v":9779057.0427285004},null,{"$f":"'App.2-B_Fixed Asset Con''ty 2013'!F27","v":511039.06360249},23.057305919154476,null,40,2.5000000000000001E-2,424119.67282806925,0,6387.9882950311248,430507.66112310038,{"$f":"-'App.2-B_Fixed Asset Con''ty 2013'!L27","v":430507.66112310038},0,12775.97659006225,null,436895.64941813151]
[1850,"Line Transformers",{"$f":"'App.2-B_FA Con''ty 2012 CGAAP'!N28","v":11556961.635699026},null,{"$f":"'App.2-B_Fixed Asset Con''ty 2013'!F28","v":1272686.0528473882},24.510008853526372,null,40,2.5000000000000001E-2,471520.09225146694,0,15908.575660592353,487428.66791205929,{"$f":"-'App.2-B_Fixed Asset Con''ty 2013'!L28","v":487428.66791205929},0,31817.151321184705,null,503337.24357265164]
[1855,"Services (Overhead & Underground)",{"$f":"'App.2-B_FA Con''ty 2012 CGAAP'!N29","v":5517997.6477106092},null,{"$f":"'App.2-B_Fixed Asset Con''ty 2013'!F29","v":909728.47299114894},27.686684141319777,null,40,2.5000000000000001E-2,199301.49885574472,0,11371.605912389361,210673.10476813407,{"$f":"-'App.2-B_Fixed Asset Con''ty 2013'!L29","v":210673.10476813407},0,22743.211824778722,null,222044.71068052345]
[1860,"Meters",256836.64161600108,null,{"$f":"'App.2-B_Fixed Asset Con''ty 2013'!F30","v":0},14.73497713362706,null,25,0.04,17430.406527735136,0,0,17430.406527735136,17430.406527735136,0,0,null,17430.406527735136]
[1860,"Stranded Meters Disposition",1208354.344812569,{"$f":"-C33","v":-1208354.344812569},0,0,null,null,0,0,0,{"$f":"IF(H33=0,0,+(E33*0.5)/H33)","v":0},0,null,{"$f":"IF(ISERROR(+M33-N33), 0, +M33-N33)","v":0},{"$f":"IF(H33=0,0,+(E33)/H33)","v":0},null,{"$f":"IF(ISERROR(+P33+J33-Q33), 0, +P33+J33-Q33)","v":0}]
[1860,"Meters (Smart Meters)",{"$f":"'App.2-B_FA Con''ty 2012 CGAAP'!N31","v":0},{"$f":"'App.2-B_Fixed Asset Con''ty 2013'!G31+'App.2-B_Fixed Asset Con''ty 2013'!M31","v":5475806},{"$f":"'App.2-B_Fixed Asset Con''ty 2013'!F31","v":100000.12410948519},null,12.590715012014144,15,6.6666666666666666E-2,0,434908.26333333331,3333.337470316173,438241.60080364946,438241.60080364946,0,6666.6749406323461,null,6666.6749406323461]
[1860,"Meters (Metering Equipment)",188339.08268571459,null,0,35.209548939837603,null,45,2.2222222222222223E-2,5349.0910379888346,0,0,5349.0910379888346,5349.0910379888346,0,0,null,5349.0910379888346]
[1860,"Meters (Wholesale Metering)",464907.16440000013,null,0,21.815904546435757,null,30,3.3333333333333333E-2,21310.469314276306,0,0,21310.469314276306,21310.469314276306,0,0,null,21310.469314276306]
[1905,"Land",{"$f":"'App.2-B_FA Con''ty 2012 CGAAP'!N32","v":0},null,{"$f":"'App.2-B_Fixed Asset Con''ty 2013'!F32","v":0},null,null,null,0,0,0,0,0,null,0,0,null,0]
[1908,"Buildings & Fixtures",{"$f":"'App.2-B_FA Con''ty 2012 CGAAP'!N33","v":0},null,{"$f":"'App.2-B_Fixed Asset Con''ty 2013'!F33","v":0},null,null,null,0,0,0,0,0,null,0,0,null,0]
[1910,"Leasehold Improvements",{"$f":"'App.2-B_FA Con''ty 2012 CGAAP'!N34","v":0},null,{"$f":"'App.2-B_Fixed Asset Con''ty 2013'!F34","v":0},null,null,null,0,0,0,0,0,null,0,0,null,0]
[1915,"Office Furniture & Equipment (10 years)",{"$f":"'App.2-B_FA Con''ty 2012 CGAAP'!N35","v":2600.981500000009},null,{"$f":"'App.2-B_Fixed Asset Con''ty 2013'!F35","v":0},2.7713694508952251,null,10,0.1,938.51849999999945,0,0,938.51849999999945,{"$f":"-'App.2-B_Fixed Asset Con''ty 2013'!L35","v":938.51849999999945},0,0,null,938.51849999999945]
[1915,"Office Furniture & Equipment (5 years)",{"$f":"'App.2-B_FA Con''ty 2012 CGAAP'!N36","v":0},null,{"$f":"'App.2-B_Fixed Asset Con''ty 2013'!F36","v":0},null,null,null,0,0,0,0,0,null,0,0,null,0]
[1920,"Computer Equipment - Hardware",{"$f":"'App.2-B_FA Con''ty 2012 CGAAP'!N37","v":442150.01200000005},{"$f":"'App.2-B_Fixed Asset Con''ty 2013'!G37+'App.2-B_Fixed Asset Con''ty 2013'!M37","v":103014},{"$f":"'App.2-B_Fixed Asset Con''ty 2013'!F37","v":0},4.2069694167270892,2.514801624253181,5,0.2,105099.412,40963.072,0,146062.484,{"$f":"-'App.2-B_Fixed Asset Con''ty 2013'!L37","v":146062.484},0,0,null,105099.412]
[1920,"Computer Equip.-Hardware(Post Mar. 22/04)",{"$f":"'App.2-B_FA Con''ty 2012 CGAAP'!N38","v":0},null,{"$f":"'App.2-B_Fixed Asset Con''ty 2013'!F38","v":0},null,null,null,0,0,0,0,0,null,0,0,null,0]
[1920,"Computer Equip.-Hardware(Post Mar. 19/07)",{"$f":"'App.2-B_FA Con''ty 2012 CGAAP'!N39","v":0},null,{"$f":"'App.2-B_Fixed Asset Con''ty 2013'!F39","v":0},null,null,null,0,0,0,0,0,null,0,0,null,0]
[1930,"Transportation Equipment",{"$f":"'App.2-B_FA Con''ty 2012 CGAAP'!N40","v":1391020.3694047634},null,40000,8.2784256568958181,null,8,0.125,168029.57797248103,0,2500,170529.57797248103,170529.57797248103,0,5000,12550.01,160479.56797248102]
[1930,"Transportation Equipment",null,null,1078450,null,null,12,{"$f":"IF(H46=0,0,1/H46)","v":8.3333333333333329E-2},0,0,{"$f":"IF(H46=0,0,+(E46*0.5)/H46)","v":44935.416666666664},44935.416666666664,44935.416666666664,{"$f":"IF(ISERROR(+M46-N46), 0, +M46-N46)","v":0},{"$f":"IF(H46=0,0,+(E46)/H46)","v":89870.833333333328},{"$f":"3437.37+26445.15","v":29882.52},{"$f":"IF(ISERROR(+P46+J46-Q46), 0, +P46+J46-Q46)","v":59988.313333333324}]
[1935,"Stores Equipment",{"$f":"'App.2-B_FA Con''ty 2012 CGAAP'!N41","v":0},null,{"$f":"'App.2-B_Fixed Asset Con''ty 2013'!F41","v":0},null,null,null,0,0,0,0,0,null,0,0,null,0]
[1940,"Tools, Shop & Garage Equipment",{"$f":"'App.2-B_FA Con''ty 2012 CGAAP'!N42","v":504581.95500000007},null,{"$f":"'App.2-B_Fixed Asset Con''ty 2013'!F42","v":160000},5.9951623155570655,null,10,0.1,84164.853000000003,0,8000,92164.853000000003,{"$f":"-'App.2-B_Fixed Asset Con''ty 2013'!L42","v":92164.853000000003},0,16000,1784.5,98380.353000000003]
[1945,"Measurement & Testing Equipment",{"$f":"'App.2-B_FA Con''ty 2012 CGAAP'!N43","v":0},null,{"$f":"'App.2-B_Fixed Asset Con''ty 2013'!F43","v":0},null,null,null,0,0,0,0,0,null,0,0,null,0]
[1950,"Power Operated Equipment",{"$f":"'App.2-B_FA Con''ty 2012 CGAAP'!N44","v":0},null,{"$f":"'App.2-B_Fixed Asset Con''ty 2013'!F44","v":0},null,null,null,0,0,0,0,0,null,0,0,null,0]
[1955,"Communications Equipment",{"$f":"'App.2-B_FA Con''ty 2012 CGAAP'!N45","v":978446.60429999977},null,{"$f":"'App.2-B_Fixed Asset Con''ty 2013'!F45","v":50000},11.56013029820217,null,10,0.1,84639.755699999994,0,2500,87139.755699999994,{"$f":"-'App.2-B_Fixed Asset Con''ty 2013'!L45","v":87139.755699999994},0,5000,null,89639.755699999994]
[1955,"Communication Equipment (Smart Meters)",{"$f":"'App.2-B_FA Con''ty 2012 CGAAP'!N46","v":0},null,{"$f":"'App.2-B_Fixed Asset Con''ty 2013'!F46","v":0},null,null,null,0,0,0,0,0,null,0,0,null,0]
[1960,"Miscellaneous Equipment (Smart Meters)",{"$f":"'App.2-B_FA Con''ty 2012 CGAAP'!N47","v":0},{"$f":"'App.2-B_Fixed Asset Con''ty 2013'!G47+'App.2-B_Fixed Asset Con''ty 2013'!M47","v":12377},{"$f":"'App.2-B_Fixed Asset Con''ty 2013'!F47","v":0},null,7.5003529898696462,null,0,0,1650.1889999999999,0,1650.1889999999999,{"$f":"-'App.2-B_Fixed Asset Con''ty 2013'!L47","v":1650.1889999999999},0,0,null,0]
[1975,"Load Management Controls Utility Premises",{"$f":"'App.2-B_FA Con''ty 2012 CGAAP'!N48","v":0},null,{"$f":"'App.2-B_Fixed Asset Con''ty 2013'!F48","v":0},null,null,null,0,0,0,0,0,null,0,0,null,0]
[1980,"System Supervisor Equipment",{"$f":"'App.2-B_FA Con''ty 2012 CGAAP'!N49","v":298105.78733333317},null,{"$f":"'App.2-B_Fixed Asset Con''ty 2013'!F49","v":379491.03366573114},14.062238048211954,null,20,0.05,21199.028654705358,0,9487.2758416432789,30686.304496348639,{"$f":"-'App.2-B_Fixed Asset Con''ty 2013'!L49","v":30686.304496348639},0,18974.551683286558,null,40173.580337991916]
[1985,"Miscellaneous Fixed Assets",{"$f":"'App.2-B_FA Con''ty 2012 CGAAP'!N50","v":0},null,{"$f":"'App.2-B_Fixed Asset Con''ty 2013'!F50","v":0},null,null,null,0,0,0,0,0,null,0,0,null,0]
[1995,"Contributions & Grants",{"$f":"'App.2-B_FA Con''ty 2012 CGAAP'!N51","v":-11642362.609933332},null,{"$f":"'App.2-B_Fixed Asset Con''ty 2013'!F51","v":-703790},39.518925364100163,null,45,2.2222222222222223E-2,-294602.20647875976,0,-7819.8888888888887,-302422.09536764864,{"$f":"-'App.2-B_Fixed Asset Con''ty 2013'!L51","v":-302422.09536764864},0,-15639.777777777777,null,-310241.98425653751]
["etc.",null,null,null,null,null,null,null,0,0,0,0,0,null,0,0,null,0]
[null,null,null,null,null,null,null,null,0,0,0,0,0,null,0,0,null,0]
["Total prior to Board ordered removal of CIS related to water billing",null,{"$f":"SUM(C16:C59)","v":68155568.306112066},null,{"$f":"SUM(E16:E59)","v":10862811.607844815},null,null,null,null,{"$f":"SUM(J16:J59)","v":3451124.431796385},532590.89433333336,226726.52622761109,{"$f":"SUM(M16:M59)","v":4210441.8523573298},4210441.8523573298,0,453453.05245522218,{"$f":"SUM(Q16:Q59)","v":44217.03},3860360.4542516065]
[1611,"Computer Software",{"$f":"'App.2-B_FA Con''ty 2012 CGAAP'!N56","v":-65457.794792000015},null,null,{"$f":"-C61/'App.2-B_Fixed Asset Con''ty 2013'!L56","v":2.522678074930611},null,null,{"$f":"IF(H61=0,0,1/H61)","v":0},{"$f":"IF(F61=0,0,+C61/F61)","v":-25947.74},{"$f":"IF(G61=0,0,+D61/G61)","v":0},{"$f":"IF(H61=0,0,+(E61*0.5)/H61)","v":0},{"$f":"IF(ISERROR(+J61+L61), 0, +J61+K61+L61)","v":-25947.74},{"$f":"-'App.2-B_Fixed Asset Con''ty 2013'!L56","v":-25947.74},{"$f":"IF(ISERROR(+M61-N61), 0, +M61-N61)","v":0},{"$f":"IF(H61=0,0,+(E61)/H61)","v":0},null,{"$f":"IF(ISERROR(+P61+J61-Q61), 0, +P61+J61-Q61)","v":-25947.74}]
["Total prior to Board ordered removal of CIS related to water billing",null,{"$f":"C60+C61","v":68090110.511320069},null,{"$f":"E60+E61","v":10862811.607844815},null,null,null,null,3425176.6917963848,532590.89433333336,226726.52622761109,4184494.1123573296,4184494.1123573296,0,453453.05245522218,44217.03,3834412.7142516063]
[]
["Notes:"]
[]
[1,"Board policy of the \"half-year\" rule - the applicant must ensure that additions in the year attract a half-year depreciation expense in the first year.  Deviations from this standard practice must be supported in the application."]
[2,"The applicant must provide an explanation of material variances in evidence"]
[3,"The applicant should ensure that the years for new additions of assets are the asset useful lives determined by management in accordance with IFRS. "]
[4,"A recalculation should be performed to determine the average remaining life of opening balance of assets (i.e. excluding 2012 additions) under IFRS.  For example, Asset A had a useful life of 20 years under CGAAP.  On January 1, 2012, the date of transition, Asset A was 3 years depreciated. As a result, Asset A would have a remaining service life of 17 years (20 years less 3 years) under CGAAP as of January 1, 2012.  Due to the transition to IFRS, management re-assessed the asset useful lives under IFRS principles and concluded that the revised useful life of Asset A is now 30 years. Therefore, the average remaining useful life of opening balance of Asset A is determined to be 27 years (30 years less 3 years) under IFRS as of January 1, 2012."]
[5,"NBV must exclude assets still on the books but which have been fully amortized or depreciated."]
[6,"This column refers to the calculated full year depreciation but excludes the depreciation expense on assets fully depreciated during the year.  This column is used for the purpose of calculating depreciation expense in the following year on the next worksheet."]
[]
["General:","Applicants must provide a breakdown of depreciation and amortization expense in the above format for all relevant accounts.  Asset Retirement Obligations (AROs), depreciation and accretion expense should be disclosed separately consistent with the Notes of historical Audited Financial Statements."]

{"sheet":"App.2-D_Overhead","index":13,"n_rows":56,"n_cols":13,"rows_kept":56,"cut":false,"hidden":false,"merged":[[8,0,8,12],[9,0,9,12],[11,0,11,12],[13,0,15,2],[13,10,13,12],[14,10,14,12],[15,10,15,12],[22,0,22,2],[22,10,22,12],[16,0,16,2],[16,10,16,12],[17,0,17,2],[17,10,17,12],[18,0,18,2],[18,10,18,12],[19,0,19,2],[19,10,19,12],[20,0,20,2],[20,10,20,12],[21,10,21,12],[23,0,23,2],[23,10,23,12],[24,0,24,2],[24,10,24,12],[25,0,25,2],[25,10,25,12],[35,0,37,2],[35,10,35,12],[36,10,36,12],[37,10,37,12],[26,0,26,2],[26,10,26,12],[27,0,27,2],[27,10,27,12],[28,0,28,2],[28,10,28,12],[29,0,29,2],[29,10,29,12],[30,0,30,2],[30,10,30,12],[33,0,33,12],[44,0,44,2],[44,10,44,12],[38,0,38,2],[38,10,38,12],[39,0,39,2],[39,10,39,12],[40,0,40,2],[40,10,40,12],[41,0,41,2],[41,10,41,12],[42,0,42,2],[42,10,42,12],[43,10,43,12],[45,0,45,2],[45,10,45,12],[46,0,46,2],[46,10,46,12],[47,0,47,2],[47,10,47,12],[48,0,48,2],[48,10,48,12],[49,0,49,2],[49,10,49,12],[50,0,50,2],[50,10,50,12],[51,0,51,2],[51,10,51,12],[52,0,52,2],[52,10,52,12],[57,0,58,0],[57,1,58,4],[55,1,56,12],[68,0,71,0],[73,0,74,0],[60,0,61,0],[60,1,60,4],[62,0,63,0],[65,0,66,0]]}
[null,null,null,null,null,null,null,null,null,null,null,"File Number:",{"$f":"'LDC Info'!$E$18","v":"EB-2012-0126"}]
[null,null,null,null,null,null,null,null,null,null,null,"Exhibit:",2]
[null,null,null,null,null,null,null,null,null,null,null,"Tab:",2]
[null,null,null,null,null,null,null,null,null,null,null,"Schedule:",1]
[null,null,null,null,null,null,null,null,null,null,null,"Attachment:",2]
[]
[null,null,null,null,null,null,null,null,null,null,null,"Date:","9 November, 2012"]
[]
["Appendix 2-D"]
["Overhead Expense"]
[]
["The following table should be completed based on the information requested below. An explanation should be provided for any blank entries.  The entries should include overhead costs that are currently capitalized on self-constructed assets under MIFRS or an alternate accounting standard."]
[null,null,null,null,"(A) 1","(B)","(C)","(D)","(E) 1","(F)","(G)"]
["Nature of the Overhead Costs",null,null,null,"Dollar","Dollar","Dollar","Dollar Impact - ","Dollar Impact - ","Directly","Reasons why the overhead costs are allowed to be"]
[null,null,null,null,"Impact on PP&E","Impact on PP&E","Impact on PP&E","PP&E Variance","PP&E Variance","Attributable?","capitalized under MIFRS or an alternate accounting"]
[null,null,null,null,"Historic Year","Bridge Year","Test Year","Test versus Bridge","Test versus Historic","(Y/N)","standard given limitations on capitalized overhead"]
["employee benefits",null,null,null,null,null,423500.49,{"$f":"+G17-F17","v":423500.49},{"$f":"+G17-E17","v":423500.49},"Y","Directly attributable"]
["costs of site preparation",null,null,null,null,null,null,0,0]
["initial delivery and handling costs",null,null,null,null,null,null,0,0]
["costs of testing whether the asset is functioning properly",null,null,null,null,null,null,0,0]
["professional fees",null,null,null,null,null,null,0,0]
[null,null,null,null,null,null,null,0,0]
["costs of opening a new facility",null,null,null,null,null,null,0,0]
["costs of introducing a new product or service (including costs of advertising and promotional activities)",null,null,null,null,null,null,0,0]
["costs of conducting business in a new location or with a new class of customer (including costs of staff training)",null,null,null,null,null,null,0,0]
["administration and other general overhead costs",null,null,null,null,null,1213924.5900000001,1213924.5900000001,1213924.5900000001,"Y","Directly attributable"]
[null,null,null,null,null,null,null,0,0]
[null,null,null,null,null,null,null,0,0]
[null,null,null,null,null,null,null,0,0]
["Insert description of additional item(s) and new rows if needed.",null,null,null,null,null,null,0,0]
["Total",null,null,null,{"$f":"SUM(E17:E30)","v":0},{"$f":"SUM(F17:F30)","v":0},{"$f":"SUM(G17:G30)","v":1637425.08},{"$f":"SUM(H17:H30)","v":1637425.08},{"$f":"SUM(I17:I30)","v":1637425.08}]
[]
[]
["The following table should be completed based on the information requested below. An explanation should be provided for any blank entries.  The entries should include overhead costs that were capitalized on self-constructed assets under CGAAP but are no longer capitalized under MIFRS or an alternate accounting standard and are included in OM&A."]
[null,null,null,null,"(A) 1","(B)","(C)","(D)","(E) 1","(F)","(G)"]
["Nature of the Overhead Costs",null,null,null,"Dollar","Dollar","Dollar","Dollar Impact - ","Dollar Impact - ","Directly","Reasons why the overhead costs are not allowed to be"]
[null,null,null,null,"Impact on OM&A","Impact on OM&A","Impact on OM&A","OM&A Variance","OM&A Variance","Attributable?","capitalized under MIFRS or an alternate accounting"]
[null,null,null,null,"Historic Year","Bridge Year","Test Year","Test versus Bridge","Test versus Historic","(Y/N)","standard given limitations on capitalized overhead"]
["employee benefits",null,null,null,null,null,88786.22,{"$f":"+G39-F39","v":88786.22},{"$f":"+G39-E39","v":88786.22},"N","Not directly attributable"]
["costs of site preparation",null,null,null,null,null,null,{"$f":"+G40-F40","v":0},{"$f":"+G40-E40","v":0}]
["initial delivery and handling costs",null,null,null,null,null,null,{"$f":"+G41-F41","v":0},{"$f":"+G41-E41","v":0}]
["costs of testing whether the asset is functioning properly",null,null,null,null,null,null,{"$f":"+G42-F42","v":0},{"$f":"+G42-E42","v":0}]
["professional fees",null,null,null,null,null,null,{"$f":"+G43-F43","v":0},{"$f":"+G43-E43","v":0}]
[]
["costs of opening a new facility",null,null,null,null,null,null,{"$f":"+G45-F45","v":0},{"$f":"+G45-E45","v":0}]
["costs of introducing a new product or service (including costs of advertising and promotional activities)",null,null,null,null,null,null,0,0]
["costs of conducting business in a new location or with a new class of customer (including costs of staff training)",null,null,null,null,null,null,0,0]
["administration and other general overhead costs",null,null,null,null,null,895026.71,895026.71,895026.71,"N","Not directly attributable"]
[null,null,null,null,null,null,null,0,0]
[null,null,null,null,null,null,null,0,0]
[null,null,null,null,null,null,null,0,0]
["Insert description of additional item(s) and new rows if needed.",null,null,null,null,null,null,0,0]
["Total",null,null,null,{"$f":"SUM(E39:E52)","v":0},{"$f":"SUM(F39:F52)","v":0},{"$f":"SUM(G39:G52)","v":983812.92999999993},{"$f":"SUM(H39:H52)","v":983812.92999999993},{"$f":"SUM(I39:I52)","v":983812.92999999993}]
[]
["Notes:"]
[1,"If the applicant chooses to adopt IFRS or an alternate accounting standard for financial reporting purposes in 2013, the applicant does not need to complete Columns A, E.  If the applicant adopts IFRS or an alternate accounting standard for financial reporting purposes in 2012, the applicant must complete all columns."]

{"sheet":"App.2-F_Other_Oper_Rev","index":14,"n_rows":127,"n_cols":9,"rows_kept":127,"cut":false,"hidden":false,"merged":[[45,0,45,8],[28,0,28,1],[29,0,29,1],[8,0,8,8],[9,0,9,8],[26,0,26,8],[27,0,27,1],[41,2,41,8],[42,2,43,8],[30,0,30,1],[31,0,31,1],[39,0,39,1],[40,0,40,1],[41,0,41,1],[42,0,42,1],[125,1,125,8],[126,1,126,8],[118,0,118,1],[49,0,50,8],[117,0,117,1],[121,0,121,1],[120,0,120,1],[54,0,54,1],[55,0,55,1],[56,0,56,1],[57,0,57,1],[58,0,58,1],[60,0,60,1],[68,0,68,1],[69,0,69,1],[70,0,70,1],[61,0,61,1],[59,0,59,1],[65,0,65,1],[66,0,66,1],[67,0,67,1],[77,0,77,1],[87,0,87,1],[89,0,89,1],[90,0,90,1],[74,0,74,1],[75,0,75,1],[76,0,76,1],[81,0,81,1],[82,0,82,1],[83,0,83,1],[111,0,111,1],[112,0,112,1],[113,0,113,1],[104,0,104,1],[106,0,106,1],[105,0,105,1],[98,0,98,1],[96,0,96,1],[88,0,88,1],[97,0,97,1],[107,0,107,1],[94,0,94,1],[95,0,95,1],[99,0,99,1],[103,0,103,1]]}
[null,null,null,null,null,null,"File Number:","File Number:",{"$f":"'LDC Info'!$E$18","v":"EB-2012-0126"}]
[null,null,null,null,null,null,"Exhibit:","Exhibit:",3]
[null,null,null,null,null,null,"Tab:","Tab:",3]
[null,null,null,null,null,null,"Schedule:","Schedule:",1]
[null,null,null,null,null,null,"Attachment:","Page:",1]
[]
[null,null,null,null,null,null,"Date:","Date:","9 November 2012"]
[]
["Appendix 2-F"]
["Other Operating Revenue"]
[]
["USoA #","USoA Description",{"$f":"G13-3 & \" Actual\"","v":"2009 Actual"},{"$f":"G13-2 & \" Actual\"","v":"2010 Actual"},{"$f":"G13-1 & \" Actual\"& CHAR(178)","v":"2011 Actual²"},{"$f":"G13-1 & \" Actual\"& CHAR(178)","v":"2011 Actual²"},{"$f":"\"Bridge Year\" & CHAR(179)","v":"Bridge Year³"},{"$f":"\"Bridge Year\" & CHAR(179)","v":"Bridge Year³"},"Test Year"]
[null,null,null,null,null,null,{"$f":"'LDC Info'!E26","v":2012},{"$f":"'LDC Info'!E26","v":2012},{"$f":"'LDC Info'!E28","v":2013}]
[null,"Reporting Basis","CGAAP","CGAAP","CGAAP","CGAAP","CGAAP","MIFRS","CGAAP"]
[4235,"Specific Service Charges1,2",{"$f":"-1016386.23+128534.87-13311.62","v":-901162.98},-985662,-1013851.16,null,-731825,null,-843150]
[4225,"Late Payment Charges1",-128534.87,-132947,-270016.87,null,-200000,null,-200000]
[4080,"Standard Supply Service - Administrative Charge",-120492,{"$f":"-109992.96","v":-109992.96000000001},-130703.16,null,-129711,null,-130503]
[4082,"Retail Services Revenues",-76578.100000000006,-68194,-62657.9,null,-49100,null,-39520]
[4084,"Service Transactions Requests",-1423.75,-3073,-1757.25,null,-1550,null,-1228]
[4210,"Rent from Electric Property",null,null,null,null,-65121,null,-90627]
[4355,"Gain on Disposition of Utility and Other Property4",-2370,null,{"$f":"-29116.58-11990.65","v":-41107.230000000003}]
[4360,"Loss on Disposition of Utility and Other Property3",1337332.68,230197,232146.09]
[4375,"Revenues from Non-Utility Operations5",-819778.93,{"$f":"-1185318.06","v":-1185318.06},-470740.71]
[4380,"Expenses of Non-Utility Operations",797370.26,699808.06,483425.08]
[4405,"Interest and Dividend Income2",{"$f":"-145734.16+13311.62","v":-132422.54},-125934,-447286.35,null,-318200,null,-245000]
[]
[]
["Specific Service Charges",null,{"$f":"C15","v":-901162.98},{"$f":"D15","v":-985662},-1013851.16,{"$f":"F15","v":0},-731825,{"$f":"H15","v":0},{"$f":"I15","v":-843150}]
["Late Payment Charges",null,{"$f":"C16","v":-128534.87},-132947,-270016.87,{"$f":"F16","v":0},-200000,{"$f":"H16","v":0},{"$f":"I16","v":-200000}]
["Other Operating Revenues",null,{"$f":"C17+C18+C19+C20","v":-198493.85},{"$f":"D17+D18+D19+D20","v":-181259.96000000002},-195118.31,0,{"$f":"G17+G18+G19+G20","v":-245482},{"$f":"H17+H18+H19+H20","v":0},-261878]
["Other Income or Deductions",null,{"$f":"C21+C22+C23+C24+C25","v":1180131.4699999997},{"$f":"D21+D22+D23+D24+D25","v":-381247},-243563.12,0,-318200,0,{"$f":"I21+I22+I23+I24+I25","v":-245000}]
["Total",null,{"$f":"SUM(C28:C31)","v":-48060.230000000214},{"$f":"SUM(D28:D31)","v":-1681115.96},-1722549.46,0,-1495507,0,-1550028]
[]
["1 In 2009 Late Payment Charges were reported under USoA account 4235, however have been shown separately here for comparison"]
["2 In 2009, an amount was incorrectly reported under USoA account 4405, it should have been 4235, the accounts have been corrected here"]
["3 In 2010 Loss of Disposition of Utility and Other Property were incorrectly filed under USoA account 4355, however has been corrected here to account 4360"]
["4 In 2011, an amount was incorrectly reported under USoA account 4360, it should have been 4355, the accounts have been corrected here"]
[]
["Description",null,"Account(s)"]
["Specific Service Charges:",null,4235]
["Late Payment Charges:",null,4225]
["Other Distribution Revenues:",null,"4080, 4082, 4084, 4090, 4205, 4210, 4215, 4220, 4240, 4245"]
["Other Income and Expenses:",null,"4305, 4310, 4315, 4320, 4325, 4330, 4335, 4340, 4345, 4350, 4355, 4360, 4365, 4370, 4375, 4380, 4385, 4390, 4395, 4398, 4405, 4415"]
[]
["Note: Add all applicable accounts listed above to the table and include all relevant information."]
["The above table assumes adoption of MIFRS as of January 1, 2013.  If the adoption year differs, please adjust the table accordingly."]
[]
["Account Breakdown Details"]
[]
["For each \"Other Operating Revenue\" and \"Other Income or Deductions\" Account, a detailed breakdown of the account components is required.  See the example below for Account 4405, Interest and Dividend Income."]
[]
[]
["Account 4080 - Distribution Services Revenues"]
[null,null,{"$f":"$C$12","v":"2009 Actual"},{"$f":"$D$12","v":"2010 Actual"},{"$f":"$E$12","v":"2011 Actual²"},{"$f":"$F$12","v":"2011 Actual²"},"Bridge Year","Bridge Year","Test Year"]
["Reporting Basis",null,{"$f":"IF(ISBLANK($C$14), \"\", $C$14)","v":"CGAAP"},{"$f":"IF(ISBLANK($D$14), \"\", $D$14)","v":"CGAAP"},{"$f":"IF(ISBLANK($E$14), \"\", $E$14)","v":"CGAAP"},null,{"$f":"IF(ISBLANK($G$14), \"\", $G$14)","v":"CGAAP"},{"$f":"IF(ISBLANK($H$14), \"\", $H$14)","v":"MIFRS"},{"$f":"IF(ISBLANK($I$14), \"\", $I$14)","v":"CGAAP"}]
["Residential",null,-107506.48,-98303.95,-116678.19,null,-116340,null,-115581]
["GS<50kW",null,-10688.09,-9597.66,-11378.32,null,-10911,null,-12183]
["GS 50kW to 4999kW",null,-1208.01,-1132.8699999999999,-1392.49,null,-1314,null,-1593]
["Unmetered Scattered Load",null,-578.66999999999996,-536.53,-599.12,null,-597,null,-597]
["Sentinel Lighting",null,-505.06,-416.45,-648.41999999999996,null,-543,null,-543]
["Street Lighting",null,-5.51,-5.5,-6.62,null,-6,null,-6]
["Total",null,{"$f":"SUM(C56:C61)","v":-120491.81999999998},{"$f":"SUM(D56:D61)","v":-109992.95999999999},-130703.16,0,-129711,0,-130503]
[]
["Account 4082 - Retail Services Revenues"]
[null,null,{"$f":"$C$12","v":"2009 Actual"},{"$f":"$D$12","v":"2010 Actual"},{"$f":"$E$12","v":"2011 Actual²"},{"$f":"$F$12","v":"2011 Actual²"},"Bridge Year","Bridge Year","Test Year"]
["Reporting Basis",null,{"$f":"IF(ISBLANK($C$14), \"\", $C$14)","v":"CGAAP"},{"$f":"IF(ISBLANK($D$14), \"\", $D$14)","v":"CGAAP"},{"$f":"IF(ISBLANK($E$14), \"\", $E$14)","v":"CGAAP"},null,{"$f":"IF(ISBLANK($G$14), \"\", $G$14)","v":"CGAAP"},{"$f":"IF(ISBLANK($H$14), \"\", $H$14)","v":"MIFRS"},{"$f":"IF(ISBLANK($I$14), \"\", $I$14)","v":"CGAAP"}]
["Retailer Service Agreement -- standard charge",null,-300,-100,null,null,-300,null,0]
["Retailer Service Agreement -- monthly fixed charge",null,-3440,-3080,-3740,null,-4000,null,-4000]
["Retailer Service Agreement -- monthly variable charge",null,-45873,-41977,-36806.5,null,-28000,null,-22200]
["Distributor-Consolidated Billing -- monthly charge",null,-26965,-23037,-22111.4,null,-16800,null,-13320]
["Total",null,{"$f":"SUM(C67:C70)","v":-76578},-68194,-62657.9,0,-49100,0,-39520]
[]
["Account 4084 - Service Transaction Requests (STR) Revenues"]
[null,null,{"$f":"$C$12","v":"2009 Actual"},{"$f":"$D$12","v":"2010 Actual"},{"$f":"$E$12","v":"2011 Actual²"},{"$f":"$F$12","v":"2011 Actual²"},"Bridge Year","Bridge Year","Test Year"]
["Reporting Basis",null,{"$f":"IF(ISBLANK($C$14), \"\", $C$14)","v":"CGAAP"},{"$f":"IF(ISBLANK($D$14), \"\", $D$14)","v":"CGAAP"},{"$f":"IF(ISBLANK($E$14), \"\", $E$14)","v":"CGAAP"},null,{"$f":"IF(ISBLANK($G$14), \"\", $G$14)","v":"CGAAP"},{"$f":"IF(ISBLANK($H$14), \"\", $H$14)","v":"MIFRS"},{"$f":"IF(ISBLANK($I$14), \"\", $I$14)","v":"CGAAP"}]
["Service Transaction Request -- request fee",null,-513,-1132,-689.25,null,-635,null,{"$f":"-503-725","v":-1228}]
["Service Transaction Request -- processing fee",null,-911,-1941,-1068,null,-915]
["Total",null,{"$f":"SUM(C76:C77)","v":-1424},-3073,-1757.25,0,-1550,0,-1228]
[]
["Account 4210 - Rent from Electric Property"]
[null,null,{"$f":"$C$12","v":"2009 Actual"},{"$f":"$D$12","v":"2010 Actual"},{"$f":"$E$12","v":"2011 Actual²"},{"$f":"$F$12","v":"2011 Actual²"},"Bridge Year","Bridge Year","Test Year"]
["Reporting Basis",null,{"$f":"IF(ISBLANK($C$14), \"\", $C$14)","v":"CGAAP"},{"$f":"IF(ISBLANK($D$14), \"\", $D$14)","v":"CGAAP"},{"$f":"IF(ISBLANK($E$14), \"\", $E$14)","v":"CGAAP"},null,{"$f":"IF(ISBLANK($G$14), \"\", $G$14)","v":"CGAAP"},{"$f":"IF(ISBLANK($H$14), \"\", $H$14)","v":"MIFRS"},{"$f":"IF(ISBLANK($I$14), \"\", $I$14)","v":"CGAAP"}]
["Commercial Rent charged to Affiliates",null,null,null,null,null,{"$f":"G20","v":-65121},null,{"$f":"I20","v":-90627}]
["Total",null,{"$f":"SUM(C83:C83)","v":0},0,0,0,-65121,0,-90627]
[]
["Account 4355 - Gain on Disposition of Utility and Other Property"]
[null,null,{"$f":"$C$12","v":"2009 Actual"},{"$f":"$D$12","v":"2010 Actual"},{"$f":"$E$12","v":"2011 Actual²"},{"$f":"$F$12","v":"2011 Actual²"},"Bridge Year","Bridge Year","Test Year"]
["Reporting Basis",null,{"$f":"IF(ISBLANK($C$14), \"\", $C$14)","v":"CGAAP"},{"$f":"IF(ISBLANK($D$14), \"\", $D$14)","v":"CGAAP"},{"$f":"IF(ISBLANK($E$14), \"\", $E$14)","v":"CGAAP"},null,{"$f":"IF(ISBLANK($G$14), \"\", $G$14)","v":"CGAAP"},{"$f":"IF(ISBLANK($H$14), \"\", $H$14)","v":"MIFRS"},{"$f":"IF(ISBLANK($I$14), \"\", $I$14)","v":"CGAAP"}]
["Gain on sale of vehicles",null,-2370,null,-29116.58]
["Sale of Scrap",null,0,null,-11990.65]
["Total",null,{"$f":"SUM(C89:C90)","v":-2370},0,{"$f":"SUM(E89:E90)","v":-41107.230000000003},{"$f":"SUM(F89:F90)","v":0},0,0,0]
[]
["Account 4360 - Loss on Disposition of Utility and Other Property"]
[null,null,{"$f":"$C$12","v":"2009 Actual"},{"$f":"$D$12","v":"2010 Actual"},{"$f":"$E$12","v":"2011 Actual²"},{"$f":"$F$12","v":"2011 Actual²"},"Bridge Year","Bridge Year","Test Year"]
["Reporting Basis",null,{"$f":"IF(ISBLANK($C$14), \"\", $C$14)","v":"CGAAP"},{"$f":"IF(ISBLANK($D$14), \"\", $D$14)","v":"CGAAP"},{"$f":"IF(ISBLANK($E$14), \"\", $E$14)","v":"CGAAP"},null,{"$f":"IF(ISBLANK($G$14), \"\", $G$14)","v":"CGAAP"},{"$f":"IF(ISBLANK($H$14), \"\", $H$14)","v":"MIFRS"},{"$f":"IF(ISBLANK($I$14), \"\", $I$14)","v":"CGAAP"}]
["Write off of SAP Customer Information System",null,1337333]
["Write off of meters from Smart Meter Pilot - no longer used",null,null,221986.25]
["Loss on sale of land",null,null,8210.85]
["Write off of reorganization costs (2000 amalgamation of 3 LDC's)",null,null,null,232146.09]
["Total",null,{"$f":"SUM(C96:C99)","v":1337333},{"$f":"SUM(D96:D99)","v":230197.1},232146.09,0,0,0,0]
[]
["Account 4375 - Revenues from Non-Utility Operations"]
[null,null,{"$f":"$C$12","v":"2009 Actual"},{"$f":"$D$12","v":"2010 Actual"},{"$f":"$E$12","v":"2011 Actual²"},{"$f":"$F$12","v":"2011 Actual²"},"Bridge Year","Bridge Year","Test Year"]
["Reporting Basis",null,{"$f":"IF(ISBLANK($C$14), \"\", $C$14)","v":"CGAAP"},{"$f":"IF(ISBLANK($D$14), \"\", $D$14)","v":"CGAAP"},{"$f":"IF(ISBLANK($E$14), \"\", $E$14)","v":"CGAAP"},null,{"$f":"IF(ISBLANK($G$14), \"\", $G$14)","v":"CGAAP"},{"$f":"IF(ISBLANK($H$14), \"\", $H$14)","v":"MIFRS"},{"$f":"IF(ISBLANK($I$14), \"\", $I$14)","v":"CGAAP"}]
["CDM Program Revenues",null,{"$f":"-22933.67+525","v":-22408.67},null,297.39]
["OPA Program Revenues",null,-797370.26,-1185318.03,-457219.38]
["Sentinel Rentals",null,null,null,{"$f":"-14214.51+395.79","v":-13818.72}]
["Total",null,{"$f":"SUM(C105:C107)","v":-819778.93},{"$f":"SUM(D105:D107)","v":-1185318.03},{"$f":"SUM(E105:F107)","v":-470740.70999999996},{"$f":"SUM(F105:G107)","v":0},0,0,0]
[]
["Account 4380 - Expenses of Non-Utility Operations"]
[null,null,{"$f":"$C$12","v":"2009 Actual"},{"$f":"$D$12","v":"2010 Actual"},{"$f":"$E$12","v":"2011 Actual²"},{"$f":"$F$12","v":"2011 Actual²"},"Bridge Year","Bridge Year","Test Year"]
["Reporting Basis",null,{"$f":"IF(ISBLANK($C$14), \"\", $C$14)","v":"CGAAP"},{"$f":"IF(ISBLANK($D$14), \"\", $D$14)","v":"CGAAP"},{"$f":"IF(ISBLANK($E$14), \"\", $E$14)","v":"CGAAP"},null,{"$f":"IF(ISBLANK($G$14), \"\", $G$14)","v":"CGAAP"},{"$f":"IF(ISBLANK($H$14), \"\", $H$14)","v":"MIFRS"},{"$f":"IF(ISBLANK($I$14), \"\", $I$14)","v":"CGAAP"}]
["OPA Program Expenditures",null,797370.26,699808.06,483425.08]
["Total",null,{"$f":"SUM(C113:C113)","v":797370.26},699808.06,483425.08,0,0,0,0]
[]
["Account 4405 - Interest and Dividend Income"]
[null,null,{"$f":"$C$12","v":"2009 Actual"},{"$f":"$D$12","v":"2010 Actual"},{"$f":"$E$12","v":"2011 Actual²"},{"$f":"$F$12","v":"2011 Actual²"},"Bridge Year","Bridge Year","Test Year"]
["Reporting Basis",null,{"$f":"IF(ISBLANK($C$14), \"\", $C$14)","v":"CGAAP"},{"$f":"IF(ISBLANK($D$14), \"\", $D$14)","v":"CGAAP"},{"$f":"IF(ISBLANK($E$14), \"\", $E$14)","v":"CGAAP"},null,{"$f":"IF(ISBLANK($G$14), \"\", $G$14)","v":"CGAAP"},{"$f":"IF(ISBLANK($H$14), \"\", $H$14)","v":"MIFRS"},{"$f":"IF(ISBLANK($I$14), \"\", $I$14)","v":"CGAAP"}]
["Recovery of Carrying Charges - Regulatory Assets",null,-28362.06,-54921.67,-210500.39]
["Interest on Related Party Balances",null,null,null,-161782.87,null,-233200,null,-160000]
["Bank Deposit Interest",null,-104060.48,-71012.03,-75003.09,null,-85000,null,-85000]
["Total",null,{"$f":"SUM(C119:C121)","v":-132422.54},-125933.7,-447286.35,0,-318200,0,-245000]
[]
["Notes:"]
[1,"List and specify any other interest revenue"]
[2,"If the applicant is adopting IFRS or an alternate accounting standard as of January 1, 2012 for financial reporting purposes, 2011 must be presented on both a CGAAP and MIFRS (or alternate accounting standard) basis."]
[3,"If the applicant is adopting IFRS or an alternate accounting standard as of January 1, 2013 for financial reporting purposes, 2012 must be presented on both a CGAAP and MIFRS (or alternate accounting standard) basis."]

{"sheet":"App.2-G_Detailed_OM&A_Expenses","index":15,"n_rows":126,"n_cols":9,"rows_kept":126,"cut":false,"hidden":false,"merged":[[118,0,118,1],[85,0,85,8],[60,0,60,1],[124,1,124,8],[125,1,125,8],[123,1,123,8],[112,0,112,1],[73,0,73,8],[111,0,111,1],[41,0,41,8],[62,0,62,8],[71,0,71,1],[8,0,8,8],[9,0,9,8],[10,0,10,8],[39,0,39,1],[15,0,15,8],[12,4,12,5],[12,6,12,7]]}
[null,null,null,null,null,null,"File Number:","File Number:",{"$f":"'LDC Info'!$E$18","v":"EB-2012-0126"}]
[null,null,null,null,null,null,"Exhibit:","Exhibit:",4]
[null,null,null,null,null,null,"Tab:","Tab:",2]
[null,null,null,null,null,null,"Schedule:","Schedule:",1]
[null,null,null,null,null,null,"Attachment:","Page:",2]
[]
[null,null,null,null,null,null,"Date:","Date:","9 November, 2012"]
[]
["Appendix 2-G"]
["Detailed, Account by Account, OM&A Expense Table"]
["(excluding Depreciation and Amortization)"]
[]
[]
["Account","Description",{"$f":"\"Last Rebasing Year (\" & 'LDC Info'!E30 & \" Actuals)\"","v":"Last Rebasing Year (2009 Actuals)"},{"$f":"'LDC Info'!E26-2 & \" Actual\"","v":"2010 Actual"},{"$f":"'LDC Info'!E26-1 & \" Actual\" & CHAR(178)","v":"2011 Actual²"},{"$f":"'LDC Info'!E26-1 & \" Actual\"& CHAR(178)","v":"2011 Actual²"},{"$f":"\"Bridge Year \" & 'LDC Info'!E26& CHAR(179)","v":"Bridge Year 2012³"},{"$f":"\"Bridge Year \" & 'LDC Info'!E26& CHAR(179)","v":"Bridge Year 2012³"},{"$f":"\"Test Year \" & 'LDC Info'!E28","v":"Test Year 2013"}]
["Reporting Basis",null,"CGAAP","CGAAP","CGAAP",null,"CGAAP","MIFRS","CGAAP"]
["Operations"]
[5005,"Operation Supervision and Engineering",727708.88,772290,903975.76,null,1310072.1201570337,1463179.21212,1374757.6252650237]
[5010,"Load Dispatching",594072.09,541203,500314.99,null,486214.70647180075,486229.92181330011,579568.73026537488]
[5012,"Station Buildings and Fixtures Expense",219146.8,230856,218694.57,null,234265.45950276338,234059.48960302051,234955.67701163975]
[5014,"Transformer Station Equipment - Operation Labour"]
[5015,"Transformer Station Equipment - Operation Supplies and Expenses"]
[5016,"Distribution Station Equipment - Operation Labour",349861.45,293588,416175.62,null,217971.42719923132,217080.21391423061,217095.26103631218]
[5017,"Distribution Station Equipment - Operation Supplies and Expenses",120129.66,101687,173290.73,null,191850.60523160567,185667.20000000001,291850.6052316057]
[5020,"Overhead Distribution Lines and Feeders - Operation Labour",138981.63,65367,150175.88,null,128477.83330788233,127623.22827359512,120031.20129798572]
[5025,"Overhead Distribution Lines and Feeders - Operation Supplies and Expenses",352985.82,260312,342585.5,null,320060.67503867927,309345,307302.94421730173]
[5030,"Overhead Sub-transmission Feeders - Operation",23512.6,27488,15339.55,null,18780.659520681271,16525.483950012836,15614.080728649311]
[5035,"Overhead Distribution Transformers - Operation",113835.42,196552,105607.38,null,181137.32413070119,173791.46429606111,164805.47664711741]
[5040,"Underground Distribution Lines and Feeders - Operation Labour",3408.62,14322,13650.89,null,13645.969401545233,13584.015160010271,12798.702479772361]
[5045,"Underground Distribution Lines and Feeders - Operation Supplies and Expenses",7408.88,9333,4751.49,null,6685.9619310055868,4491.2000000000007,6685.9619310055868]
[5050,"Underground Sub-transmission Feeders - Operation",970.17,366,null,null,2125.4164255814976,2111.5221585980389,2049.4120661329275]
[5055,"Underground Distribution Transformers - Operation",60792.25,68454,106630.3,null,96239.847995460339,92710.254887608433,88655.48338723692]
[5060,"Street Lighting and Signal System Expense"]
[5065,"Meter Expense",244855.78,220947,186074.44,null,285285.40447441669,276117.61839040008,971683.76105314866]
[5070,"Customer Premises - Operation Labour",637695.62,562116,549410.24,null,705100.47849572927,683473.87128129485,631688.52086251217]
[5075,"Customer Premises - Operation Materials and Expenses"]
[5085,"Miscellaneous Distribution Expenses",null,null,null,null,876705.25302346959,1686290.2273190622,1813188.6205884041]
[5090,"Underground Distribution Lines and Feeders - Rental Paid"]
[5095,"Overhead Distribution Lines and Feeders - Rental Paid",56688.59,67991,76624.94,null,82000,82000,82000]
[5096,"Other Rent"]
["Total - Operations",null,{"$f":"SUM(C17:C39)","v":3652054.2599999993},{"$f":"SUM(D17:D39)","v":3432872},{"$f":"SUM(E17:E39)","v":3763302.28},{"$f":"SUM(F17:F39)","v":0},5156619.1423075879,6054279.9231671952,{"$f":"SUM(I17:I39)","v":6914732.0640692236}]
["Account","Description",{"$f":"C14","v":"Last Rebasing Year (2009 Actuals)"},"2010 Actual","2011 Actual²","2011 Actual²","Bridge Year 2012³","Bridge Year 2012³","Test Year 2013"]
["Maintenance"]
[5105,"Maintenance Supervision and Engineering",16.88]
[5110,"Maintenance of Buildings and Fixtures - Distribution Stations",36772.839999999997,38253,30599.53,null,18088.739589587629,17944.793015103889,17719.800934590941]
[5112,"Maintenance of Transformer Station Equipment"]
[5114,"Maintenance of Distribution Station Equipment",72347.91,100719,180098.05,null,160822.72722680948,157567.77540308208,157768.18216789822]
[5120,"Maintenance of Poles, Towers and Fixtures",173662.84,129192,194222.84,null,304657.62303561484,294264.08079385641,278676.60815599776]
[5125,"Maintenance of Overhead Conductors and Devices",268802.21999999997,292005,158548.46,null,550406.55036692182,533869.65409754566,503397.92146481975]
[5130,"Maintenance of Overhead Services",170764.27,154032,184767.65,null,201106.80561967753,193464.71883013356,183580.19034696341]
[5135,"Overhead Distribution Lines and Feeders - Right of Way",415591.2,669674,416624.71,null,553623.20909686841,550118.10919002816,514475.43575620599]
[5145,"Maintenance of Underground Conduit",53447.26,58358,102243.29,null,58228.720495280199,56948.275120007711,56309.018483583466]
[5150,"Maintenance of Underground Conductors and Devices",33764.11,21123,68672.06,null,52952.832172995841,50421.15699242198,48520.492136537447]
[5155,"Maintenance of Underground Services",69421.95,42087,70439.100000000006,null,116304.80921564522,110831.87959005393,106503.61160895713]
[5160,"Maintenance of Line Transformers",204621.43,174983,88131.62,null,323319.86678841594,312210.16025038238,296868.56793144473]
[5165,"Maintenance of Street Lighting and Signal Systems"]
[5170,"Sentinel Lights - Labour"]
[5172,"Sentinel Lights - Materials and Expenses"]
[5175,"Maintenance of Meters",3118.34,1217,3184.13]
[5178,"Customer Installations Expenses - Leased Property"]
[5195,"Maintenance of Other Installations on Customer Premises"]
["Total - Maintenance",null,{"$f":"SUM(C43:C60)","v":1502331.25},{"$f":"SUM(D43:D60)","v":1681643},{"$f":"SUM(E43:E60)","v":1497531.44},{"$f":"SUM(F43:F60)","v":0},2339511.8836078169,2277640.603282616,{"$f":"SUM(I43:I60)","v":2163819.8289869991}]
["Account","Description",{"$f":"C41","v":"Last Rebasing Year (2009 Actuals)"},{"$f":"D41","v":"2010 Actual"},{"$f":"E41","v":"2011 Actual²"},{"$f":"F41","v":"2011 Actual²"},"Bridge Year 2012³","Bridge Year 2012³",{"$f":"I41","v":"Test Year 2013"}]
["Billing and Collecting"]
[5305,"Supervision"]
[5310,"Meter Reading Expense",224521.35,227655,204714.91,null,204200,204200,29200]
[5315,"Customer Billing",1454081.9,1328392,1335739.52,null,1037933.47614238,1037933.47614238,2230628.0976859853]
[5320,"Collecting",193042.29,144250,203223.48,null,251020.03017331503,251020.03017331456,364088.79435185838]
[5325,"Collecting - Cash Over and Short"]
[5330,"Collection Charges"]
[5335,"Bad Debt Expense",148802.57999999999,105536,463316.04,null,165000,165000,400000]
[5340,"Miscellaneous Customer Accounts Expenses",173656.1,131443,114714.1,null,121549.91474647465,125454.39896087001,122947.56909018299]
["Total - Billing and Collecting",null,{"$f":"SUM(C64:C71)","v":2194104.2200000002},{"$f":"SUM(D64:D71)","v":1937276},{"$f":"SUM(E64:E71)","v":2321708.0499999998},{"$f":"SUM(F64:F71)","v":0},1779703.4210621696,1783607.9052765644,{"$f":"SUM(I64:I71)","v":3146864.4611280267}]
["Account","Description",{"$f":"C62","v":"Last Rebasing Year (2009 Actuals)"},{"$f":"D62","v":"2010 Actual"},{"$f":"E62","v":"2011 Actual²"},{"$f":"F62","v":"2011 Actual²"},"Bridge Year 2012³","Bridge Year 2012³",{"$f":"I62","v":"Test Year 2013"}]
["Community Relations"]
[5405,"Supervision"]
[5410,"Community Relations - Sundry",null,null,null,null,null,null,78108.169853940824]
[5415,"Energy Conservation",142484.07999999999,343169,439835.65]
[5420,"Community Safety Program"]
[5425,"Miscellaneous Customer Service and Informational Expenses"]
[5505,"Supervision"]
[5510,"Demonstrating and Selling Expense"]
[5515,"Advertising Expenses"]
[5520,"Miscellaneous Sales Expense"]
["Total - Community Relations",null,{"$f":"SUM(C75:C83)","v":142484.07999999999},{"$f":"SUM(D75:D83)","v":343169},{"$f":"SUM(E75:E83)","v":439835.65},{"$f":"SUM(F75:F83)","v":0},0,0,{"$f":"SUM(I75:I83)","v":78108.169853940824}]
["Account","Description",{"$f":"C73","v":"Last Rebasing Year (2009 Actuals)"},{"$f":"D73","v":"2010 Actual"},{"$f":"E73","v":"2011 Actual²"},{"$f":"F73","v":"2011 Actual²"},"Bridge Year 2012³","Bridge Year 2012³",{"$f":"I73","v":"Test Year 2013"}]
["Administrative and General Expenses"]
[5605,"Executive Salaries and Expenses",426684.63,501466,417192.5,null,452203.24140229897,441967.98086736607,523280.07755725831]
[5610,"Management Salaries and Expenses",509971.6,451456,465059.62,null,541149.95392831694,538765.01765777357,551537.10410169559]
[5615,"General Administrative Salaries and Expenses",492148.42,529316,466709.02,null,666395.59417358309,663489.40421120147,659248.13719609147]
[5620,"Office Supplies and Expenses",65800.98,88610,81723.45,null,249355.06028784154,247526.16252078608,312493.49210327829]
[5625,"Administrative Expense Transferred - Credit"]
[5630,"Outside Services Employed",60163,41900,53650]
[5635,"Property Insurance"]
[5640,"Injuries and Damages",314078.73,-284366,17883.669999999998]
[5645,"OMERS Pensions and Benefits",null,-2780264,1280544]
[5646,"Employee Pensions and OPEB"]
[5647,"Employee Sick Leave"]
[5650,"Franchise Requirements"]
[5655,"Regulatory Expenses",553280.79,208573,275241.37,null,517527.57161836536,525773,486839.3845379983]
[5660,"General Advertising Expenses",49394.94,103092,34408.25,null,49361.267200772614,53041.099582579227,52869.226127386515]
[5665,"Miscellaneous General Expenses",319088.65999999997,402942,380098.41,null,317562,317562,551027.94400000002]
[5670,"Rent",185789.6,274536,313629.27,null,226614.21673811751,226614,62000]
[5672,"Lease Payment Charge"]
[5675,"Maintenance of General Plant",967442.91,974850,1143724.06,null,0,0,34797.578848995443]
[5680,"Electrical Safety Authority Fees"]
[5681,"Special Purpose Charge Expense",null,232809.60000000001,138035.79999999999]
[5685,"Independent Electricity System Operator Fees and Penalties"]
[5695,"OM&A Contra Account"]
[6205,"Donations",202000]
[6205,"Donations, Sub-account LEAP Funding",null,null,27000,null,27000,27000,27000]
["Total - Administrative and General Expenses",null,{"$f":"SUM(C87:C110)","v":4145844.2600000002},{"$f":"SUM(D87:D110)","v":744920.6},5094899.42,0,3047168.9053492961,3041738.6648397068,3261092.9444727036]
["Total OM&A",null,{"$f":"C40+C61+C72+C84+C111","v":11636818.07},{"$f":"D40+D61+D72+D84+D111","v":8139880.5999999996},{"$f":"E40+E61+E72+E84+E111","v":13117276.84},{"$f":"F40+F61+F72+F84+F111","v":0},12323003.35232687,13157267.096566083,{"$f":"I40+I61+I72+I84+I111","v":15564617.468510894}]
["Adjustments for non-recoverable items"]
[5681,"Special Purpose Charge Expense",{"$f":"C106","v":0},232809.60000000001,{"$f":"E106","v":138035.79999999999},{"$f":"F106","v":0},0,0,0]
[6205,"Donations1",{"$f":"C109","v":202000},{"$f":"D109","v":0},0,0,0,0,0]
[]
[]
[]
["Total Recoverable OM&A",null,{"$f":"C112-SUM(C114:C118)","v":11434818.07},{"$f":"D112-SUM(D114:D118)","v":7907071},12979241.039999999,{"$f":"F112-SUM(F114:F118)","v":0},12323003.35232687,13157267.096566083,15564617.468510894]
[]
["1 Account 6205 - Donations is generally non-recoverable.  However, the sub-account LEAP funding of account 6205 is generally recoverable."]
[]
["Note:"]
[1,"If it has been more than three years since the applicant last filed a cost of service application, additional years of historical actuals should be incorporated into the table, as necessary, to go back to the last cost of service application.  If the applicant last filed a cost of service application less than three years ago, a minimum of three years of actual information is required."]
[2,"If the applicant is adopting IFRS or an alternate accounting standard as of January 1, 2012 for financial reporting purposes, 2011 must be presented on both a CGAAP and MIFRS (or alternate accounting standard) basis."]
[3,"If the applicant is adopting IFRS or an alternate accounting standard as of January 1, 2013 for financial reporting purposes, 2012 must be presented on both a CGAAP and MIFRS (or alternate accounting standard) basis."]

{"sheet":"App.2-H_OM&A_Detailed_Analysis","index":16,"n_rows":128,"n_cols":9,"rows_kept":128,"cut":false,"hidden":false,"merged":[[41,1,41,8],[8,0,8,8],[9,0,9,8],[10,0,10,8],[40,0,40,1],[16,0,16,8],[13,0,14,0],[13,1,14,1],[13,2,14,2],[13,3,14,3],[13,4,14,4],[13,7,13,8],[13,5,13,6],[73,1,73,8],[85,1,85,8],[119,0,119,1],[113,0,113,1],[42,0,42,8],[63,0,63,8],[62,1,62,8],[72,0,72,1],[61,0,61,1],[126,1,126,8],[127,1,127,8],[112,0,112,1],[74,0,74,8],[86,0,86,8]]}
[null,null,null,null,null,null,null,"File Number:",{"$f":"'LDC Info'!$E$18","v":"EB-2012-0126"}]
[null,null,null,null,null,null,null,"Exhibit:",4]
[null,null,null,null,null,null,null,"Tab:",3]
[null,null,null,null,null,null,null,"Schedule:",1]
[null,null,null,null,null,null,null,"Attachment:",1]
[]
[null,null,null,null,null,null,null,"Date:","9 November, 2012"]
[]
["Appendix 2-H"]
["OM&A Detailed Variance Analysis"]
["(excluding Depreciation and Amortization)"]
[]
[]
["Account","Description",{"$f":"\"Last Board-approved Rebasing Year (\"&'LDC Info'!E30&\" Year)\"","v":"Last Board-approved Rebasing Year (2009 Year)"},"Most Current Actuals               Year 2011",{"$f":"\"Test Year \" & 'LDC Info'!E28","v":"Test Year 2013"},"Test Year (2013) Versus Last Rebasing (2009)",null,"Test Year (2013) Versus Most Current Actuals (2011)"]
[null,null,null,null,null,"Variance ($)","Percentage Change (%)","Variance ($)","Percentage Change (%)"]
["Reporting Basis",null,"CGAAP","CGAAP","CGAAP"]
["Operations"]
[5005,"Operation Supervision and Engineering",{"$f":"VLOOKUP(A18,'App.2-G_Detailed_OM&A_Expenses'!$A$17:$I$119,3,FALSE)","v":727708.88},{"$f":"VLOOKUP(A18,'App.2-G_Detailed_OM&A_Expenses'!$A$17:$I$119,5,FALSE)","v":903975.76},{"$f":"VLOOKUP(A18,'App.2-G_Detailed_OM&A_Expenses'!$A$17:$I$119,9,FALSE)","v":1374757.6252650237},{"$f":"E18-C18","v":647048.74526502367},{"$f":"IF(C18=0,\"\",(E18/C18)-1)","v":0.88915878732306197},{"$f":"E18-D18","v":470781.86526502366},{"$f":"IF(D18=0,\"\",(E18/D18)-1)","v":0.52079036418523406}]
[5010,"Load Dispatching",{"$f":"VLOOKUP(A19,'App.2-G_Detailed_OM&A_Expenses'!$A$17:$I$119,3,FALSE)","v":594072.09},{"$f":"VLOOKUP(A19,'App.2-G_Detailed_OM&A_Expenses'!$A$17:$I$119,5,FALSE)","v":500314.99},{"$f":"VLOOKUP(A19,'App.2-G_Detailed_OM&A_Expenses'!$A$17:$I$119,9,FALSE)","v":579568.73026537488},{"$f":"E19-C19","v":-14503.35973462509},{"$f":"IF(C19=0,\"\",(E19/C19)-1)","v":-2.441346762246499E-2},{"$f":"E19-D19","v":79253.740265374887},{"$f":"IF(D19=0,\"\",(E19/D19)-1)","v":0.15840768685618412}]
[5012,"Station Buildings and Fixtures Expense",{"$f":"VLOOKUP(A20,'App.2-G_Detailed_OM&A_Expenses'!$A$17:$I$119,3,FALSE)","v":219146.8},{"$f":"VLOOKUP(A20,'App.2-G_Detailed_OM&A_Expenses'!$A$17:$I$119,5,FALSE)","v":218694.57},{"$f":"VLOOKUP(A20,'App.2-G_Detailed_OM&A_Expenses'!$A$17:$I$119,9,FALSE)","v":234955.67701163975},15808.877011639765,7.2138297304089161E-2,16261.107011639746,7.4355330411906229E-2]
[5014,"Transformer Station Equipment - Operation Labour",{"$f":"VLOOKUP(A21,'App.2-G_Detailed_OM&A_Expenses'!$A$17:$I$119,3,FALSE)","v":0},{"$f":"VLOOKUP(A21,'App.2-G_Detailed_OM&A_Expenses'!$A$17:$I$119,5,FALSE)","v":0},{"$f":"VLOOKUP(A21,'App.2-G_Detailed_OM&A_Expenses'!$A$17:$I$119,9,FALSE)","v":0},0,"",0,""]
[5015,"Transformer Station Equipment - Operation Supplies and Expenses",{"$f":"VLOOKUP(A22,'App.2-G_Detailed_OM&A_Expenses'!$A$17:$I$119,3,FALSE)","v":0},{"$f":"VLOOKUP(A22,'App.2-G_Detailed_OM&A_Expenses'!$A$17:$I$119,5,FALSE)","v":0},{"$f":"VLOOKUP(A22,'App.2-G_Detailed_OM&A_Expenses'!$A$17:$I$119,9,FALSE)","v":0},0,"",0,""]
[5016,"Distribution Station Equipment - Operation Labour",{"$f":"VLOOKUP(A23,'App.2-G_Detailed_OM&A_Expenses'!$A$17:$I$119,3,FALSE)","v":349861.45},{"$f":"VLOOKUP(A23,'App.2-G_Detailed_OM&A_Expenses'!$A$17:$I$119,5,FALSE)","v":416175.62},{"$f":"VLOOKUP(A23,'App.2-G_Detailed_OM&A_Expenses'!$A$17:$I$119,9,FALSE)","v":217095.26103631218},{"$f":"E23-C23","v":-132766.18896368783},-0.37948218920286247,{"$f":"E23-D23","v":-199080.35896368782},-0.47835661051862632]
[5017,"Distribution Station Equipment - Operation Supplies and Expenses",{"$f":"VLOOKUP(A24,'App.2-G_Detailed_OM&A_Expenses'!$A$17:$I$119,3,FALSE)","v":120129.66},{"$f":"VLOOKUP(A24,'App.2-G_Detailed_OM&A_Expenses'!$A$17:$I$119,5,FALSE)","v":173290.73},{"$f":"VLOOKUP(A24,'App.2-G_Detailed_OM&A_Expenses'!$A$17:$I$119,9,FALSE)","v":291850.6052316057},171720.9452316057,1.4294633417892442,118559.87523160569,0.68416744064501134]
[5020,"Overhead Distribution Lines and Feeders - Operation Labour",{"$f":"VLOOKUP(A25,'App.2-G_Detailed_OM&A_Expenses'!$A$17:$I$119,3,FALSE)","v":138981.63},{"$f":"VLOOKUP(A25,'App.2-G_Detailed_OM&A_Expenses'!$A$17:$I$119,5,FALSE)","v":150175.88},{"$f":"VLOOKUP(A25,'App.2-G_Detailed_OM&A_Expenses'!$A$17:$I$119,9,FALSE)","v":120031.20129798572},-18950.42870201428,-0.13635203948906249,-30144.67870201428,-0.2007291630454523]
[5025,"Overhead Distribution Lines and Feeders - Operation Supplies and Expenses",{"$f":"VLOOKUP(A26,'App.2-G_Detailed_OM&A_Expenses'!$A$17:$I$119,3,FALSE)","v":352985.82},{"$f":"VLOOKUP(A26,'App.2-G_Detailed_OM&A_Expenses'!$A$17:$I$119,5,FALSE)","v":342585.5},{"$f":"VLOOKUP(A26,'App.2-G_Detailed_OM&A_Expenses'!$A$17:$I$119,9,FALSE)","v":307302.94421730173},-45682.875782698276,-0.12941844457859042,-35282.555782698269,-0.10298905173364981]
[5030,"Overhead Sub-transmission Feeders - Operation",{"$f":"VLOOKUP(A27,'App.2-G_Detailed_OM&A_Expenses'!$A$17:$I$119,3,FALSE)","v":23512.6},{"$f":"VLOOKUP(A27,'App.2-G_Detailed_OM&A_Expenses'!$A$17:$I$119,5,FALSE)","v":15339.55},{"$f":"VLOOKUP(A27,'App.2-G_Detailed_OM&A_Expenses'!$A$17:$I$119,9,FALSE)","v":15614.080728649311},-7898.5192713506876,-0.33592708893745005,274.53072864931164,1.789692192074166E-2]
[5035,"Overhead Distribution Transformers - Operation",{"$f":"VLOOKUP(A28,'App.2-G_Detailed_OM&A_Expenses'!$A$17:$I$119,3,FALSE)","v":113835.42},{"$f":"VLOOKUP(A28,'App.2-G_Detailed_OM&A_Expenses'!$A$17:$I$119,5,FALSE)","v":105607.38},{"$f":"VLOOKUP(A28,'App.2-G_Detailed_OM&A_Expenses'!$A$17:$I$119,9,FALSE)","v":164805.47664711741},50970.05664711741,0.44775217280454016,59198.096647117403,0.56054886170945051]
[5040,"Underground Distribution Lines and Feeders - Operation Labour",{"$f":"VLOOKUP(A29,'App.2-G_Detailed_OM&A_Expenses'!$A$17:$I$119,3,FALSE)","v":3408.62},{"$f":"VLOOKUP(A29,'App.2-G_Detailed_OM&A_Expenses'!$A$17:$I$119,5,FALSE)","v":13650.89},{"$f":"VLOOKUP(A29,'App.2-G_Detailed_OM&A_Expenses'!$A$17:$I$119,9,FALSE)","v":12798.702479772361},9390.0824797723617,2.7548047244258265,-852.18752022763874,-6.2427249815040553E-2]
[5045,"Underground Distribution Lines and Feeders - Operation Supplies and Expenses",{"$f":"VLOOKUP(A30,'App.2-G_Detailed_OM&A_Expenses'!$A$17:$I$119,3,FALSE)","v":7408.88},{"$f":"VLOOKUP(A30,'App.2-G_Detailed_OM&A_Expenses'!$A$17:$I$119,5,FALSE)","v":4751.49},{"$f":"VLOOKUP(A30,'App.2-G_Detailed_OM&A_Expenses'!$A$17:$I$119,9,FALSE)","v":6685.9619310055868},-722.91806899441326,-9.7574541495396461E-2,1934.4719310055871,0.40712953852488099]
[5050,"Underground Sub-transmission Feeders - Operation",{"$f":"VLOOKUP(A31,'App.2-G_Detailed_OM&A_Expenses'!$A$17:$I$119,3,FALSE)","v":970.17},{"$f":"VLOOKUP(A31,'App.2-G_Detailed_OM&A_Expenses'!$A$17:$I$119,5,FALSE)","v":0},{"$f":"VLOOKUP(A31,'App.2-G_Detailed_OM&A_Expenses'!$A$17:$I$119,9,FALSE)","v":2049.4120661329275},1079.2420661329274,1.1124257255253487,2049.4120661329275,""]
[5055,"Underground Distribution Transformers - Operation",{"$f":"VLOOKUP(A32,'App.2-G_Detailed_OM&A_Expenses'!$A$17:$I$119,3,FALSE)","v":60792.25},{"$f":"VLOOKUP(A32,'App.2-G_Detailed_OM&A_Expenses'!$A$17:$I$119,5,FALSE)","v":106630.3},{"$f":"VLOOKUP(A32,'App.2-G_Detailed_OM&A_Expenses'!$A$17:$I$119,9,FALSE)","v":88655.48338723692},27863.23338723692,0.45833528759400943,-17974.816612763083,-0.16857137804885747]
[5060,"Street Lighting and Signal System Expense",{"$f":"VLOOKUP(A33,'App.2-G_Detailed_OM&A_Expenses'!$A$17:$I$119,3,FALSE)","v":0},{"$f":"VLOOKUP(A33,'App.2-G_Detailed_OM&A_Expenses'!$A$17:$I$119,5,FALSE)","v":0},{"$f":"VLOOKUP(A33,'App.2-G_Detailed_OM&A_Expenses'!$A$17:$I$119,9,FALSE)","v":0},0,"",0,""]
[5065,"Meter Expense",{"$f":"VLOOKUP(A34,'App.2-G_Detailed_OM&A_Expenses'!$A$17:$I$119,3,FALSE)","v":244855.78},{"$f":"VLOOKUP(A34,'App.2-G_Detailed_OM&A_Expenses'!$A$17:$I$119,5,FALSE)","v":186074.44},{"$f":"VLOOKUP(A34,'App.2-G_Detailed_OM&A_Expenses'!$A$17:$I$119,9,FALSE)","v":971683.76105314866},726827.98105314863,2.968392173765098,785609.32105314871,4.2220163126818955]
[5070,"Customer Premises - Operation Labour",{"$f":"VLOOKUP(A35,'App.2-G_Detailed_OM&A_Expenses'!$A$17:$I$119,3,FALSE)","v":637695.62},{"$f":"VLOOKUP(A35,'App.2-G_Detailed_OM&A_Expenses'!$A$17:$I$119,5,FALSE)","v":549410.24},{"$f":"VLOOKUP(A35,'App.2-G_Detailed_OM&A_Expenses'!$A$17:$I$119,9,FALSE)","v":631688.52086251217},-6007.0991374878213,-9.4200100315693369E-3,82278.280862512183,0.14975745785610428]
[5075,"Customer Premises - Operation Materials and Expenses",{"$f":"VLOOKUP(A36,'App.2-G_Detailed_OM&A_Expenses'!$A$17:$I$119,3,FALSE)","v":0},{"$f":"VLOOKUP(A36,'App.2-G_Detailed_OM&A_Expenses'!$A$17:$I$119,5,FALSE)","v":0},{"$f":"VLOOKUP(A36,'App.2-G_Detailed_OM&A_Expenses'!$A$17:$I$119,9,FALSE)","v":0},0,"",0,""]
[5085,"Miscellaneous Distribution Expenses",{"$f":"VLOOKUP(A37,'App.2-G_Detailed_OM&A_Expenses'!$A$17:$I$119,3,FALSE)","v":0},{"$f":"VLOOKUP(A37,'App.2-G_Detailed_OM&A_Expenses'!$A$17:$I$119,5,FALSE)","v":0},{"$f":"VLOOKUP(A37,'App.2-G_Detailed_OM&A_Expenses'!$A$17:$I$119,9,FALSE)","v":1813188.6205884041},1813188.6205884041,"",1813188.6205884041,""]
[5090,"Underground Distribution Lines and Feeders - Rental Paid",{"$f":"VLOOKUP(A38,'App.2-G_Detailed_OM&A_Expenses'!$A$17:$I$119,3,FALSE)","v":0},{"$f":"VLOOKUP(A38,'App.2-G_Detailed_OM&A_Expenses'!$A$17:$I$119,5,FALSE)","v":0},{"$f":"VLOOKUP(A38,'App.2-G_Detailed_OM&A_Expenses'!$A$17:$I$119,9,FALSE)","v":0},0,"",0,""]
[5095,"Overhead Distribution Lines and Feeders - Rental Paid",{"$f":"VLOOKUP(A39,'App.2-G_Detailed_OM&A_Expenses'!$A$17:$I$119,3,FALSE)","v":56688.59},{"$f":"VLOOKUP(A39,'App.2-G_Detailed_OM&A_Expenses'!$A$17:$I$119,5,FALSE)","v":76624.94},{"$f":"VLOOKUP(A39,'App.2-G_Detailed_OM&A_Expenses'!$A$17:$I$119,9,FALSE)","v":82000},25311.410000000003,0.44649919851596254,5375.0599999999977,7.0147656885604093E-2]
[5096,"Other Rent",{"$f":"VLOOKUP(A40,'App.2-G_Detailed_OM&A_Expenses'!$A$17:$I$119,3,FALSE)","v":0},{"$f":"VLOOKUP(A40,'App.2-G_Detailed_OM&A_Expenses'!$A$17:$I$119,5,FALSE)","v":0},{"$f":"VLOOKUP(A40,'App.2-G_Detailed_OM&A_Expenses'!$A$17:$I$119,9,FALSE)","v":0},0,"",0,""]
["Total - Operations",null,{"$f":"SUM(C18:C40)","v":3652054.2599999993},{"$f":"SUM(D18:D40)","v":3763302.28},{"$f":"SUM(E18:E40)","v":6914732.0640692236},3262677.8040692243,0.89338152496924428,3151429.7840692238,0.83741074981338559]
["Account","Description"]
["Maintenance"]
[5105,"Maintenance Supervision and Engineering",{"$f":"VLOOKUP(A44,'App.2-G_Detailed_OM&A_Expenses'!$A$17:$I$119,3,FALSE)","v":16.88},{"$f":"VLOOKUP(A44,'App.2-G_Detailed_OM&A_Expenses'!$A$17:$I$119,5,FALSE)","v":0},{"$f":"VLOOKUP(A44,'App.2-G_Detailed_OM&A_Expenses'!$A$17:$I$119,9,FALSE)","v":0},{"$f":"E44-C44","v":-16.88},{"$f":"IF(C44=0,\"\",(E44/C44)-1)","v":-1},{"$f":"E44-D44","v":0},{"$f":"IF(D44=0,\"\",(E44/D44)-1)","v":""}]
[5110,"Maintenance of Buildings and Fixtures - Distribution Stations",{"$f":"VLOOKUP(A45,'App.2-G_Detailed_OM&A_Expenses'!$A$17:$I$119,3,FALSE)","v":36772.839999999997},{"$f":"VLOOKUP(A45,'App.2-G_Detailed_OM&A_Expenses'!$A$17:$I$119,5,FALSE)","v":30599.53},{"$f":"VLOOKUP(A45,'App.2-G_Detailed_OM&A_Expenses'!$A$17:$I$119,9,FALSE)","v":17719.800934590941},-19053.039065409055,-0.51812802778923406,-12879.729065409058,-0.42091264360625991]
[5112,"Maintenance of Transformer Station Equipment",{"$f":"VLOOKUP(A46,'App.2-G_Detailed_OM&A_Expenses'!$A$17:$I$119,3,FALSE)","v":0},{"$f":"VLOOKUP(A46,'App.2-G_Detailed_OM&A_Expenses'!$A$17:$I$119,5,FALSE)","v":0},{"$f":"VLOOKUP(A46,'App.2-G_Detailed_OM&A_Expenses'!$A$17:$I$119,9,FALSE)","v":0},0,"",0,""]
[5114,"Maintenance of Distribution Station Equipment",{"$f":"VLOOKUP(A47,'App.2-G_Detailed_OM&A_Expenses'!$A$17:$I$119,3,FALSE)","v":72347.91},{"$f":"VLOOKUP(A47,'App.2-G_Detailed_OM&A_Expenses'!$A$17:$I$119,5,FALSE)","v":180098.05},{"$f":"VLOOKUP(A47,'App.2-G_Detailed_OM&A_Expenses'!$A$17:$I$119,9,FALSE)","v":157768.18216789822},85420.27216789822,1.1806874886627439,-22329.867832101765,-0.12398728266131565]
[5120,"Maintenance of Poles, Towers and Fixtures",{"$f":"VLOOKUP(A48,'App.2-G_Detailed_OM&A_Expenses'!$A$17:$I$119,3,FALSE)","v":173662.84},{"$f":"VLOOKUP(A48,'App.2-G_Detailed_OM&A_Expenses'!$A$17:$I$119,5,FALSE)","v":194222.84},{"$f":"VLOOKUP(A48,'App.2-G_Detailed_OM&A_Expenses'!$A$17:$I$119,9,FALSE)","v":278676.60815599776},105013.76815599776,0.60469912939347159,84453.768155997765,0.43482923098023774]
[5125,"Maintenance of Overhead Conductors and Devices",{"$f":"VLOOKUP(A49,'App.2-G_Detailed_OM&A_Expenses'!$A$17:$I$119,3,FALSE)","v":268802.21999999997},{"$f":"VLOOKUP(A49,'App.2-G_Detailed_OM&A_Expenses'!$A$17:$I$119,5,FALSE)","v":158548.46},{"$f":"VLOOKUP(A49,'App.2-G_Detailed_OM&A_Expenses'!$A$17:$I$119,9,FALSE)","v":503397.92146481975},234595.70146481978,0.87274465763273756,344849.46146481973,2.1750413814477905]
[5130,"Maintenance of Overhead Services",{"$f":"VLOOKUP(A50,'App.2-G_Detailed_OM&A_Expenses'!$A$17:$I$119,3,FALSE)","v":170764.27},{"$f":"VLOOKUP(A50,'App.2-G_Detailed_OM&A_Expenses'!$A$17:$I$119,5,FALSE)","v":184767.65},{"$f":"VLOOKUP(A50,'App.2-G_Detailed_OM&A_Expenses'!$A$17:$I$119,9,FALSE)","v":183580.19034696341},12815.920346963423,7.5050362391168912E-2,-1187.4596530365816,-6.4267725060993541E-3]
[5135,"Overhead Distribution Lines and Feeders - Right of Way",{"$f":"VLOOKUP(A51,'App.2-G_Detailed_OM&A_Expenses'!$A$17:$I$119,3,FALSE)","v":415591.2},{"$f":"VLOOKUP(A51,'App.2-G_Detailed_OM&A_Expenses'!$A$17:$I$119,5,FALSE)","v":416624.71},{"$f":"VLOOKUP(A51,'App.2-G_Detailed_OM&A_Expenses'!$A$17:$I$119,9,FALSE)","v":514475.43575620599},98884.235756205977,0.23793630797814291,97850.725756205968,0.23486539182038912]
[5145,"Maintenance of Underground Conduit",{"$f":"VLOOKUP(A52,'App.2-G_Detailed_OM&A_Expenses'!$A$17:$I$119,3,FALSE)","v":53447.26},{"$f":"VLOOKUP(A52,'App.2-G_Detailed_OM&A_Expenses'!$A$17:$I$119,5,FALSE)","v":102243.29},{"$f":"VLOOKUP(A52,'App.2-G_Detailed_OM&A_Expenses'!$A$17:$I$119,9,FALSE)","v":56309.018483583466},2861.7584835834641,5.3543595753710482E-2,-45934.271516416527,-0.44926441154638641]
[5150,"Maintenance of Underground Conductors and Devices",{"$f":"VLOOKUP(A53,'App.2-G_Detailed_OM&A_Expenses'!$A$17:$I$119,3,FALSE)","v":33764.11},{"$f":"VLOOKUP(A53,'App.2-G_Detailed_OM&A_Expenses'!$A$17:$I$119,5,FALSE)","v":68672.06},{"$f":"VLOOKUP(A53,'App.2-G_Detailed_OM&A_Expenses'!$A$17:$I$119,9,FALSE)","v":48520.492136537447},14756.382136537446,0.43704342085538306,-20151.567863462551,-0.29344638654297761]
[5155,"Maintenance of Underground Services",{"$f":"VLOOKUP(A54,'App.2-G_Detailed_OM&A_Expenses'!$A$17:$I$119,3,FALSE)","v":69421.95},{"$f":"VLOOKUP(A54,'App.2-G_Detailed_OM&A_Expenses'!$A$17:$I$119,5,FALSE)","v":70439.100000000006},{"$f":"VLOOKUP(A54,'App.2-G_Detailed_OM&A_Expenses'!$A$17:$I$119,9,FALSE)","v":106503.61160895713},37081.661608957133,0.53414894869644458,36064.511608957124,0.51199563323434183]
[5160,"Maintenance of Line Transformers",{"$f":"VLOOKUP(A55,'App.2-G_Detailed_OM&A_Expenses'!$A$17:$I$119,3,FALSE)","v":204621.43},{"$f":"VLOOKUP(A55,'App.2-G_Detailed_OM&A_Expenses'!$A$17:$I$119,5,FALSE)","v":88131.62},{"$f":"VLOOKUP(A55,'App.2-G_Detailed_OM&A_Expenses'!$A$17:$I$119,9,FALSE)","v":296868.56793144473},92247.13793144474,0.45081855762343537,208736.94793144474,2.3684682969795037]
[5165,"Maintenance of Street Lighting and Signal Systems",{"$f":"VLOOKUP(A56,'App.2-G_Detailed_OM&A_Expenses'!$A$17:$I$119,3,FALSE)","v":0},{"$f":"VLOOKUP(A56,'App.2-G_Detailed_OM&A_Expenses'!$A$17:$I$119,5,FALSE)","v":0},{"$f":"VLOOKUP(A56,'App.2-G_Detailed_OM&A_Expenses'!$A$17:$I$119,9,FALSE)","v":0},0,"",0,""]
[5170,"Sentinel Lights - Labour",{"$f":"VLOOKUP(A57,'App.2-G_Detailed_OM&A_Expenses'!$A$17:$I$119,3,FALSE)","v":0},{"$f":"VLOOKUP(A57,'App.2-G_Detailed_OM&A_Expenses'!$A$17:$I$119,5,FALSE)","v":0},{"$f":"VLOOKUP(A57,'App.2-G_Detailed_OM&A_Expenses'!$A$17:$I$119,9,FALSE)","v":0},0,"",0,""]
[5172,"Sentinel Lights - Materials and Expenses",{"$f":"VLOOKUP(A58,'App.2-G_Detailed_OM&A_Expenses'!$A$17:$I$119,3,FALSE)","v":0},{"$f":"VLOOKUP(A58,'App.2-G_Detailed_OM&A_Expenses'!$A$17:$I$119,5,FALSE)","v":0},{"$f":"VLOOKUP(A58,'App.2-G_Detailed_OM&A_Expenses'!$A$17:$I$119,9,FALSE)","v":0},0,"",0,""]
[5175,"Maintenance of Meters",{"$f":"VLOOKUP(A59,'App.2-G_Detailed_OM&A_Expenses'!$A$17:$I$119,3,FALSE)","v":3118.34},{"$f":"VLOOKUP(A59,'App.2-G_Detailed_OM&A_Expenses'!$A$17:$I$119,5,FALSE)","v":3184.13},{"$f":"VLOOKUP(A59,'App.2-G_Detailed_OM&A_Expenses'!$A$17:$I$119,9,FALSE)","v":0},-3118.34,-1,-3184.13,-1]
[5178,"Customer Installations Expenses - Leased Property",{"$f":"VLOOKUP(A60,'App.2-G_Detailed_OM&A_Expenses'!$A$17:$I$119,3,FALSE)","v":0},{"$f":"VLOOKUP(A60,'App.2-G_Detailed_OM&A_Expenses'!$A$17:$I$119,5,FALSE)","v":0},{"$f":"VLOOKUP(A60,'App.2-G_Detailed_OM&A_Expenses'!$A$17:$I$119,9,FALSE)","v":0},0,"",0,""]
[5195,"Maintenance of Other Installations on Customer Premises",{"$f":"VLOOKUP(A61,'App.2-G_Detailed_OM&A_Expenses'!$A$17:$I$119,3,FALSE)","v":0},{"$f":"VLOOKUP(A61,'App.2-G_Detailed_OM&A_Expenses'!$A$17:$I$119,5,FALSE)","v":0},{"$f":"VLOOKUP(A61,'App.2-G_Detailed_OM&A_Expenses'!$A$17:$I$119,9,FALSE)","v":0},0,"",0,""]
["Total - Maintenance",null,{"$f":"SUM(C44:C61)","v":1502331.25},{"$f":"SUM(D44:D61)","v":1497531.44},{"$f":"SUM(E44:E61)","v":2163819.8289869991},661488.57898699911,0.44030807385987547,666288.38898699917,0.44492447449851147]
["Account","Description"]
["Billing and Collecting"]
[5305,"Supervision",{"$f":"VLOOKUP(A65,'App.2-G_Detailed_OM&A_Expenses'!$A$17:$I$119,3,FALSE)","v":0},{"$f":"VLOOKUP(A65,'App.2-G_Detailed_OM&A_Expenses'!$A$17:$I$119,5,FALSE)","v":0},{"$f":"VLOOKUP(A65,'App.2-G_Detailed_OM&A_Expenses'!$A$17:$I$119,9,FALSE)","v":0},{"$f":"E65-C65","v":0},{"$f":"IF(C65=0,\"\",(E65/C65)-1)","v":""},{"$f":"E65-D65","v":0},{"$f":"IF(D65=0,\"\",(E65/D65)-1)","v":""}]
[5310,"Meter Reading Expense",{"$f":"VLOOKUP(A66,'App.2-G_Detailed_OM&A_Expenses'!$A$17:$I$119,3,FALSE)","v":224521.35},{"$f":"VLOOKUP(A66,'App.2-G_Detailed_OM&A_Expenses'!$A$17:$I$119,5,FALSE)","v":204714.91},{"$f":"VLOOKUP(A66,'App.2-G_Detailed_OM&A_Expenses'!$A$17:$I$119,9,FALSE)","v":29200},-195321.35,-0.86994555306210297,-175514.91,-0.85736261222985666]
[5315,"Customer Billing",{"$f":"VLOOKUP(A67,'App.2-G_Detailed_OM&A_Expenses'!$A$17:$I$119,3,FALSE)","v":1454081.9},{"$f":"VLOOKUP(A67,'App.2-G_Detailed_OM&A_Expenses'!$A$17:$I$119,5,FALSE)","v":1335739.52},{"$f":"VLOOKUP(A67,'App.2-G_Detailed_OM&A_Expenses'!$A$17:$I$119,9,FALSE)","v":2230628.0976859853},776546.19768598536,0.5340457079384493,894888.57768598525,0.66995740133973514]
[5320,"Collecting",{"$f":"VLOOKUP(A68,'App.2-G_Detailed_OM&A_Expenses'!$A$17:$I$119,3,FALSE)","v":193042.29},{"$f":"VLOOKUP(A68,'App.2-G_Detailed_OM&A_Expenses'!$A$17:$I$119,5,FALSE)","v":203223.48},{"$f":"VLOOKUP(A68,'App.2-G_Detailed_OM&A_Expenses'!$A$17:$I$119,9,FALSE)","v":364088.79435185838},171046.50435185837,0.88605716577366733,160865.31435185837,0.79156854489382011]
[5325,"Collecting - Cash Over and Short",{"$f":"VLOOKUP(A69,'App.2-G_Detailed_OM&A_Expenses'!$A$17:$I$119,3,FALSE)","v":0},{"$f":"VLOOKUP(A69,'App.2-G_Detailed_OM&A_Expenses'!$A$17:$I$119,5,FALSE)","v":0},{"$f":"VLOOKUP(A69,'App.2-G_Detailed_OM&A_Expenses'!$A$17:$I$119,9,FALSE)","v":0},0,"",0,""]
[5330,"Collection Charges",{"$f":"VLOOKUP(A70,'App.2-G_Detailed_OM&A_Expenses'!$A$17:$I$119,3,FALSE)","v":0},{"$f":"VLOOKUP(A70,'App.2-G_Detailed_OM&A_Expenses'!$A$17:$I$119,5,FALSE)","v":0},{"$f":"VLOOKUP(A70,'App.2-G_Detailed_OM&A_Expenses'!$A$17:$I$119,9,FALSE)","v":0},0,"",0,""]
[5335,"Bad Debt Expense",{"$f":"VLOOKUP(A71,'App.2-G_Detailed_OM&A_Expenses'!$A$17:$I$119,3,FALSE)","v":148802.57999999999},{"$f":"VLOOKUP(A71,'App.2-G_Detailed_OM&A_Expenses'!$A$17:$I$119,5,FALSE)","v":463316.04},{"$f":"VLOOKUP(A71,'App.2-G_Detailed_OM&A_Expenses'!$A$17:$I$119,9,FALSE)","v":400000},251197.42,1.6881254343842698,-63316.039999999979,-0.13665842434464381]
[5340,"Miscellaneous Customer Accounts Expenses",{"$f":"VLOOKUP(A72,'App.2-G_Detailed_OM&A_Expenses'!$A$17:$I$119,3,FALSE)","v":173656.1},{"$f":"VLOOKUP(A72,'App.2-G_Detailed_OM&A_Expenses'!$A$17:$I$119,5,FALSE)","v":114714.1},{"$f":"VLOOKUP(A72,'App.2-G_Detailed_OM&A_Expenses'!$A$17:$I$119,9,FALSE)","v":122947.56909018299},-50708.530909817011,-0.29200546891135415,8233.469090182989,7.1773819348998957E-2]
["Total - Billing and Collecting",null,{"$f":"SUM(C65:C72)","v":2194104.2200000002},{"$f":"SUM(D65:D72)","v":2321708.0499999998},{"$f":"SUM(E65:E72)","v":3146864.4611280267},952760.24112802651,0.43423654739975226,825156.4111280269,0.35540920449839808]
["Account","Description"]
["Community Relations"]
[5405,"Supervision",{"$f":"VLOOKUP(A76,'App.2-G_Detailed_OM&A_Expenses'!$A$17:$I$119,3,FALSE)","v":0},{"$f":"VLOOKUP(A76,'App.2-G_Detailed_OM&A_Expenses'!$A$17:$I$119,5,FALSE)","v":0},{"$f":"VLOOKUP(A76,'App.2-G_Detailed_OM&A_Expenses'!$A$17:$I$119,9,FALSE)","v":0},{"$f":"E76-C76","v":0},{"$f":"IF(C76=0,\"\",(E76/C76)-1)","v":""},{"$f":"E76-D76","v":0},{"$f":"IF(D76=0,\"\",(E76/D76)-1)","v":""}]
[5410,"Community Relations - Sundry",{"$f":"VLOOKUP(A77,'App.2-G_Detailed_OM&A_Expenses'!$A$17:$I$119,3,FALSE)","v":0},{"$f":"VLOOKUP(A77,'App.2-G_Detailed_OM&A_Expenses'!$A$17:$I$119,5,FALSE)","v":0},{"$f":"VLOOKUP(A77,'App.2-G_Detailed_OM&A_Expenses'!$A$17:$I$119,9,FALSE)","v":78108.169853940824},78108.169853940824,"",78108.169853940824,""]
[5415,"Energy Conservation",{"$f":"VLOOKUP(A78,'App.2-G_Detailed_OM&A_Expenses'!$A$17:$I$119,3,FALSE)","v":142484.07999999999},{"$f":"VLOOKUP(A78,'App.2-G_Detailed_OM&A_Expenses'!$A$17:$I$119,5,FALSE)","v":439835.65},{"$f":"VLOOKUP(A78,'App.2-G_Detailed_OM&A_Expenses'!$A$17:$I$119,9,FALSE)","v":0},-142484.07999999999,-1,-439835.65,-1]
[5420,"Community Safety Program",{"$f":"VLOOKUP(A79,'App.2-G_Detailed_OM&A_Expenses'!$A$17:$I$119,3,FALSE)","v":0},{"$f":"VLOOKUP(A79,'App.2-G_Detailed_OM&A_Expenses'!$A$17:$I$119,5,FALSE)","v":0},{"$f":"VLOOKUP(A79,'App.2-G_Detailed_OM&A_Expenses'!$A$17:$I$119,9,FALSE)","v":0},0,"",0,""]
[5425,"Miscellaneous Customer Service and Informational Expenses",{"$f":"VLOOKUP(A80,'App.2-G_Detailed_OM&A_Expenses'!$A$17:$I$119,3,FALSE)","v":0},{"$f":"VLOOKUP(A80,'App.2-G_Detailed_OM&A_Expenses'!$A$17:$I$119,5,FALSE)","v":0},{"$f":"VLOOKUP(A80,'App.2-G_Detailed_OM&A_Expenses'!$A$17:$I$119,9,FALSE)","v":0},0,"",0,""]
[5505,"Supervision",{"$f":"VLOOKUP(A81,'App.2-G_Detailed_OM&A_Expenses'!$A$17:$I$119,3,FALSE)","v":0},{"$f":"VLOOKUP(A81,'App.2-G_Detailed_OM&A_Expenses'!$A$17:$I$119,5,FALSE)","v":0},{"$f":"VLOOKUP(A81,'App.2-G_Detailed_OM&A_Expenses'!$A$17:$I$119,9,FALSE)","v":0},0,"",0,""]
[5510,"Demonstrating and Selling Expense",{"$f":"VLOOKUP(A82,'App.2-G_Detailed_OM&A_Expenses'!$A$17:$I$119,3,FALSE)","v":0},{"$f":"VLOOKUP(A82,'App.2-G_Detailed_OM&A_Expenses'!$A$17:$I$119,5,FALSE)","v":0},{"$f":"VLOOKUP(A82,'App.2-G_Detailed_OM&A_Expenses'!$A$17:$I$119,9,FALSE)","v":0},0,"",0,""]
[5515,"Advertising Expenses",{"$f":"VLOOKUP(A83,'App.2-G_Detailed_OM&A_Expenses'!$A$17:$I$119,3,FALSE)","v":0},{"$f":"VLOOKUP(A83,'App.2-G_Detailed_OM&A_Expenses'!$A$17:$I$119,5,FALSE)","v":0},{"$f":"VLOOKUP(A83,'App.2-G_Detailed_OM&A_Expenses'!$A$17:$I$119,9,FALSE)","v":0},0,"",0,""]
[5520,"Miscellaneous Sales Expense",{"$f":"VLOOKUP(A84,'App.2-G_Detailed_OM&A_Expenses'!$A$17:$I$119,3,FALSE)","v":0},{"$f":"VLOOKUP(A84,'App.2-G_Detailed_OM&A_Expenses'!$A$17:$I$119,5,FALSE)","v":0},{"$f":"VLOOKUP(A84,'App.2-G_Detailed_OM&A_Expenses'!$A$17:$I$119,9,FALSE)","v":0},0,"",0,""]
["Total - Community Relations",null,{"$f":"SUM(C76:C84)","v":142484.07999999999},{"$f":"SUM(D76:D84)","v":439835.65},{"$f":"SUM(E76:E84)","v":78108.169853940824},-64375.910146059163,-0.45181124899047787,-361727.48014605918,-0.82241510015402164]
["Account","Description"]
["Administrative and General Expenses"]
[5605,"Executive Salaries and Expenses",{"$f":"VLOOKUP(A88,'App.2-G_Detailed_OM&A_Expenses'!$A$17:$I$119,3,FALSE)","v":426684.63},{"$f":"VLOOKUP(A88,'App.2-G_Detailed_OM&A_Expenses'!$A$17:$I$119,5,FALSE)","v":417192.5},{"$f":"VLOOKUP(A88,'App.2-G_Detailed_OM&A_Expenses'!$A$17:$I$119,9,FALSE)","v":523280.07755725831},{"$f":"E88-C88","v":96595.447557258303},{"$f":"IF(C88=0,\"\",(E88/C88)-1)","v":0.22638604900593284},{"$f":"E88-D88","v":106087.57755725831},{"$f":"IF(D88=0,\"\",(E88/D88)-1)","v":0.25428927307479965}]
[5610,"Management Salaries and Expenses",{"$f":"VLOOKUP(A89,'App.2-G_Detailed_OM&A_Expenses'!$A$17:$I$119,3,FALSE)","v":509971.6},{"$f":"VLOOKUP(A89,'App.2-G_Detailed_OM&A_Expenses'!$A$17:$I$119,5,FALSE)","v":465059.62},{"$f":"VLOOKUP(A89,'App.2-G_Detailed_OM&A_Expenses'!$A$17:$I$119,9,FALSE)","v":551537.10410169559},41565.504101695609,8.1505527173857617E-2,86477.484101695591,0.18594924259753109]
[5615,"General Administrative Salaries and Expenses",{"$f":"VLOOKUP(A90,'App.2-G_Detailed_OM&A_Expenses'!$A$17:$I$119,3,FALSE)","v":492148.42},{"$f":"VLOOKUP(A90,'App.2-G_Detailed_OM&A_Expenses'!$A$17:$I$119,5,FALSE)","v":466709.02},{"$f":"VLOOKUP(A90,'App.2-G_Detailed_OM&A_Expenses'!$A$17:$I$119,9,FALSE)","v":659248.13719609147},167099.71719609149,0.33953114630763515,192539.11719609145,0.41254638103221453]
[5620,"Office Supplies and Expenses",{"$f":"VLOOKUP(A91,'App.2-G_Detailed_OM&A_Expenses'!$A$17:$I$119,3,FALSE)","v":65800.98},{"$f":"VLOOKUP(A91,'App.2-G_Detailed_OM&A_Expenses'!$A$17:$I$119,5,FALSE)","v":81723.45},{"$f":"VLOOKUP(A91,'App.2-G_Detailed_OM&A_Expenses'!$A$17:$I$119,9,FALSE)","v":312493.49210327829},246692.51210327831,3.7490704865380167,230770.04210327828,2.82379221757376]
[5625,"Administrative Expense Transferred - Credit",{"$f":"VLOOKUP(A92,'App.2-G_Detailed_OM&A_Expenses'!$A$17:$I$119,3,FALSE)","v":0},{"$f":"VLOOKUP(A92,'App.2-G_Detailed_OM&A_Expenses'!$A$17:$I$119,5,FALSE)","v":0},{"$f":"VLOOKUP(A92,'App.2-G_Detailed_OM&A_Expenses'!$A$17:$I$119,9,FALSE)","v":0},0,"",0,""]
[5630,"Outside Services Employed",{"$f":"VLOOKUP(A93,'App.2-G_Detailed_OM&A_Expenses'!$A$17:$I$119,3,FALSE)","v":60163},{"$f":"VLOOKUP(A93,'App.2-G_Detailed_OM&A_Expenses'!$A$17:$I$119,5,FALSE)","v":53650},{"$f":"VLOOKUP(A93,'App.2-G_Detailed_OM&A_Expenses'!$A$17:$I$119,9,FALSE)","v":0},-60163,-1,-53650,-1]
[5635,"Property Insurance",{"$f":"VLOOKUP(A94,'App.2-G_Detailed_OM&A_Expenses'!$A$17:$I$119,3,FALSE)","v":0},{"$f":"VLOOKUP(A94,'App.2-G_Detailed_OM&A_Expenses'!$A$17:$I$119,5,FALSE)","v":0},{"$f":"VLOOKUP(A94,'App.2-G_Detailed_OM&A_Expenses'!$A$17:$I$119,9,FALSE)","v":0},0,"",0,""]
[5640,"Injuries and Damages",{"$f":"VLOOKUP(A95,'App.2-G_Detailed_OM&A_Expenses'!$A$17:$I$119,3,FALSE)","v":314078.73},{"$f":"VLOOKUP(A95,'App.2-G_Detailed_OM&A_Expenses'!$A$17:$I$119,5,FALSE)","v":17883.669999999998},{"$f":"VLOOKUP(A95,'App.2-G_Detailed_OM&A_Expenses'!$A$17:$I$119,9,FALSE)","v":0},-314078.73,-1,-17883.669999999998,-1]
[5645,"OMERS Pensions and Benefits",{"$f":"VLOOKUP(A96,'App.2-G_Detailed_OM&A_Expenses'!$A$17:$I$119,3,FALSE)","v":0},{"$f":"VLOOKUP(A96,'App.2-G_Detailed_OM&A_Expenses'!$A$17:$I$119,5,FALSE)","v":1280544},{"$f":"VLOOKUP(A96,'App.2-G_Detailed_OM&A_Expenses'!$A$17:$I$119,9,FALSE)","v":0},0,"",-1280544,-1]
[5646,"Employee Pensions and OPEB",{"$f":"VLOOKUP(A97,'App.2-G_Detailed_OM&A_Expenses'!$A$17:$I$119,3,FALSE)","v":0},{"$f":"VLOOKUP(A97,'App.2-G_Detailed_OM&A_Expenses'!$A$17:$I$119,5,FALSE)","v":0},{"$f":"VLOOKUP(A97,'App.2-G_Detailed_OM&A_Expenses'!$A$17:$I$119,9,FALSE)","v":0},{"$f":"E97-C97","v":0},{"$f":"IF(C97=0,\"\",(E97/C97)-1)","v":""},{"$f":"E97-D97","v":0},{"$f":"IF(D97=0,\"\",(E97/D97)-1)","v":""}]
[5647,"Employee Sick Leave",{"$f":"VLOOKUP(A98,'App.2-G_Detailed_OM&A_Expenses'!$A$17:$I$119,3,FALSE)","v":0},{"$f":"VLOOKUP(A98,'App.2-G_Detailed_OM&A_Expenses'!$A$17:$I$119,5,FALSE)","v":0},{"$f":"VLOOKUP(A98,'App.2-G_Detailed_OM&A_Expenses'!$A$17:$I$119,9,FALSE)","v":0},0,"",0,""]
[5650,"Franchise Requirements",{"$f":"VLOOKUP(A99,'App.2-G_Detailed_OM&A_Expenses'!$A$17:$I$119,3,FALSE)","v":0},{"$f":"VLOOKUP(A99,'App.2-G_Detailed_OM&A_Expenses'!$A$17:$I$119,5,FALSE)","v":0},{"$f":"VLOOKUP(A99,'App.2-G_Detailed_OM&A_Expenses'!$A$17:$I$119,9,FALSE)","v":0},0,"",0,""]
[5655,"Regulatory Expenses",{"$f":"VLOOKUP(A100,'App.2-G_Detailed_OM&A_Expenses'!$A$17:$I$119,3,FALSE)","v":553280.79},{"$f":"VLOOKUP(A100,'App.2-G_Detailed_OM&A_Expenses'!$A$17:$I$119,5,FALSE)","v":275241.37},{"$f":"VLOOKUP(A100,'App.2-G_Detailed_OM&A_Expenses'!$A$17:$I$119,9,FALSE)","v":486839.3845379983},-66441.405462001741,-0.12008623227638493,211598.0145379983,0.76877256692189233]
[5660,"General Advertising Expenses",{"$f":"VLOOKUP(A101,'App.2-G_Detailed_OM&A_Expenses'!$A$17:$I$119,3,FALSE)","v":49394.94},{"$f":"VLOOKUP(A101,'App.2-G_Detailed_OM&A_Expenses'!$A$17:$I$119,5,FALSE)","v":34408.25},{"$f":"VLOOKUP(A101,'App.2-G_Detailed_OM&A_Expenses'!$A$17:$I$119,9,FALSE)","v":52869.226127386515},3474.2861273865128,7.0336883239184189E-2,18460.976127386515,0.53652760972692648]
[5665,"Miscellaneous General Expenses",{"$f":"VLOOKUP(A102,'App.2-G_Detailed_OM&A_Expenses'!$A$17:$I$119,3,FALSE)","v":319088.65999999997},{"$f":"VLOOKUP(A102,'App.2-G_Detailed_OM&A_Expenses'!$A$17:$I$119,5,FALSE)","v":380098.41},{"$f":"VLOOKUP(A102,'App.2-G_Detailed_OM&A_Expenses'!$A$17:$I$119,9,FALSE)","v":551027.94400000002},231939.28400000004,0.72688037237048797,170929.53400000004,0.44969810318333092]
[5670,"Rent",{"$f":"VLOOKUP(A103,'App.2-G_Detailed_OM&A_Expenses'!$A$17:$I$119,3,FALSE)","v":185789.6},{"$f":"VLOOKUP(A103,'App.2-G_Detailed_OM&A_Expenses'!$A$17:$I$119,5,FALSE)","v":313629.27},{"$f":"VLOOKUP(A103,'App.2-G_Detailed_OM&A_Expenses'!$A$17:$I$119,9,FALSE)","v":62000},{"$f":"E103-C103","v":-123789.6},{"$f":"IF(C103=0,\"\",(E103/C103)-1)","v":-0.66628917872690407},{"$f":"E103-D103","v":-251629.27000000002},-0.80231436944644874]
[5672,"Lease Payment Charge",{"$f":"VLOOKUP(A104,'App.2-G_Detailed_OM&A_Expenses'!$A$17:$I$119,3,FALSE)","v":0},{"$f":"VLOOKUP(A104,'App.2-G_Detailed_OM&A_Expenses'!$A$17:$I$119,5,FALSE)","v":0},{"$f":"VLOOKUP(A104,'App.2-G_Detailed_OM&A_Expenses'!$A$17:$I$119,9,FALSE)","v":0},0,"",0]
[5675,"Maintenance of General Plant",{"$f":"VLOOKUP(A105,'App.2-G_Detailed_OM&A_Expenses'!$A$17:$I$119,3,FALSE)","v":967442.91},{"$f":"VLOOKUP(A105,'App.2-G_Detailed_OM&A_Expenses'!$A$17:$I$119,5,FALSE)","v":1143724.06},{"$f":"VLOOKUP(A105,'App.2-G_Detailed_OM&A_Expenses'!$A$17:$I$119,9,FALSE)","v":34797.578848995443},-932645.33115100465,-0.96403138780665054,-1108926.4811510046,-0.96957519731726594]
[5680,"Electrical Safety Authority Fees",{"$f":"VLOOKUP(A106,'App.2-G_Detailed_OM&A_Expenses'!$A$17:$I$119,3,FALSE)","v":0},{"$f":"VLOOKUP(A106,'App.2-G_Detailed_OM&A_Expenses'!$A$17:$I$119,5,FALSE)","v":0},{"$f":"VLOOKUP(A106,'App.2-G_Detailed_OM&A_Expenses'!$A$17:$I$119,9,FALSE)","v":0},0,"",0,""]
[5681,"Special Purpose Charge Expense",{"$f":"VLOOKUP(A107,'App.2-G_Detailed_OM&A_Expenses'!$A$17:$I$119,3,FALSE)","v":0},{"$f":"VLOOKUP(A107,'App.2-G_Detailed_OM&A_Expenses'!$A$17:$I$119,5,FALSE)","v":138035.79999999999},{"$f":"VLOOKUP(A107,'App.2-G_Detailed_OM&A_Expenses'!$A$17:$I$119,9,FALSE)","v":0},0,"",-138035.79999999999,-1]
[5685,"Independent Electricity System Operator Fees and Penalties",{"$f":"VLOOKUP(A108,'App.2-G_Detailed_OM&A_Expenses'!$A$17:$I$119,3,FALSE)","v":0},{"$f":"VLOOKUP(A108,'App.2-G_Detailed_OM&A_Expenses'!$A$17:$I$119,5,FALSE)","v":0},{"$f":"VLOOKUP(A108,'App.2-G_Detailed_OM&A_Expenses'!$A$17:$I$119,9,FALSE)","v":0},0,"",0,""]
[5695,"OM&A Contra Account",{"$f":"VLOOKUP(A109,'App.2-G_Detailed_OM&A_Expenses'!$A$17:$I$119,3,FALSE)","v":0},{"$f":"VLOOKUP(A109,'App.2-G_Detailed_OM&A_Expenses'!$A$17:$I$119,5,FALSE)","v":0},{"$f":"VLOOKUP(A109,'App.2-G_Detailed_OM&A_Expenses'!$A$17:$I$119,9,FALSE)","v":0},0,"",0,""]
[6205,"Donations",{"$f":"VLOOKUP(A110,'App.2-G_Detailed_OM&A_Expenses'!$A$17:$I$119,3,FALSE)","v":202000},{"$f":"VLOOKUP(A110,'App.2-G_Detailed_OM&A_Expenses'!$A$17:$I$119,5,FALSE)","v":0},{"$f":"VLOOKUP(A110,'App.2-G_Detailed_OM&A_Expenses'!$A$17:$I$119,9,FALSE)","v":0},{"$f":"E110-C110","v":-202000},{"$f":"IF(C110=0,\"\",(E110/C110)-1)","v":-1},{"$f":"E110-D110","v":0},{"$f":"IF(D110=0,\"\",(E110/D110)-1)","v":""}]
[6205,"Donations, Sub-account LEAP Funding",{"$f":"'App.2-G_Detailed_OM&A_Expenses'!C110","v":0},{"$f":"'App.2-G_Detailed_OM&A_Expenses'!E110","v":27000},{"$f":"'App.2-G_Detailed_OM&A_Expenses'!I110","v":27000},27000,"",0,0]
["Total - Administrative and General Expenses",null,{"$f":"SUM(C88:C111)","v":4145844.2600000002},{"$f":"SUM(D88:D111)","v":5094899.42},{"$f":"SUM(E88:E111)","v":3261092.9444727036},-884751.31552729663,-0.21340679003877883,-1833806.4755272963,-0.359929867963379]
["Total OM&A",null,{"$f":"C112+C85+C73+C62+C41","v":11636818.07},{"$f":"D112+D85+D73+D62+D41","v":13117276.84},{"$f":"E112+E85+E73+E62+E41","v":15564617.468510892},3927799.3985108919,0.33753207920615802,2447340.6285108924,0.18657383375853898]
["Adjustments for non-recoverable items"]
[5681,"Special Purpose Charge Expense",{"$f":"'App.2-G_Detailed_OM&A_Expenses'!C114","v":0},{"$f":"'App.2-G_Detailed_OM&A_Expenses'!E114","v":138035.79999999999},{"$f":"'App.2-G_Detailed_OM&A_Expenses'!G114","v":0},{"$f":"E115-C115","v":0},{"$f":"IF(C115=0,\"\",(E115/C115)-1)","v":""},{"$f":"E115-D115","v":-138035.79999999999},{"$f":"IF(D115=0,\"\",(E115/D115)-1)","v":-1}]
[6205,"Donations1",{"$f":"'App.2-G_Detailed_OM&A_Expenses'!C115","v":202000},null,null,{"$f":"E116-C116","v":-202000},{"$f":"IF(C116=0,\"\",(E116/C116)-1)","v":-1},{"$f":"E116-D116","v":0},{"$f":"IF(D116=0,\"\",(E116/D116)-1)","v":""}]
[null,null,null,null,null,{"$f":"E117-C117","v":0},{"$f":"IF(C117=0,\"\",(E117/C117)-1)","v":""},{"$f":"E117-D117","v":0},{"$f":"IF(D117=0,\"\",(E117/D117)-1)","v":""}]
[null,null,null,null,null,{"$f":"E118-C118","v":0},{"$f":"IF(C118=0,\"\",(E118/C118)-1)","v":""},{"$f":"E118-D118","v":0},{"$f":"IF(D118=0,\"\",(E118/D118)-1)","v":""}]
[null,null,null,null,null,{"$f":"E119-C119","v":0},{"$f":"IF(C119=0,\"\",(E119/C119)-1)","v":""},{"$f":"E119-D119","v":0},{"$f":"IF(D119=0,\"\",(E119/D119)-1)","v":""}]
["Total Recoverable OM&A",null,{"$f":"C113-SUM(C115:C119)","v":11434818.07},{"$f":"D113-SUM(D115:D119)","v":12979241.039999999},15564617.468510892,4129799.3985108919,{"$f":"IF(C120=0,\"\",(E120/C120)-1)","v":0.36116004410649016},2585376.4285108922,{"$f":"IF(D120=0,\"\",(E120/D120)-1)","v":0.199193190152118}]
[]
["1 Account 6205 - Donations is generally non-recoverable.  However, the sub-account LEAP funding of account 6205 is generally recoverable."]
[]
[]
["Note:"]
[]
[1,"If the applicant is adopting IFRS or an alternate accounting standard as of January 1, 2013 for financial reporting purposes, Column D \"Most Current Actual Year\" must be provided on CGAAP."]
[2,"If the applicant is adopting IFRS or an alternate accounting standard as of January 1, 2012 for financial reporting purposes, Column D \"Most Current Actual Year\" must be provided on that standard."]

{"sheet":"App.2-I_OM&A_Summary_Analys","index":17,"n_rows":59,"n_cols":12,"rows_kept":59,"cut":false,"hidden":false,"merged":[[61,1,62,5],[56,0,57,11],[8,0,8,6],[9,0,9,6],[12,7,12,8]]}
[null,null,null,null,null,null,null,null,null,null,"File Number:",{"$f":"'LDC Info'!$E$18","v":"EB-2012-0126"}]
[null,null,null,null,null,null,null,null,null,null,"Exhibit:",4]
[null,null,null,null,null,null,null,null,null,null,"Tab:",2]
[null,null,null,null,null,null,null,null,null,null,"Schedule:",1]
[null,null,null,null,null,null,null,null,null,null,"Attachment:",1]
[]
[null,null,null,null,null,null,null,null,null,null,"Date:","9 November, 2012"]
[]
["Appendix 2-I"]
["Summary of Recoverable OM&A Expenses"]
[]
[]
[null,{"$f":"\"Last Rebasing Year (\" & 'LDC Info'!E30 & \" BA)\"","v":"Last Rebasing Year (2009 BA)"},{"$f":"\"Last Rebasing Year (\" & 'LDC Info'!E30 & \" Actuals)\"","v":"Last Rebasing Year (2009 Actuals)"},{"$f":"'LDC Info'!E26 -2 & \" Actuals\"","v":"2010 Actuals"},{"$f":"'LDC Info'!E26 -1 & \" Actuals\"","v":"2011 Actuals"},{"$f":"'LDC Info'!E26 & \" Bridge Year\"","v":"2012 Bridge Year"},{"$f":"'LDC Info'!E28 & \" Test Year\"","v":"2013 Test Year"}]
["Reporting Basis","CGAAP","CGAAP","CGAAP","CGAAP","CGAAP","CGAAP"]
["Operations",3571216,{"$f":"'App.2-G_Detailed_OM&A_Expenses'!C40","v":3652054.2599999993},{"$f":"'App.2-G_Detailed_OM&A_Expenses'!D40","v":3432872},{"$f":"'App.2-G_Detailed_OM&A_Expenses'!E40","v":3763302.28},{"$f":"'App.2-G_Detailed_OM&A_Expenses'!G40","v":5156619.1423075879},{"$f":"'App.2-G_Detailed_OM&A_Expenses'!I40","v":6914732.0640692236}]
["Maintenance",1745098,{"$f":"'App.2-G_Detailed_OM&A_Expenses'!C61","v":1502331.25},{"$f":"'App.2-G_Detailed_OM&A_Expenses'!D61","v":1681643},{"$f":"'App.2-G_Detailed_OM&A_Expenses'!E61","v":1497531.44},{"$f":"'App.2-G_Detailed_OM&A_Expenses'!G61","v":2339511.8836078169},{"$f":"'App.2-G_Detailed_OM&A_Expenses'!I61","v":2163819.8289869991}]
["SubTotal",{"$f":"SUM(B15:B16)","v":5316314},{"$f":"SUM(C15:C16)","v":5154385.51},5114515,5260833.72,7496131.0259154048,9078551.8930562232]
["%Change (year over year)",null,null,{"$f":"IF(ISERROR((D17-C17)/C17), \"\", (D17-C17)/C17)","v":-7.7352596003242638E-3},{"$f":"IF(ISERROR((E17-D17)/D17), \"\", (E17-D17)/D17)","v":2.8608522997781754E-2},0.42489411847736658,0.21109834682319709]
["%Change (Test Year vs \nLast Rebasing Year - Actual)",null,null,null,null,null,{"$f":"IF(ISERROR((G17-C17)/C17), \"\", (G17-C17)/C17)","v":0.76132574395977293}]
["Billing and Collecting",2515358,{"$f":"'App.2-G_Detailed_OM&A_Expenses'!C72","v":2194104.2200000002},{"$f":"'App.2-G_Detailed_OM&A_Expenses'!D72","v":1937276},{"$f":"'App.2-G_Detailed_OM&A_Expenses'!E72","v":2321708.0499999998},{"$f":"'App.2-G_Detailed_OM&A_Expenses'!G72","v":1779703.4210621696},{"$f":"'App.2-G_Detailed_OM&A_Expenses'!I72","v":3146864.4611280267}]
["Community Relations",206736,{"$f":"'App.2-G_Detailed_OM&A_Expenses'!C84","v":142484.07999999999},{"$f":"'App.2-G_Detailed_OM&A_Expenses'!D84","v":343169},{"$f":"'App.2-G_Detailed_OM&A_Expenses'!E84","v":439835.65},{"$f":"'App.2-G_Detailed_OM&A_Expenses'!G84","v":0},{"$f":"'App.2-G_Detailed_OM&A_Expenses'!I84","v":78108.169853940824}]
["Administrative and General",3631137,{"$f":"'App.2-G_Detailed_OM&A_Expenses'!C111","v":4145844.2600000002},{"$f":"'App.2-G_Detailed_OM&A_Expenses'!D111","v":744920.6},{"$f":"'App.2-G_Detailed_OM&A_Expenses'!E111","v":5094899.42},{"$f":"'App.2-G_Detailed_OM&A_Expenses'!G111","v":3047168.9053492961},{"$f":"'App.2-G_Detailed_OM&A_Expenses'!I111","v":3261092.9444727036}]
["SubTotal",{"$f":"SUM(B20:B22)","v":6353231},{"$f":"SUM(C20:C22)","v":6482432.5600000005},3025365.6,7856443.1199999992,4826872.3264114652,6486065.5754546709]
["%Change (year over year)",null,null,{"$f":"IF(ISERROR((D23-C23)/C23), \"\", (D23-C23)/C23)","v":-0.53329779029741264},{"$f":"IF(ISERROR((E23-D23)/D23), \"\", (E23-D23)/D23)","v":1.596857424438223},{"$f":"IF(ISERROR((F23-E23)/E23), \"\", (F23-E23)/E23)","v":-0.38561607935227238},{"$f":"IF(ISERROR((G23-F23)/F23), \"\", (G23-F23)/F23)","v":0.34374086092240436}]
["%Change (Test Year vs \nLast Rebasing Year - Actual)",null,null,null,null,null,{"$f":"IF(ISERROR((G23-C23)/C23), \"\", (G23-C23)/C23)","v":5.6044014666469801E-4}]
["Total",{"$f":"SUM(B23,B17)","v":11669545},{"$f":"SUM(C23,C17)","v":11636818.07},8139880.5999999996,13117276.84,12323003.35232687,15564617.468510894]
["%Change (year over year)",null,null,{"$f":"IF(ISERROR((D26-C26)/C26), \"\", (D26-C26)/C26)","v":-0.30050632818735823},{"$f":"IF(ISERROR((E26-D26)/D26), \"\", (E26-D26)/D26)","v":0.61148270897241419},{"$f":"IF(ISERROR((F26-E26)/E26), \"\", (F26-E26)/E26)","v":-6.0551705766479037E-2},{"$f":"IF(ISERROR((G26-F26)/F26), \"\", (G26-F26)/F26)","v":0.26305390199962347}]
[]
[]
[null,{"$f":"B13","v":"Last Rebasing Year (2009 BA)"},{"$f":"C13","v":"Last Rebasing Year (2009 Actuals)"},"2010 Actuals","2011 Actuals","2012 Bridge Year","2013 Test Year"]
["Operations",{"$f":"B15","v":3571216},{"$f":"C15","v":3652054.2599999993},3432872,3763302.28,5156619.1423075879,6914732.0640692236]
["Maintenance",{"$f":"B16","v":1745098},{"$f":"C16","v":1502331.25},1681643,1497531.44,2339511.8836078169,2163819.8289869991]
["Billing and Collecting",{"$f":"B20","v":2515358},{"$f":"C20","v":2194104.2200000002},1937276,2321708.0499999998,1779703.4210621696,3146864.4611280267]
["Community Relations",{"$f":"B21","v":206736},{"$f":"C21","v":142484.07999999999},343169,439835.65,0,78108.169853940824]
["Administrative and General",{"$f":"B22","v":3631137},{"$f":"C22","v":4145844.2600000002},744920.6,5094899.42,3047168.9053492961,3261092.9444727036]
["Total",{"$f":"SUM(B31:B35)","v":11669545},{"$f":"SUM(C31:C35)","v":11636818.07},8139880.5999999996,13117276.84,12323003.35232687,15564617.468510894]
["%Change (year over year)",null,null,{"$f":"IF(ISERROR((D36-C36)/C36), \"\", (D36-C36)/C36)","v":-0.30050632818735823},{"$f":"IF(ISERROR((E36-D36)/D36), \"\", (E36-D36)/D36)","v":0.61148270897241419},{"$f":"IF(ISERROR((F36-E36)/E36), \"\", (F36-E36)/E36)","v":-6.0551705766479037E-2},{"$f":"IF(ISERROR((G36-F36)/F36), \"\", (G36-F36)/F36)","v":0.26305390199962347}]
[]
[]
[null,{"$f":"B13","v":"Last Rebasing Year (2009 BA)"},{"$f":"C13","v":"Last Rebasing Year (2009 Actuals)"},{"$f":"\"Variance \" & 'LDC Info'!E30 & \"  BA – \" & 'LDC Info'!E30 & \" Actuals\"","v":"Variance 2009  BA – 2009 Actuals"},{"$f":"D13","v":"2010 Actuals"},{"$f":"\"Variance \" & 'LDC Info'!E26 -2 & \" Actuals vs. \" &  'LDC Info'!E30 & \" Actuals\"","v":"Variance 2010 Actuals vs. 2009 Actuals"},{"$f":"E13","v":"2011 Actuals"},{"$f":"\"Variance \" & 'LDC Info'!E26 -1 & \" Actuals vs. \" &  'LDC Info'!E26-2 & \" Actuals\"","v":"Variance 2011 Actuals vs. 2010 Actuals"},{"$f":"F13","v":"2012 Bridge Year"},{"$f":"\"Variance \" & 'LDC Info'!E26 & \" Bridge vs. \" & 'LDC Info'!E26 -1 & \" Actuals\"","v":"Variance 2012 Bridge vs. 2011 Actuals"},{"$f":"G13","v":"2013 Test Year"},{"$f":"\"Variance \" & 'LDC Info'!E28 & \" Test vs. \" & 'LDC Info'!E26 & \" Bridge\"","v":"Variance 2013 Test vs. 2012 Bridge"}]
["Operations",{"$f":"B15","v":3571216},3652054.2599999993,{"$f":"B41-C41","v":-80838.259999999311},{"$f":"D15","v":3432872},{"$f":"E41-C41","v":-219182.25999999931},{"$f":"E15","v":3763302.28},{"$f":"G41-E41","v":330430.2799999998},{"$f":"F15","v":5156619.1423075879},{"$f":"I41-G41","v":1393316.8623075881},{"$f":"G15","v":6914732.0640692236},{"$f":"K41-I41","v":1758112.9217616357}]
["Maintenance ",1745098,1502331.25,{"$f":"B42-C42","v":242766.75},{"$f":"D16","v":1681643},{"$f":"E42-C42","v":179311.75},{"$f":"E16","v":1497531.44},{"$f":"G42-E42","v":-184111.56000000006},{"$f":"F16","v":2339511.8836078169},841980.44360781694,{"$f":"G16","v":2163819.8289869991},-175692.05462081777]
["Billing and Collecting ",{"$f":"B20","v":2515358},2194104.2200000002,321253.7799999998,{"$f":"D20","v":1937276},-256828.2200000002,{"$f":"E20","v":2321708.0499999998},384432.04999999981,{"$f":"F20","v":1779703.4210621696},-542004.62893783022,{"$f":"G20","v":3146864.4611280267},1367161.0400658571]
["Community Relations ",206736,142484.07999999999,64251.920000000013,{"$f":"D21","v":343169},200684.92,{"$f":"E21","v":439835.65},96666.650000000023,{"$f":"F21","v":0},-439835.65,{"$f":"G21","v":78108.169853940824},78108.169853940824]
["Administrative and General ",3631137,4145844.2600000002,-514707.26000000024,744920.6,-3400923.66,5094899.42,4349978.82,3047168.9053492961,-2047730.5146507039,3261092.9444727036,213924.03912340757]
["Total OM&A Expenses ",{"$f":"SUM(B41:B45)","v":11669545},{"$f":"SUM(C41:C45)","v":11636818.07},32726.930000000284,8139880.5999999996,-3496937.4699999997,13117276.84,4977396.24,12323003.35232687,-794273.48767312896,15564617.468510894,3241614.1161840232]
["Variance from previous year ",null,null,null,{"$f":"E46-C46","v":-3496937.4700000007},null,{"$f":"G46-E46","v":4977396.24},null,{"$f":"I46-G46","v":-794273.48767312989},null,{"$f":"K46-I46","v":3241614.1161840241}]
["Percent change (year over year) ",null,null,null,{"$f":"IF(ISERROR(E47/C46), \"\", E47/C46)","v":-0.30050632818735823},null,{"$f":"IF(ISERROR(G47/E46), \"\", G47/E46)","v":0.61148270897241419},null,{"$f":"IF(ISERROR(I47/G46), \"\", I47/G46)","v":-6.0551705766479037E-2},null,{"$f":"IF(ISERROR(K47/I46), \"\", K47/I46)","v":0.26305390199962347}]
["Percent Change:                                                    Test year vs. Most Current Actual ",null,null,null,null,null,{"$f":"IF(ISERROR((K46-G46)/G46), \"\", (K46-G46)/G46)","v":0.18657383375853903}]
["Simple average of % variance for all years",null,null,null,null,null,{"$f":"IF(ISERROR((K46-C46)/C46), \"\", (K46-C46)/C46)","v":0.33753207920615824},null,null,null,null,{"$f":"IF(ISERROR(AVERAGE(E48,G48,I48,K48)), \"\", AVERAGE(E48,G48,I48,K48))","v":0.12836964425455011}]
["Compound Annual Growth Rate for all years",null,null,null,null,null,{"$f":"IF(ISERROR((K47-C47)/C47), \"\", (K47-C47)/C47)","v":""},null,null,null,null,{"$f":"IF((K46-C46)=0, \"\", (K46-C46)^(1/5)-1)","v":19.836744183998302}]
[{"$f":"\"Compound Growth Rate                                                            (\" & E13 & \" vs. \" & 'LDC Info'!E30 & \" Actuals)\"","v":"Compound Growth Rate                                                            (2011 Actuals vs. 2009 Actuals)"},null,null,null,null,null,{"$f":"IF(ISERROR((G46/C46)^(1/(2010-2008)) - 1), \"\", (G46-C46)/C46)","v":0.12722195716169682}]
[]
["Note:"]
[]
["1     \"BA\" = Board-Approved"]
["2     If it has been more than three years since the applicant last filed a cost of service application, additional years of historical actuals should be incorporated into the table, as necessary, to go back to the last cost of service application.  If the applicant last filed a cost of service application less than three years ago, a minimum of three years of actual information is required."]
[]
["3     Recoverable OM&A that is included on these tables should be identical to the recoverable OM&A that is shown for the corresponding periods on Appendix 2-H."]

{"sheet":"App.2-J_OM&A_Cost _Drivers","index":18,"n_rows":45,"n_cols":7,"rows_kept":45,"cut":false,"hidden":false,"merged":[[9,1,9,6],[10,1,10,6],[40,2,43,6],[44,2,45,6],[14,0,14,1],[13,0,13,1],[12,0,12,1],[33,0,33,1]]}
[null,null,null,null,null,"File Number:",{"$f":"'LDC Info'!$E$18","v":"EB-2012-0126"}]
[null,null,null,null,null,"Exhibit:",4]
[null,null,null,null,null,"Tab:",2]
[null,null,null,null,null,"Schedule:",2]
[null,null,null,null,null,"Attachment:",1]
[]
[null,null,null,null,null,"Date:","9 November, 2012"]
[]
[]
[null,"Appendix 2-J"]
[null,"OM&A Cost Driver Table"]
[]
["OM&A",null,{"$f":"\"Last Rebasing Year (\" & 'LDC Info'!E30 & \" Actuals)\"","v":"Last Rebasing Year (2009 Actuals)"},{"$f":"'LDC Info'!E26 -2 & \" Actuals\"","v":"2010 Actuals"},{"$f":"'LDC Info'!E26 -1 & \" Actuals\"","v":"2011 Actuals"},{"$f":"'LDC Info'!E26 & \" Bridge Year\"","v":"2012 Bridge Year"},{"$f":"'LDC Info'!E28 & \" Test Year\"","v":"2013 Test Year"}]
["Reporting Basis",null,"CGAAP","CGAAP","CGAAP","CGAAP","CGAAP"]
["Opening Balance",null,11669544.74,{"$f":"C34","v":11434818.07},{"$f":"D34","v":7907071},{"$f":"E34","v":12979241.039999999},{"$f":"F34","v":12323003.35232687}]
["A","Employee Future Benefit Obligation (gain)/loss",null,-2780264,4060808,-1280554]
["B","Accident Accrual",300000,-600000,300000]
["C","Bad Debt",null,null,360000,-300000,235000]
["D","General Wage Increase",null,228000,230000,240000,150000]
["E","OMERS Costs",null,null,123000,178000,121000]
["F","Differences in FTE complement",-100000,-110000,80000,null,147000]
["G","OM&A impact - burden change",null,null,null,null,984000]
["H","Smart Meter Costs",null,null,null,null,451326]
["I","Monthly Electric Billing - No Water",null,null,null,-245000,1228661]
["J","Increase in allocation to affiliates",null,null,null,null,-436588]
["K","Increase in Operations Maintenance",null,null,null,{"$f":"1000000","v":1000000},125000]
["L","BPISI Project",null,null,null,null,225000]
["M","Billing System Implementation Costs",-311250,-217000]
["N","Regulatory Compliance",230181,-345000]
["O","Right of Way",-130000,250000,-250000,136000]
["P","Workforce shift - Maintenance to Capital",-150000,null,113000]
["Q","CDM - Revenue/Expense Recognition",-150000,200000,null,-440000]
[null,"Miscellaneous",{"$f":"C34-C15-SUM(C16:C32)","v":76342.330000000075},{"$f":"D34-D15-SUM(D16:D32)","v":-153483.0700000003},55362.039999999106,55316.312326870859,11215.11618402414]
["Closing Balance",null,11434818.07,7907071,12979241.039999999,12323003.35232687,15564617.468510894]
[]
[null,"Notes:"]
[]
[null,1,"For each year, a detailed explanation for each cost driver and associated amount is"]
[null,null,"required."]
[null,2,"The closing balance for each year becomes the opening balance for the next year."]
[null,3,"If it has been more than three years since the applicant last filed a cost of service application, additional years of historical actuals should be incorporated into the table, as necessary, to go back to the last cost of service application.  If the applicant last filed a cost of service application less than three years ago, a minimum of three years of actual information is required."]
[]
[]
[]
[null,4,"Opening Balance for \"Last Rebasing Year\" (cell B15) should be equal to the Board-Approved amount."]

{"sheet":"App.2-K_Employee Costs","index":19,"n_rows":94,"n_cols":13,"rows_kept":94,"cut":false,"hidden":false,"merged":[[37,0,37,7],[43,0,43,7],[9,0,9,7],[73,0,73,7],[79,0,79,7],[49,0,49,7],[55,0,55,7],[61,0,61,7],[67,0,67,7],[8,0,8,7],[13,0,13,7],[19,0,19,7],[25,0,25,7],[31,0,31,7]]}
[null,null,null,null,null,null,"File Number:",{"$f":"'LDC Info'!$E$18","v":"EB-2012-0126"}]
[null,null,null,null,null,null,"Exhibit:",4]
[null,null,null,null,null,null,"Tab:",4]
[null,null,null,null,null,null,"Schedule:",1]
[null,null,null,null,null,null,"Page:",1]
[]
[null,null,null,null,null,null,"Date:","November 9, 2012"]
[]
["Appendix 2-K"]
["Employee Costs"]
[]
[null,{"$f":"\"Last Rebasing Year (\" & 'LDC Info'!E30 & \" Board-Approved)\"","v":"Last Rebasing Year (2009 Board-Approved)"},"LRY Board Approved Adjusted2",{"$f":"\"Last Rebasing Year (\" & 'LDC Info'!E30 & \" Actuals)\"","v":"Last Rebasing Year (2009 Actuals)"},{"$f":"'LDC Info'!E26 -2 & \" Actuals\"","v":"2010 Actuals"},{"$f":"'LDC Info'!E26 -1 & \" Actuals\"","v":"2011 Actuals"},{"$f":"'LDC Info'!E26 & \" Bridge Year\"","v":"2012 Bridge Year"},{"$f":"'LDC Info'!E28 & \" Test Year\"","v":"2013 Test Year"}]
["Reporting Basis","CGAAP","CGAAP","CGAAP","CGAAP","CGAAP","CGAAP","CGAAP"]
["Number of Employees (FTEs including Part-Time)1"]
["Executive",3,0,0,0,0,0,0]
["Management",12,15,13.962933333333334,13.759600000000001,15.0596,15.415731324120804,17.555851917131125]
["Non-Union",3,3,2.82,3.4366666666666665,3.8866666666666663,4.0789843524478249,4.571192685781158]
["Union",85,85,83.518946820002824,80.851683373460446,81.206630822034029,80.320819621046553,87.809128660768849]
["Total",{"$f":"SUM(B15:B18)","v":103},103,100.30188015333616,98.04795004012712,100.15289748870069,99.815535297615185,109.93617326368113]
["Number of Part-Time Employees - N/A GSHi does not employ part time employees, casual employees have been included above on an FTE basis"]
["Executive"]
["Management"]
["Non-Union"]
["Union"]
["Total",{"$f":"SUM(B21:B24)","v":0},0,0,0,0,0,0]
["Total Salary and Wages"]
["Executive",553837,0,0,0,0,0,0]
["Management",1491257,1612506,1703551.0268400002,1671424.9904639996,1842145.5526439999,1709940.2109955007,1947674.3808380081]
["Non-Union",236908,186859,177601.6122,226773.065,255719.2868,271335.92792213138,288716.1364496313]
["Union",6995159,5501964,5687267.0317579983,5748758.3887319984,5902674.4029179988,5529514.6790707894,6186363.0958731435]
["Total",{"$f":"SUM(B27:B30)","v":9277161},7301329,7568419.6707979981,7646956.4441959979,8000539.2423619982,7510790.8179884218,8422753.6131607834,null,{"$f":"D31*0.03","v":227052.59012393994},{"$f":"E31*0.03","v":229408.69332587993},{"$f":"F31*0.03","v":240016.17727085995},{"$f":"G31*0.02","v":150215.81635976845}]
["Current Benefits",null,null,null,null,null,null,null,null,{"$f":"C31-D31","v":-267090.67079799809}]
["Executive",117000,0,0,0,0,0,0]
["Management",315588,432588,413276.45974790584,382505.78909804497,447950.88062808081,429779.46070344845,494708.29107893846]
["Non-Union",50049,50049,37805.257795148667,47040.782700636075,55934.651256857273,79927.413752775698,86651.234144256625]
["Union",1493195,1493195,1142069.7692117528,1134199.7016286489,1270873.8166228503,1510101.401678998,1708899.1264639781]
["Total",{"$f":"SUM(B33:B36)","v":1975832},1975832,1593151.4867548072,1563746.27342733,1774759.3485077883,2019808.2761352221,2290258.6516871732]
["Accrued Pension and Post-Retirement Benefits"]
["Executive",0,0,0,0,0,0,0]
["Management",0,0,54041.506999090139,42565.696020607167,52386.343038036845,49776.72847893618,66555.976926662595]
["Non-Union",0,0,10914.400727934499,10631.421600735968,13520.163435582834,13170.863730865163,17329.845134162926]
["Union",0,0,257727.70473521395,208025.46986715737,242524.65692147255,227939.60243456886,227939.60243456886]
["Total",{"$f":"SUM(B39:B42)","v":0},0,322683.61246223858,261222.58748850052,308431.16339509224,290887.19464437023,311825.4244953944]
["Total Benefits (Current + Accrued)"]
["Executive",{"$f":"B33+B39","v":117000},{"$f":"C33+C39","v":0},0,0,0,{"$f":"G33+G39","v":0},0]
["Management",315588,{"$f":"C34+C40","v":432588},467317.96674699598,425071.48511865211,500337.22366611764,{"$f":"G34+G40","v":479556.18918238464},561264.26800560101]
["Non-Union",50049,{"$f":"C35+C41","v":50049},48719.65852308317,57672.204301372039,69454.814692440108,{"$f":"G35+G41","v":93098.277483640864},103981.07927841955]
["Union",1493195,{"$f":"C36+C42","v":1493195},1399797.4739469667,1342225.1714958062,1513398.4735443229,{"$f":"G36+G42","v":1738041.0041135668},1936838.7288985469]
["Total",1975832,{"$f":"C37+C43","v":1975832},1915835.0992170458,1824968.8609158304,2083190.5119028804,{"$f":"G37+G43","v":2310695.4707795922},2602084.0761825675]
["Total Compensation (Salary, Wages, & Benefits)"]
["Executive",{"$f":"B27+B45","v":670837},{"$f":"C27+C45","v":0},0,0,0,{"$f":"G27+G45","v":0},0]
["Management",1806845,{"$f":"C28+C46","v":2045094},2170868.9935869961,2096496.4755826518,2342482.7763101174,{"$f":"G28+G46","v":2189496.4001778853},2508938.6488436093]
["Non-Union",286957,{"$f":"C29+C47","v":236908},226321.27072308317,284445.26930137206,325174.1014924401,{"$f":"G29+G47","v":364434.20540577226},392697.21572805085]
["Union",8488354,{"$f":"C30+C48","v":6995159},7087064.5057049654,7090983.5602278048,7416072.8764623217,{"$f":"G30+G48","v":7267555.6831843564},8123201.8247716902]
["Total",11252993,{"$f":"C31+C49","v":9277161},9484254.7700150441,9471925.3051118292,10083729.754264878,{"$f":"G31+G49","v":9821486.2887680139},11024837.689343352]
["Compensation - Average Yearly Base Wages"]
["Executive",145612,0,0,0,0,0,0]
["Management",91603,102404.8,115347.86688417906,112763.70998342976,114300.17391338416,110921.77043329617,110941.60454483291]
["Non-Union",62287,62287,62513.256453900714,64190.346459747823,64786.135883361931,66520.463055785178,63159.913898990111]
["Union",61356,61356,61543.831966232938,64332.936358977146,63724.177612807711,68842.856748213322,70452.391342736009]
["Total"]
["Compensation - Average Yearly Overtime"]
["Executive",0,0,0,0,0,0,0]
["Management",6369,6369,6657.3727149500583,8709.6606424605361,8023.4968776063115,8849.0470548347093,6972.4186076571214]
["Non-Union",0,0,466.03865248226953,1795.9964112512125,1007.8487135506005,0,0]
["Union",3131,3131,6551.6990276504257,6769.5830799567711,8962.9212505084088,5685.8058492073669,5041.920684887702]
["Total"]
["Compensation - Average Yearly Incentive Pay N/A GSHi does not have incentive pay as part of its compensation"]
["Executive"]
["Management"]
["Non-Union"]
["Union"]
["Total"]
["Compensation - Average Yearly Benefits"]
["Executive",39000,0,0,0,0,0,0]
["Management",26299,28839.200000000001,33468.466517087814,30892.721090631421,33223.805656598954,27879.27810022077,28179.110499115031]
["Non-Union",16683,16683,17276.474653575595,16781.436751126686,17870.020932874817,19594.930219531423,18955.935595055547]
["Union",17567,17567,16760.238571539488,16601.078858135334,18636.390381235815,18800.871415451846,19461.520146338451]
["Total"]
[]
["Total Compensation",{"$f":"SUM(B51:B54)","v":11252993},9277161,9484254.7700150441,9471925.3051118292,10083729.75426488,9821486.2887680139,11024837.68934335]
["Total Compensation Capitalized (CGAAP)",3291810,1922860,1773437.2344548255,2061400.958260949,2212461.6527746432,2933495.5853046402,2373540.1263954244]
["Total Compensation Charged to OM&A (CGAAP)",{"$f":"B81-B82","v":7961183},7354301,7710817.5355602186,7410524.3468508804,7871268.1014902368,6887990.7034633737,{"$f":"H81-H82","v":8651297.5629479252}]
[]
["Total Compensation Capitalized (MIFRS)"]
["Total Compensation Charged to OM&A (MIFRS)",null,null,null,null,{"$f":"F81-F85","v":10083729.75426488},{"$f":"G81-G85","v":9821486.2887680139},{"$f":"H81-H85","v":11024837.68934335}]
[]
[]
["1 If an applicant wishes to use headcount, it must also file the same schedule on an FTE basis."]
["2 2009 Board approved figures have been adjusted to include executive figures with management figures for comparative purposes"]
["In addition, a calculation error from 2009 was noted, where the benefits were counted in Salary & Wages as well as recorded in Benefits, resulting in double counting in total compensation"]
["The total compensation capitalized was also calculated incorrectly in 2009 and has been corrected here."]
["Note:"]
["1   Please report compensation on a CGAAP and MIFRS basis for your transition year - GSHi has delayed transition to MIFRS to January 1, 2014.  The comparison has not been provided."]

{"sheet":"App.2-L_OM&A_per_Cust_FTEE","index":20,"n_rows":29,"n_cols":8,"rows_kept":29,"cut":false,"hidden":false,"merged":[[8,0,8,7],[9,0,9,7],[28,1,29,6],[22,1,25,6],[26,1,26,6],[27,1,27,6],[15,0,15,1],[16,0,16,1],[17,0,17,1],[18,0,18,1],[13,0,13,1],[14,0,14,1],[12,0,12,1]]}
[null,null,null,null,null,null,"File Number:",{"$f":"'LDC Info'!$E$18","v":"EB-2012-0126"}]
[null,null,null,null,null,null,"Exhibit:",4]
[null,null,null,null,null,null,"Tab:",2]
[null,null,null,null,null,null,"Schedule:",1]
[null,null,null,null,null,null,"Attachment:",3]
[]
[null,null,null,null,null,null,"Date:","9 November, 2012"]
[]
["Appendix 2-L"]
["Recoverable OM&A Cost per Customer and per FTEE"]
[]
[null,null,{"$f":"\"Last Rebasing Year (\" & 'LDC Info'!E30 & \" Board-Approved)\"","v":"Last Rebasing Year (2009 Board-Approved)"},{"$f":"\"Last Rebasing Year (\" & 'LDC Info'!E30 & \" Actuals)\"","v":"Last Rebasing Year (2009 Actuals)"},{"$f":"'LDC Info'!E26 -2 & \" Actuals\"","v":"2010 Actuals"},{"$f":"'LDC Info'!E26 -1 & \" Actuals\"","v":"2011 Actuals"},{"$f":"'LDC Info'!E26 & \" Bridge Year\"","v":"2012 Bridge Year"},{"$f":"'LDC Info'!E28 & \" Test Year\"","v":"2013 Test Year"}]
["Reporting Basis",null,"CGAAP","CGAAP","CGAAP","CGAAP","CGAAP","CGAAP"]
["Number of Customers",null,56751,56650,57011,57102,57256,57463]
["Total Recoverable OM&A from Appendix 2-I",null,{"$f":"'App.2-I_OM&A_Summary_Analys'!B26","v":11669545},{"$f":"'App.2-I_OM&A_Summary_Analys'!C26","v":11636818.07},{"$f":"'App.2-I_OM&A_Summary_Analys'!D26","v":8139880.5999999996},{"$f":"'App.2-I_OM&A_Summary_Analys'!E26","v":13117276.84},{"$f":"'App.2-I_OM&A_Summary_Analys'!F26","v":12323003.35232687},{"$f":"'App.2-I_OM&A_Summary_Analys'!G26","v":15564617.468510894}]
["OM&A cost per customer",null,{"$f":"IF(C14=0,\"\",C15/C14)","v":205.62712551320681},205.41602947925861,142.77736927961271,229.71659206332527,215.22641037318132,270.86329409378027]
["Number of FTEEs",null,{"$f":"'App.2-K_Employee Costs'!B19","v":103},{"$f":"'App.2-K_Employee Costs'!D19","v":100.30188015333616},{"$f":"'App.2-K_Employee Costs'!E19","v":98.04795004012712},{"$f":"'App.2-K_Employee Costs'!F19","v":100.15289748870069},{"$f":"'App.2-K_Employee Costs'!G19","v":99.815535297615185},{"$f":"'App.2-K_Employee Costs'!H19","v":109.93617326368113}]
["Customers/FTEEs",null,{"$f":"IF(C17=0,\"\",C14/C17)","v":550.98058252427188},564.7949960000401,581.4603974552009,570.14825763220961,573.61812296334972,522.69419877091229]
["OM&A Cost per FTEE",null,{"$f":"IF(C17=0,\"\",C15/C17)","v":113296.55339805825},116017.94554808199,83019.385888931603,130972.51471411398,123457.76953040389,141578.67248279846]
[]
["Notes:"]
[]
[1,"If it has been more than three years since the applicant last filed a cost of service application, additional years of historical actuals should be incorporated into the table, as necessary, to go back to the last cost of service application.  If the applicant last filed a cost of service application less than three years ago, a minimum of three years of actual information is required."]
[]
[]
[]
[2,"The method of calculating the number of customers must be identified."]
[3,"The method of calculating the number of FTEEs must be identified.  See also Appendix 2-K"]
[4,"The number of customers and the number of FTEEs should correspond to mid-year or average of January 1 and December 31 figures."]

{"sheet":"App.2-M_Regulatory_Costs","index":21,"n_rows":47,"n_cols":11,"rows_kept":47,"cut":false,"hidden":false,"merged":[[8,0,8,10],[9,0,9,10],[12,0,12,1],[13,0,13,1]]}
[null,null,null,null,null,null,null,null,null,"File Number:",{"$f":"'LDC Info'!$E$18","v":"EB-2012-0126"}]
[null,null,null,null,null,null,null,null,null,"Exhibit:",4]
[null,null,null,null,null,null,null,null,null,"Tab:",2]
[null,null,null,null,null,null,null,null,null,"Schedule:",3]
[null,null,null,null,null,null,null,null,null,"Attachment:",1]
[]
[null,null,null,null,null,null,null,null,null,"Date:","9 November, 2012"]
[]
["Appendix 2-M"]
["Regulatory Cost Schedule"]
[null,null,null,null,"On-Going"]
[null,null,null,null,"One-Time"]
["Regulatory Cost Category",null,"USoA Account","USoA Account Balance","Ongoing or One-time Cost? 2",{"$f":"\"Last Rebasing Year (\" & 'LDC Info'!E30 & \" Board Approved)\"","v":"Last Rebasing Year (2009 Board Approved)"},"Most Current Actuals               Year 2011",{"$f":"'LDC Info'!E26 & \" Bridge Year\"","v":"2012 Bridge Year"},"Annual % Change",{"$f":"'LDC Info'!E28 & \" Test Year\"","v":"2013 Test Year"},"Annual % Change"]
["(A)",null,"(B)","(C )","(D)","(E)","(F)","(G)","(H) = [(G)-(F)]/(F)","(I)","(J) = [(I)-(G)]/(G)"]
[1,"OEB Annual Assessment",5655,null,"On-Going",158100,150202,152000,{"$f":"IF(G15=0,\"\",(H15-G15)/G15)","v":1.1970546330940999E-2},160000,{"$f":"IF(H15=0,\"\",(J15-H15)/H15)","v":5.2631578947368418E-2}]
[2,"OEB Section 30 Costs (Applicant-originated)",5655,null,"On-Going",null,null,null,{"$f":"IF(G16=0,\"\",(H16-G16)/G16)","v":""},null,{"$f":"IF(H16=0,\"\",(J16-H16)/H16)","v":""}]
[3,"OEB Section 30 Costs (OEB-initiated)",5655,null,"On-Going",60000,6486,8000,0.23342584027135369,15000,0.875]
[4,"Expert Witness costs for regulatory matters",null,null,"One-Time",null,null,null,"",20000,""]
[5,"Legal costs for regulatory matters",5655,null,"One-Time",65000,null,40000,"",175000,3.375]
[6,"Consultants' costs for regulatory matters",5655,null,"One-Time",null,14500,22000,0.51724137931034486,8000,-0.63636363636363635]
[7,"Operating expenses associated with staff resources allocated to regulatory matters",5655,null,"On-Going",40000,54973,146927,1.6727120586469721,144339,-1.7614189359341715E-2]
[8,"Operating expenses associated with other resources allocated to regulatory matters 1",null,null,null,null,null,null,"",null,""]
[9,"Travel costs associated with cost of service related hearings/conferences",5655,null,"One-Time",null,null,null,null,40000]
[10,"Other regulatory agency fees or assessments",null,null,null,null,null,null,"",null,""]
[11,"Any other costs for regulatory matters (please define) - IESO Prudential Costs, Advertisements",5655,null,"On-Going",null,49080,52000,5.9494702526487364E-2,55000,5.7692307692307696E-2]
[12,"Intervenor costs",5655,null,"One-Time",null,null,null,"",145000,""]
[13,"Sub-total - Ongoing Costs 3",null,{"$f":"SUMIF($E15:$E26,$E11,D15:D26)","v":0},null,{"$f":"SUMIF($E15:$E26,$E11,F15:F26)","v":258100},{"$f":"SUMIF($E15:$E26,$E11,G15:G26)","v":260741},{"$f":"SUMIF($E15:$E26,$E11,H15:H26)","v":358927},0.37656525057432472,{"$f":"SUMIF($E15:$E26,$E11,J15:J26)","v":374339},4.2939093464687807E-2]
[14,"Sub-total - One-time Costs 4",null,{"$f":"SUMIF($E15:$E26,$E12,D15:D26)","v":0},null,{"$f":"SUMIF($E15:$E26,$E12,F15:F26)","v":65000},{"$f":"SUMIF($E15:$E26,$E12,G15:G26)","v":14500},{"$f":"SUMIF($E15:$E26,$E12,H15:H26)","v":62000},{"$f":"IF(G28=0,\"\",(H28-G28)/G28)","v":3.2758620689655173},{"$f":"SUMIF($E15:$E26,$E12,J15:J26)","v":388000},5.258064516129032]
[15,"Total",null,{"$f":"D27+D28","v":0},null,{"$f":"F27+F28","v":323100},{"$f":"G27+G28","v":275241},{"$f":"H27+H28","v":420927},0.52930341046573726,{"$f":"J27+J28","v":762339},0.81109551062298213]
[]
["1","Please identify the resources involved."]
["2","Where a category's costs include both one-time and ongoing costs, the applicant should prove a separate breakdown between one-time and ongoing costs."]
["3","Sum of all ongoing costs identified in rows 1 to 11 inclusive."]
["4","Sum of all one-time costs identified in rows 1 to 11 inclusive."]
[]
["Please fill out the following table for all one-time costs related to this cost of service application"]
[]
[null,null,{"$f":"H13","v":"2012 Bridge Year"},{"$f":"J13","v":"2013 Test Year"},"Total","2009 COS Actual"]
[4,"Expert Witness costs for regulatory matters",{"$f":"H18","v":0},{"$f":"J18","v":20000},{"$f":"C39+D39","v":20000}]
[5,{"$f":"B19","v":"Legal costs for regulatory matters"},{"$f":"H19","v":40000},{"$f":"J19","v":175000},{"$f":"C40+D40","v":215000},223719.44]
[6,"Consultants' costs for regulatory matters",{"$f":"H20","v":22000},{"$f":"J20","v":8000},{"$f":"C41+D41","v":30000},14293.95]
[7,"Operating expenses associated with staff resources allocated to regulatory matters",0,0,0]
[8,"Operating expenses associated with other resources allocated to regulatory matters 1",{"$f":"H22","v":0},{"$f":"J22","v":0},0]
[9,{"$f":"B23","v":"Travel costs associated with cost of service related hearings/conferences"},{"$f":"H23","v":0},{"$f":"J23","v":40000},40000,26971.23]
[12,"Intervenor costs",null,{"$f":"J26","v":145000},{"$f":"C45+D45","v":145000},140576.95000000001]
[null,"Total",{"$f":"SUM(C39:C45)","v":62000},{"$f":"SUM(D39:D45)","v":388000},{"$f":"C46+D46","v":450000},{"$f":"SUM(F39:F45)","v":405561.57}]
["Recovery of costs over 4 years, included in 2013 budget @ 25%",null,null,null,{"$f":"E46*0.25","v":112500},{"$f":"F46*0.25","v":101390.3925}]

{"sheet":"App.2-N_Corp_Cost_Allocation","index":22,"n_rows":182,"n_cols":7,"rows_kept":182,"cut":false,"hidden":false,"merged":[[8,0,8,6],[9,0,9,6],[11,2,11,3],[13,0,13,6],[32,0,32,6],[15,6,16,6],[16,0,17,0],[16,1,17,1],[15,2,17,2],[15,3,17,3],[15,0,15,1],[15,5,16,5],[34,0,34,1],[34,2,36,2],[34,3,36,3],[34,4,35,4],[34,5,35,5],[35,0,36,0],[35,1,36,1],[49,2,49,3],[51,0,51,6],[53,0,53,1],[53,2,55,2],[53,3,55,3],[53,5,54,5],[53,6,54,6],[54,0,55,0],[54,1,55,1],[70,0,70,6],[72,0,72,1],[72,2,74,2],[72,3,74,3],[72,4,73,4],[72,5,73,5],[73,0,74,0],[73,1,74,1],[85,2,85,3],[87,0,87,6],[89,0,89,1],[89,2,91,2],[89,3,91,3],[89,5,90,5],[89,6,90,6],[90,0,91,0],[90,1,91,1],[104,0,104,6],[106,0,106,1],[106,2,108,2],[106,3,108,3],[106,4,107,4],[106,5,107,5],[107,0,108,0],[107,1,108,1],[121,2,121,3],[123,0,123,6],[125,0,125,1],[125,2,127,2],[125,3,127,3],[125,5,126,5],[125,6,126,6],[126,0,127,0],[126,1,127,1],[140,0,140,6],[142,0,142,1],[142,2,144,2],[142,3,144,3],[142,4,143,4],[142,5,143,5],[143,0,144,0],[143,1,144,1],[157,2,157,3],[159,0,159,6],[161,0,161,1],[161,2,163,2],[161,3,163,3],[161,4,163,4],[161,5,162,5],[161,6,162,6],[162,0,163,0],[162,1,163,1],[176,0,176,6],[178,0,178,1],[178,2,180,2],[178,3,180,3],[178,4,179,4],[178,5,179,5],[179,0,180,0],[179,1,180,1]]}
[null,null,null,null,null,"File Number:",{"$f":"'LDC Info'!$E$18","v":"EB-2012-0126"}]
[null,null,null,null,null,"Exhibit:",4]
[null,null,null,null,null,"Tab:",5]
[null,null,null,null,null,"Schedule:",1]
[null,null,null,null,null,"Attachment:",1]
[]
[null,null,null,null,null,"Date:","9 November, 2012"]
[]
["Appendix 2-N"]
["Shared Services and Corporate Cost Allocation"]
[]
[null,"Year:",2013]
[]
["Shared Services"]
[]
["Name of Company",null,"Service Offered","Pricing Methdology",null,"Price for the Service","Cost for the Service"]
["From","To",null,null,"Percentage (%)"]
[null,null,null,null,null,"$","$"]
["Affiliate","Greater Sudbury","Corporate/Regulatory","Fully allocated (time tracking)",{"$f":"+F19/G19","v":0.8795123227460625},{"$f":"452133+388285","v":840418},{"$f":"524216+431334","v":955550}]
["Affiliate","Greater Sudbury","Accounting & Admin","Fully allocated (time tracking)",{"$f":"+F20/G20","v":0.76601113775218654},{"$f":"627980+145476","v":773456},{"$f":"833569+176150","v":1009719}]
["Affiliate","Greater Sudbury","Human Resources","number of employees",0.85869380527807837,288060,335463]
["Affiliate","Greater Sudbury","Quality Management","Full allocation as other affiliates have own programs",1,155842,155842]
["Affiliate","Greater Sudbury","Risk Management","50% to Greater Sudbury and number of employees  ",0.86520196332575483,244314,282378]
["Affiliate","Greater Sudbury","Billing & Customer Service","Fully allocated (time tracking)",0.9888366919202235,{"$f":"2928635+218229","v":3146864},{"$f":"2928635+253755","v":3182390}]
["Affiliate","Greater Sudbury","Stores/Procurement","Materials issues",0.89827625186358628,568175,632517]
["Affiliate","Greater Sudbury","IT Services & amortization","Fully allocated cost (including allocations to corporate services)",null,"$379,759 plus allocations from corp services",906585.92]
["Affiliate","Greater Sudbury","Telecommunication services","Preferred pricing",0,0,74544]
["Greater Sudbury","Affiliates","Garage/fleet services","Hourly chargeout rate based on full cost recovery",0.13432927295120572,{"$f":"1191103-1031103","v":160000},1191103]
["Greater Sudbury","Affiliates","Streetlight mtce services","Fully allocated cost (work order tracking)",{"$f":"+F29/G29","v":1},680000,680000]
["Greater Sudbury","Affiliates","Building Services/occupancy costs","Market rate applied to square footage ",2.6043738145870452,90627,34798]
["Greater Sudbury","Affiliates","Building Services/occupancy costs","cost recovery based on square footage - LDC and affiliate providing corp services",null,"$307,503 allocated to corp services - partial rediistribution to LDC and other affiliates",{"$f":"713018-34798","v":678220}]
[]
["Corporate Cost Allocation"]
[]
["Name of Company",null,"Service Offered","Pricing Methdology","% of Corporate Costs Allocated","Amount Allocated"]
["From","To"]
[null,null,null,null,"%","$"]
["Parent Company (GSU)","Greater Sudbury","Board of Directors","Number of Board members - weighted costing",0.5,44200]
[]
[]
[]
[]
[]
[]
[]
[]
[]
[]
[]
[null,"Year:",2012]
[]
["Shared Services"]
[]
["Name of Company",null,"Service Offered","Pricing Methdology",null,"Price for the Service","Cost for the Service"]
["From","To",null,null,"Percentage (%)"]
[null,null,null,null,null,"$","$"]
["Affiliate","Greater Sudbury","Corporate/Regulatory","Fully allocated (time tracking)",{"$f":"+F57/G57","v":0.80515669500272913},446961,555123]
["Affiliate","Greater Sudbury","Accounting & Admin","Fully allocated (time tracking)",{"$f":"+F58/G58","v":0.76698672951785618},748464,975850]
["Affiliate","Greater Sudbury","Human Resources","number of employees",0.90968412302576895,306418,336840]
["Affiliate","Greater Sudbury","Quality Management","Full allocation as other affiliates have own programs",1,153391,153391]
["Affiliate","Greater Sudbury","Risk Management","50% to Greater Sudbury and number of employees  ",0.86572278696925886,226364,261474]
["Affiliate","Greater Sudbury","Billing & Customer Service","Fully allocated (time tracking)",0.61945166148009756,1864481.5274152241,3009890.2680481845]
["Affiliate","Greater Sudbury","Stores/Procurement","Materials issues",0.80337667595149331,531845,662012]
["Affiliate","Greater Sudbury","IT Services & amortization","Fully allocated cost (including allocations to corporate services)",0.40576832413544467,438948,1081770]
["Affiliate","Greater Sudbury","Telecommunication services","Preferred pricing",0,null,37923]
["Greater Sudbury","Affiliates","Garage/fleet services","Hourly chargeout rate based on full cost recovery",0.89604750374577935,{"$f":"+G66-161724.2","v":1394026.8},1555751]
["Greater Sudbury","Affiliates","Streetlight mtce services","Fully allocated cost (work order tracking)",1,575212,575212]
["Greater Sudbury","Affiliates","Building Services/occupancy costs","Market rate applied to square footage ",{"$f":"+F68/G68","v":0.66597150959427098},60355,90627]
["Greater Sudbury","Affiliates","Building Services/occupancy costs","cost recovery based on square footage - LCD and affiliate providing corp services",null,"$337,682 plus allocations to corp services",648289]
[]
["Corporate Cost Allocation"]
[]
["Name of Company",null,"Service Offered","Pricing Methdology","% of Corporate Costs Allocated","Amount Allocated"]
["From","To"]
[null,null,null,null,"%","$"]
["Parent Company (GSU)","Greater Sudbury","Board of Directors","Number of Board members - weighted costing",0.5,44200]
[]
[]
[]
[]
[]
[]
[]
[]
[]
[null,"Year:",2011]
[]
["Shared Services"]
[]
["Name of Company",null,"Service Offered","Pricing Methdology",null,"Price for the Service","Cost for the Service"]
["From","To",null,null,"Percentage (%)"]
[null,null,null,null,null,"$","$"]
["Affiliate","Greater Sudbury","Corporate/Regulatory","% allocation",{"$f":"+F93/G93","v":0.96603904637602034},602422.44199999992,623600.51]
["Affiliate","Greater Sudbury","Accounting & Admin","% allocation",{"$f":"+F94/G94","v":0.91036919391421156},566725.26100000006,622522.44999999995]
["Affiliate","Greater Sudbury","Human Resources","% allocation",0.89795548322876706,228275.14500000002,254216.55]
["Affiliate","Greater Sudbury","Quality Management","n/a",null,0,0]
["Affiliate","Greater Sudbury","Risk Management","% allocation",0.92000000000000015,234617.84800000003,255019.4]
["Affiliate","Greater Sudbury","Billing & Customer Service","% allocation",0.70705482450752155,2141578.7442500005,3028872.2600000002]
["Affiliate","Greater Sudbury","Stores/Procurement","Materials issues",0.97241131984103124,345989.15,355805.35]
["Affiliate","Greater Sudbury","IT Services & amortization","% allocation",0.94412099949146777,507583.43000000005,537625.39999999991]
["Affiliate","Greater Sudbury","Telecommunication services","Preferred pricing",null,0,26513.97]
["Greater Sudbury","Affiliates","Garage/fleet services","Hourly chargeout rate based on full cost recovery",0.90851846696873084,{"$f":"1052584.47+118308.02-107115.04","v":1063777.45},1170892.49]
["Greater Sudbury","Affiliates","Building Services/occupancy costs",null,7.9999990165696602E-2,55316.57,691457.20999999985]
[]
["Corporate Cost Allocation"]
[]
["Name of Company",null,"Service Offered","Pricing Methdology","% of Corporate Costs Allocated","Amount Allocated"]
["From","To"]
[null,null,null,null,"%","$"]
["Parent Company (GSU)","Greater Sudbury","Board of Directors","% allocation",0.86368960581860899,56343.836500000005]
[]
[]
[]
[]
[]
[]
[]
[]
[]
[]
[]
[null,"Year:",2010]
[]
["Shared Services"]
[]
["Name of Company",null,"Service Offered","Pricing Methdology",null,"Price for the Service","Cost for the Service"]
["From","To",null,null,"Percentage (%)"]
[null,null,null,null,null,"$","$"]
["Affiliate","Greater Sudbury","Corporate/Regulatory","% allocation",{"$f":"+F129/G129","v":0.9074236819065794},415062.18000000005,457407.26]
["Affiliate","Greater Sudbury","Accounting & Admin","% allocation",{"$f":"+F130/G130","v":0.91620103563820021},521530.59060000005,569231.61]
["Affiliate","Greater Sudbury","Human Resources","% allocation",0.89854140993299836,201812.81400000001,224600.46000000002]
["Affiliate","Greater Sudbury","Quality Management","n/a",null,0,0]
["Affiliate","Greater Sudbury","Risk Management","% allocation",0.91999999999999993,230929.16320000001,251009.96000000002]
["Affiliate","Greater Sudbury","Billing & Customer Service","% allocation",0.71362039836225943,2050662.1029499997,2873603.540000001]
["Affiliate","Greater Sudbury","Stores/Procurement","Materials issues",0.95903416327501911,328693.73,342734.12]
["Affiliate","Greater Sudbury","IT Services & amortization","% allocation",0.94277873274166168,434742.19,461128.55000000005]
["Affiliate","Greater Sudbury","Telecommunication services","Preferred pricing",null,0,30437.31]
["Greater Sudbury","Affiliates","Garage/fleet services","Hourly chargeout rate based on full cost recovery",0.90404257647388298,{"$f":"974867.08","v":974867.08},1078342]
["Greater Sudbury","Affiliates","Building Services/occupancy costs","% allocation",7.999998371306824E-2,47154.36,589429.62]
[]
["Corporate Cost Allocation"]
[]
["Name of Company",null,"Service Offered","Pricing Methdology","% of Corporate Costs Allocated","Amount Allocated"]
["From","To"]
[null,null,null,null,"%","$"]
["Parent Company (GSU)","Greater Sudbury","Board of Directors","% allocation",0.85853353349301853,63635.20949999999]
[]
[]
[]
[]
[]
[]
[]
[]
[]
[]
[]
[null,"Year:",2009]
[]
["Shared Services"]
[]
["Name of Company",null,"Service Offered","Pricing Methdology","Percentage (%)","Price for the Service","Cost for the Service"]
["From","To",null,null,"Percentage"]
[null,null,null,null," (%)","$","$"]
["Affiliate","Greater Sudbury","Corporate/Regulatory","% allocation",{"$f":"+F165/G165","v":0.99100491532219492},844510.68400000012,852176.08000000007]
["Affiliate","Greater Sudbury","Accounting & Admin","% allocation",{"$f":"+F166/G166","v":0.91848398032735123},514634.73950000003,560308.89]
["Affiliate","Greater Sudbury","Human Resources","% allocation",{"$f":"+F167/G167","v":0.90000000000000013},167563.78200000001,186181.97999999998]
["Affiliate","Greater Sudbury","Quality Management","n/a"]
["Affiliate","Greater Sudbury","Risk Management","% allocation",0.92,185789.4828,201945.09]
["Affiliate","Greater Sudbury","Billing & Customer Service","% allocation",0.73960308170616362,2137255.9128500009,2889733.6500000008]
["Affiliate","Greater Sudbury","Stores/Procurement","Materials issues",0.93416989037146192,360010,385379.57999999996]
["Affiliate","Greater Sudbury","IT Services & amortization","% allocation",0.9458223581589198,453312.45349999989,479278.6399999999]
["Affiliate","Greater Sudbury","Telecommunication services","Preferred pricing",0,null,25699.68]
["Greater Sudbury","Affiliates","Garage/fleet services","Hourly chargeout rate based on full cost recovery",0.93746654124393292,{"$f":"+G174-66573.93","v":998039.02},1064612.95]
["Greater Sudbury","Affiliates","Building Services/occupancy costs","% allocation",8.0000002863086395E-2,44707,558837.48000000021]
[]
["Corporate Cost Allocation"]
[]
["Name of Company",null,"Service Offered","Pricing Methdology","% of Corporate Costs Allocated","Amount Allocated"]
["From","To"]
[null,null,null,null,"%","$"]
["Parent Company (GSU)","Greater Sudbury","Board of Directors","% allocation",0.85643493424846018,81530.045000000013]

{"sheet":"App.2-OA Capital Structure","index":23,"n_rows":119,"n_cols":15,"rows_kept":119,"cut":false,"hidden":false,"merged":[[119,2,119,14],[120,2,120,14],[97,2,97,14],[98,2,98,14],[99,2,99,14],[102,2,102,14],[117,0,117,14],[118,2,118,14],[96,0,96,14],[39,2,39,14],[54,0,54,14],[55,2,55,14],[56,2,56,14],[57,2,57,14],[60,2,60,14],[75,0,75,14],[76,2,76,14],[77,2,77,14],[78,2,78,14],[81,2,81,14],[38,2,38,14],[9,2,9,14],[10,2,10,14],[12,0,12,14],[14,0,15,0],[15,4,15,8],[18,2,18,14],[33,0,33,14],[34,2,34,14],[35,2,35,14],[36,2,36,14],[37,2,37,14]]}
[null,null,null,null,null,null,null,null,null,null,"File Number:",null,null,null,{"$f":"'LDC Info'!$E$18","v":"EB-2012-0126"}]
[null,null,null,null,null,null,null,null,null,null,"Exhibit:",null,null,null,5]
[null,null,null,null,null,null,null,null,null,null,"Tab:",null,null,null,1]
[null,null,null,null,null,null,null,null,null,null,"Schedule:",null,null,null,1]
[null,null,null,null,null,null,null,null,null,null,"Page:",null,null,null,1]
[]
[null,null,null,null,null,null,null,null,null,null,"Date:",null,null,null,"9 November, 2012"]
[]
[]
[null,null,"Appendix 2-OA"]
[null,null,"Capital Structure and Cost of Capital"]
[]
["This table must be completed for the required years of all historical years, the bridge year and the test year."]
[]
["Line No."]
[null,null,"Particulars",null,"Capitalization Ratio",null,null,null,null,null,"Cost Rate",null,null,null,"Return"]
[]
[]
[null,null,"2009 Board Approved"]
[null,null,null,null,"(%)",null,null,null,"($)",null,"(%)",null,null,null,"($)"]
[null,null,"Debt"]
[1,null,"  Long-term Debt",null,0.52700000000000002,null,null,null,{"$f":"$I31*E22","v":40378747.377999999},null,7.0134110271491482E-2,null,null,null,{"$f":"K22*I22","v":2831927.5212333496}]
[2,null,"  Short-term Debt",null,0.04,null,"(1)",null,{"$f":"$I31*E23","v":3064800.56},null,1.3299999999999999E-2,null,null,null,{"$f":"K23*I23","v":40761.847448}]
[3,null,"Total Debt",null,{"$f":"SUM(E22:E23)","v":0.56700000000000006},null,null,null,{"$f":"SUM(I22:I23)","v":43443547.938000001},null,{"$f":"IF(E24=0,0,SUMPRODUCT(E22:E23,K22:K23)/E24)","v":6.6124649229410942E-2},null,null,null,{"$f":"SUM(O22:O23)","v":2872689.3686813498}]
[]
[null,null,"Equity"]
[4,null,"  Common Equity",null,0.43,null,null,null,{"$f":"$I31*E27","v":32946606.02},null,8.0100000000000005E-2,null,null,null,{"$f":"K27*I27","v":2639023.1422020001}]
[5,null,"  Preferred Shares",null,0,null,null,null,{"$f":"$I$31*E28","v":0},null,null,null,null,null,{"$f":"K28*I28","v":0}]
[6,null,"Total Equity",null,{"$f":"SUM(E27:E28)","v":0.43},null,null,null,{"$f":"SUM(I27:I28)","v":32946606.02},null,{"$f":"IF(E29=0,0,SUMPRODUCT(E27:E28,K27:K28)/E29)","v":8.0100000000000005E-2},null,null,null,{"$f":"SUM(O27:O28)","v":2639023.1422020001}]
[]
[7,null,"Total",null,1,null,null,null,76620014,null,{"$f":"(K24*E24)+(K29*E29)","v":7.1935676113076011E-2},null,null,null,{"$f":"O24+O29","v":5511712.5108833499}]
[]
[]
["Notes"]
["(1)",null,"4.0% unless an applicant has proposed or been approved for a different amount."]
[]
[]
[]
[]
[null,null,"2010"]
[null,null,null,null,"(%)",null,null,null,"($)",null,"(%)",null,null,null,"($)"]
[null,null,"Debt"]
[1,null,"  Long-term Debt",null,0.56000000000000005,null,null,null,{"$f":"$I52*E43","v":43284419.920000002},null,7.2499999999999995E-2,null,null,null,{"$f":"K43*I43","v":3138120.4441999998}]
[2,null,"  Short-term Debt",null,0.04,null,"(1)",null,{"$f":"$I52*E44","v":3091744.2800000003},null,1.3299999999999999E-2,null,null,null,{"$f":"K44*I44","v":41120.198924000004}]
[3,null,"Total Debt",null,{"$f":"SUM(E43:E44)","v":0.60000000000000009},null,null,null,{"$f":"SUM(I43:I44)","v":46376164.200000003},null,{"$f":"IF(E45=0,0,SUMPRODUCT(E43:E44,K43:K44)/E45)","v":6.8553333333333327E-2},null,null,null,{"$f":"SUM(O43:O44)","v":3179240.6431239997}]
[]
[null,null,"Equity"]
[4,null,"  Common Equity",null,0.4,null,null,null,{"$f":"$I52*E48","v":30917442.800000001},null,8.0100000000000005E-2,null,null,null,{"$f":"K48*I48","v":2476487.1682800003}]
[5,null,"  Preferred Shares",null,0,null,null,null,{"$f":"$I$31*E49","v":0},null,null,null,null,null,{"$f":"K49*I49","v":0}]
[6,null,"Total Equity",null,{"$f":"SUM(E48:E49)","v":0.4},null,null,null,{"$f":"SUM(I48:I49)","v":30917442.800000001},null,{"$f":"IF(E50=0,0,SUMPRODUCT(E48:E49,K48:K49)/E50)","v":8.0100000000000005E-2},null,null,null,{"$f":"SUM(O48:O49)","v":2476487.1682800003}]
[]
[7,null,"Total",null,1,null,null,null,77293607,null,{"$f":"(K45*E45)+(K50*E50)","v":7.3172000000000015E-2},null,null,null,{"$f":"O45+O50","v":5655727.811404}]
[]
[]
["Notes"]
["(1)",null,"4.0% unless an applicant has proposed or been approved for a different amount."]
[]
[]
[]
[]
[null,null,"2011"]
[null,null,null,null,"(%)",null,null,null,"($)",null,"(%)",null,null,null,"($)"]
[null,null,"Debt"]
[1,null,"  Long-term Debt",null,0.56000000000000005,null,null,null,{"$f":"$I73*E64","v":44708624.240000002},null,7.2499999999999995E-2,null,null,null,{"$f":"K64*I64","v":3241375.2574}]
[2,null,"  Short-term Debt",null,0.04,null,"(1)",null,{"$f":"$I73*E65","v":3193473.16},null,1.3299999999999999E-2,null,null,null,{"$f":"K65*I65","v":42473.193028000002}]
[3,null,"Total Debt",null,{"$f":"SUM(E64:E65)","v":0.60000000000000009},null,null,null,{"$f":"SUM(I64:I65)","v":47902097.400000006},null,{"$f":"IF(E66=0,0,SUMPRODUCT(E64:E65,K64:K65)/E66)","v":6.8553333333333327E-2},null,null,null,{"$f":"SUM(O64:O65)","v":3283848.4504280002}]
[]
[null,null,"Equity"]
[4,null,"  Common Equity",null,0.4,null,null,null,{"$f":"$I73*E69","v":31934731.600000001},null,8.0100000000000005E-2,null,null,null,{"$f":"K69*I69","v":2557972.0011600005}]
[5,null,"  Preferred Shares",null,0,null,null,null,{"$f":"$I$31*E70","v":0},null,null,null,null,null,{"$f":"K70*I70","v":0}]
[6,null,"Total Equity",null,{"$f":"SUM(E69:E70)","v":0.4},null,null,null,{"$f":"SUM(I69:I70)","v":31934731.600000001},null,{"$f":"IF(E71=0,0,SUMPRODUCT(E69:E70,K69:K70)/E71)","v":8.0100000000000005E-2},null,null,null,{"$f":"SUM(O69:O70)","v":2557972.0011600005}]
[]
[7,null,"Total",null,1,null,null,null,79836829,null,{"$f":"(K66*E66)+(K71*E71)","v":7.3172000000000015E-2},null,null,null,{"$f":"O66+O71","v":5841820.4515880011}]
[]
[]
["Notes"]
["(1)",null,"4.0% unless an applicant has proposed or been approved for a different amount."]
[]
[]
[]
[]
[null,null,"2012"]
[null,null,null,null,"(%)",null,null,null,"($)",null,"(%)",null,null,null,"($)"]
[null,null,"Debt"]
[1,null,"  Long-term Debt",null,0.56000000000000005,null,null,null,{"$f":"$I94*E85","v":46041977.520000003},null,5.0099999999999999E-2,null,null,null,{"$f":"K85*I85","v":2306703.073752}]
[2,null,"  Short-term Debt",null,0.04,null,"(1)",null,{"$f":"$I94*E86","v":3288712.68},null,2.0799999999999999E-2,null,null,null,{"$f":"K86*I86","v":68405.223744000003}]
[3,null,"Total Debt",null,{"$f":"SUM(E85:E86)","v":0.60000000000000009},null,null,null,{"$f":"SUM(I85:I86)","v":49330690.200000003},null,{"$f":"IF(E87=0,0,SUMPRODUCT(E85:E86,K85:K86)/E87)","v":4.8146666666666657E-2},null,null,null,{"$f":"SUM(O85:O86)","v":2375108.2974959998}]
[]
[null,null,"Equity"]
[4,null,"  Common Equity",null,0.4,null,null,null,{"$f":"$I94*E90","v":32887126.800000001},null,9.4200000000000006E-2,null,null,null,{"$f":"K90*I90","v":3097967.3445600001}]
[5,null,"  Preferred Shares",null,0,null,null,null,{"$f":"$I$31*E91","v":0},null,null,null,null,null,{"$f":"K91*I91","v":0}]
[6,null,"Total Equity",null,{"$f":"SUM(E90:E91)","v":0.4},null,null,null,{"$f":"SUM(I90:I91)","v":32887126.800000001},null,{"$f":"IF(E92=0,0,SUMPRODUCT(E90:E91,K90:K91)/E92)","v":9.4200000000000006E-2},null,null,null,{"$f":"SUM(O90:O91)","v":3097967.3445600001}]
[]
[7,null,"Total",null,1,null,null,null,82217817,null,{"$f":"(K87*E87)+(K92*E92)","v":6.6568000000000002E-2},null,null,null,{"$f":"O87+O92","v":5473075.6420559995}]
[]
[]
["Notes"]
["(1)",null,"4.0% unless an applicant has proposed or been approved for a different amount."]
[]
[]
[]
[]
[null,null,"2013"]
[null,null,null,null,"(%)",null,null,null,"($)",null,"(%)",null,null,null,"($)"]
[null,null,"Debt"]
[1,null,"  Long-term Debt",null,0.56000000000000005,null,null,null,{"$f":"$I115*E106","v":49324637.600000001},null,4.41E-2,null,null,null,{"$f":"K106*I106","v":2175216.51816}]
[2,null,"  Short-term Debt",null,0.04,null,"(1)",null,{"$f":"$I115*E107","v":3523188.4},null,2.0799999999999999E-2,null,null,null,{"$f":"K107*I107","v":73282.318719999996}]
[3,null,"Total Debt",null,{"$f":"SUM(E106:E107)","v":0.60000000000000009},null,null,null,{"$f":"SUM(I106:I107)","v":52847826},null,{"$f":"IF(E108=0,0,SUMPRODUCT(E106:E107,K106:K107)/E108)","v":4.2546666666666663E-2},null,null,null,{"$f":"SUM(O106:O107)","v":2248498.8368799998}]
[]
[null,null,"Equity"]
[4,null,"  Common Equity",null,0.4,null,null,null,{"$f":"$I115*E111","v":35231884},null,9.1200000000000003E-2,null,null,null,{"$f":"K111*I111","v":3213147.8208000003}]
[5,null,"  Preferred Shares",null,0,null,null,null,{"$f":"$I$31*E112","v":0},null,null,null,null,null,{"$f":"K112*I112","v":0}]
[6,null,"Total Equity",null,{"$f":"SUM(E111:E112)","v":0.4},null,null,null,{"$f":"SUM(I111:I112)","v":35231884},null,{"$f":"IF(E113=0,0,SUMPRODUCT(E111:E112,K111:K112)/E113)","v":9.1200000000000003E-2},null,null,null,{"$f":"SUM(O111:O112)","v":3213147.8208000003}]
[]
[7,null,"Total",null,1,null,null,null,88079710,null,{"$f":"(K108*E108)+(K113*E113)","v":6.2008000000000008E-2},null,null,null,{"$f":"O108+O113","v":5461646.6576800002}]
[]
[]
["Notes"]
["(1)",null,"4.0% unless an applicant has proposed or been approved for a different amount."]

{"sheet":"App.2-OB_Debt Instruments","index":24,"n_rows":154,"n_cols":11,"rows_kept":154,"cut":false,"hidden":false,"merged":[[102,0,102,10],[130,0,130,10],[71,0,71,10],[71,11,71,14],[73,0,73,10],[100,0,100,10],[100,11,100,14],[44,0,44,10],[42,11,42,14],[42,0,42,10],[9,0,9,10],[12,0,12,10],[12,11,12,14],[14,0,14,10]]}
[null,null,null,null,null,null,null,null,null,"File Number:",{"$f":"'LDC Info'!$E$18","v":"EB-2012-0126"}]
[null,null,null,null,null,null,null,null,null,"Exhibit:",5]
[null,null,null,null,null,null,null,null,null,"Tab:",1]
[null,null,null,null,null,null,null,null,null,"Schedule:",1]
[null,null,null,null,null,null,null,null,null,"Page:",2]
[]
[null,null,null,null,null,null,null,null,null,"Date:","9 November, 2012"]
[]
[]
["Appendix 2-OB"]
[]
[]
["Debt Instruments"]
[]
["This table must be completed for the required years of all historical years, the bridge year and the test year."]
[null,null,null,"Year",2013]
[]
["Row","Description","Lender","Affiliated or Third-Party Debt?","Fixed or Variable-Rate?","Start Date","Term              (years)","Principal                         ($)","Rate (%)                     (Note 2)","Interest ($)       (Note 1)"]
[null,"Multiple draw term loan (SWAP)","Toronto-Dominion Bank","Third-Party","Variable Rate","2011-01-18",15,2000000,4.7E-2,{"$f":"H19*I19","v":94000}]
[2,"Promissory Note","Greater Sudbury Utilities","Affiliated","Fixed Rate","2000-11-01","demand",48645458,4.41E-2,{"$f":"H20*I20","v":2145264.6978000002}]
[3,"Term Loan","TD bank","Third-Party","Fixed Rate","2013-01-01",15,4000000,4.41E-2,176400]
[4,null,null,null,null,null,null,null,null,0]
[5,null,null,null,null,null,null,null,null,0]
[6,null,null,null,null,null,null,null,null,0]
[7,null,null,null,null,null,null,null,null,0]
[8,null,null,null,null,null,null,null,null,0]
[9,null,null,null,null,null,null,null,null,0]
[10,null,null,null,null,null,null,null,null,0]
[11,null,null,null,null,null,null,null,null,0]
[12,null,null,null,null,null,null,null,null,0]
[]
["Total",null,null,null,null,null,null,{"$f":"SUM(H19:H30)","v":54645458},{"$f":"IF(H32=0,\"\",J32/H32)","v":4.4206138738923192E-2},{"$f":"SUM(J19:J30)","v":2415664.6978000002}]
[]
["Notes"]
[]
[1,"If financing is in place only part of the year, calculate the pro-rated interest and input in the cell."]
[2,"Input actual or deemed long-term debt rate in accordance with the guidelines in The Report of the Board on the Cost of Capital for Ontario's Regulated Utilities, issued December 11, 2009"]
[3,"Add more lines above row 12 if necessary."]
[]
[]
[]
[]
["Debt Instruments"]
[]
["This table must be completed for the required years of all historical years, the bridge year and the test year."]
[null,null,null,"Year",2012]
[]
["Row","Description","Lender","Affiliated or Third-Party Debt?","Fixed or Variable-Rate?","Start Date","Term              (years)","Principal                         ($)","Rate (%)                     (Note 2)","Interest ($)       (Note 1)"]
[1,"Multiple draw term loan (SWAP)","Toronto-Dominion Bank","Third-Party","Variable Rate","2011-01-18",15,2000000,3.4700000000000002E-2,{"$f":"H49*I49","v":69400}]
[2,"Promissory Note","Greater Sudbury Utilities","Affiliated","Fixed Rate",null,null,48645458,4.41E-2,{"$f":"H50*I50","v":2145264.6978000002}]
[3,null,null,null,null,null,null,null,null,0]
[4,null,null,null,null,null,null,null,null,0]
[5,null,null,null,null,null,null,null,null,0]
[6,null,null,null,null,null,null,null,null,0]
[7,null,null,null,null,null,null,null,null,0]
[8,null,null,null,null,null,null,null,null,0]
[9,null,null,null,null,null,null,null,null,0]
[10,null,null,null,null,null,null,null,null,0]
[11,null,null,null,null,null,null,null,null,0]
[12,null,null,null,null,null,null,null,null,0]
[]
["Total",null,null,null,null,null,null,{"$f":"SUM(H49:H60)","v":50645458},{"$f":"IF(H62=0,\"\",J62/H62)","v":4.3728791983676012E-2},{"$f":"SUM(J49:J60)","v":2214664.6978000002}]
[]
["Notes"]
[]
[1,"If financing is in place only part of the year, calculate the pro-rated interest and input in the cell."]
[2,"Input actual or deemed long-term debt rate in accordance with the guidelines in The Report of the Board on the Cost of Capital for Ontario's Regulated Utilities, issued December 11, 2009"]
[3,"Add more lines above row 12 if necessary."]
[]
[]
[]
["Debt Instruments"]
[]
["This table must be completed for the required years of all historical years, the bridge year and the test year."]
[null,null,null,"Year",2011]
[]
["Row","Description","Lender","Affiliated or Third-Party Debt?","Fixed or Variable-Rate?","Start Date","Term              (years)","Principal                         ($)","Rate (%)                     (Note 2)","Interest ($)       (Note 1)"]
[1,"Multiple draw term loan (SWAP)","Toronto-Dominion Bank","Third-Party","Variable Rate","2011-01-18",15,2000000,3.4700000000000002E-2,{"$f":"H78*I78","v":69400}]
[2,"Promissory Note","Greater Sudbury Utilities","Affiliated","Fixed Rate",null,null,48645458,4.41E-2,{"$f":"H79*I79","v":2145264.6978000002}]
[3,null,null,null,null,null,null,null,null,0]
[4,null,null,null,null,null,null,null,null,0]
[5,null,null,null,null,null,null,null,null,0]
[6,null,null,null,null,null,null,null,null,0]
[7,null,null,null,null,null,null,null,null,0]
[8,null,null,null,null,null,null,null,null,0]
[9,null,null,null,null,null,null,null,null,0]
[10,null,null,null,null,null,null,null,null,0]
[11,null,null,null,null,null,null,null,null,0]
[12,null,null,null,null,null,null,null,null,0]
[]
["Total",null,null,null,null,null,null,{"$f":"SUM(H78:H89)","v":50645458},{"$f":"IF(H91=0,\"\",J91/H91)","v":4.3728791983676012E-2},{"$f":"SUM(J78:J89)","v":2214664.6978000002}]
[]
["Notes"]
[]
[1,"If financing is in place only part of the year, calculate the pro-rated interest and input in the cell."]
[2,"Input actual or deemed long-term debt rate in accordance with the guidelines in The Report of the Board on the Cost of Capital for Ontario's Regulated Utilities, issued December 11, 2009"]
[3,"Add more lines above row 12 if necessary."]
[]
[]
[]
["Debt Instruments"]
[]
["This table must be completed for the required years of all historical years, the bridge year and the test year."]
[null,null,null,"Year",2010]
[]
["Row","Description","Lender","Affiliated or Third-Party Debt?","Fixed or Variable-Rate?","Start Date","Term              (years)","Principal                         ($)","Rate (%)                     (Note 2)","Interest ($)       (Note 1)"]
[1,null,null,null,null,null,null,null,null,{"$f":"H107*I107","v":0}]
[2,"Promissory Note","Greater Sudbury Utilities","Affiliated","Fixed Rate",null,null,48645458,4.41E-2,{"$f":"H108*I108","v":2145264.6978000002}]
[3,null,null,null,null,null,null,null,null,0]
[4,null,null,null,null,null,null,null,null,0]
[5,null,null,null,null,null,null,null,null,0]
[6,null,null,null,null,null,null,null,null,0]
[7,null,null,null,null,null,null,null,null,0]
[8,null,null,null,null,null,null,null,null,0]
[9,null,null,null,null,null,null,null,null,0]
[10,null,null,null,null,null,null,null,null,0]
[11,null,null,null,null,null,null,null,null,0]
[12,null,null,null,null,null,null,null,null,0]
[]
["Total",null,null,null,null,null,null,{"$f":"SUM(H107:H118)","v":48645458},{"$f":"IF(H120=0,\"\",J120/H120)","v":4.4100000000000007E-2},{"$f":"SUM(J107:J118)","v":2145264.6978000002}]
[]
["Notes"]
[]
[1,"If financing is in place only part of the year, calculate the pro-rated interest and input in the cell."]
[2,"Input actual or deemed long-term debt rate in accordance with the guidelines in The Report of the Board on the Cost of Capital for Ontario's Regulated Utilities, issued December 11, 2009"]
[3,"Add more lines above row 12 if necessary."]
[]
[]
[]
[]
["This table must be completed for the required years of all historical years, the bridge year and the test year."]
[null,null,null,"Year",2009]
[]
["Row","Description","Lender","Affiliated or Third-Party Debt?","Fixed or Variable-Rate?","Start Date","Term              (years)","Principal                         ($)","Rate (%)                     (Note 2)","Interest ($)       (Note 1)"]
[1,null,null,null,null,null,null,null,null,{"$f":"H135*I135","v":0}]
[2,"Promissory Note","Greater Sudbury Utilities","Affiliated","Fixed Rate","2000-11-01","demand",48645458,4.41E-2,{"$f":"H136*I136","v":2145264.6978000002}]
[3,null,null,null,null,null,null,null,null,{"$f":"H137*I137","v":0}]
[4,null,null,null,null,null,null,null,null,0]
[5,null,null,null,null,null,null,null,null,0]
[6,null,null,null,null,null,null,null,null,0]
[7,null,null,null,null,null,null,null,null,0]
[8,null,null,null,null,null,null,null,null,0]
[9,null,null,null,null,null,null,null,null,0]
[10,null,null,null,null,null,null,null,null,0]
[11,null,null,null,null,null,null,null,null,0]
[12,null,null,null,null,null,null,null,null,0]
[]
["Total",null,null,null,null,null,null,{"$f":"SUM(H135:H146)","v":48645458},{"$f":"IF(H148=0,\"\",J148/H148)","v":4.4100000000000007E-2},{"$f":"SUM(J135:J146)","v":2145264.6978000002}]
[]
["Notes"]
[]
[1,"If financing is in place only part of the year, calculate the pro-rated interest and input in the cell."]
[2,"Input actual or deemed long-term debt rate in accordance with the guidelines in The Report of the Board on the Cost of Capital for Ontario's Regulated Utilities, issued December 11, 2009"]
[3,"Add more lines above row 12 if necessary."]

{"sheet":"App.2-P_Cost_Allocation","index":25,"n_rows":117,"n_cols":6,"rows_kept":117,"cut":false,"hidden":false,"merged":[[31,0,32,4],[34,0,36,4],[38,0,39,4],[8,0,8,5],[9,0,9,5],[52,0,52,1],[53,0,53,1],[45,0,46,1],[45,2,46,2],[48,0,48,1],[49,0,49,1],[50,0,50,1],[51,0,51,1],[47,0,47,1],[42,1,42,5],[44,0,44,1],[45,3,46,3],[45,4,46,4],[45,5,46,5],[83,0,83,1],[65,0,65,5],[79,0,79,1],[80,0,80,1],[81,0,81,1],[82,0,82,1],[62,0,63,5],[54,0,54,1],[55,0,55,1],[56,0,56,1],[57,0,57,1],[58,0,58,1],[86,0,86,1],[87,0,87,1],[88,0,88,1],[67,0,68,5],[104,0,104,1],[70,0,71,5],[93,0,94,5],[96,0,96,5],[89,0,89,1],[84,0,84,1],[85,0,85,1],[75,0,77,1],[75,5,77,5],[76,3,77,3],[76,4,77,4],[78,0,78,1],[105,0,105,1],[100,0,102,1],[100,2,100,4],[100,5,101,5],[103,0,103,1],[113,0,113,1],[121,0,123,5],[106,0,106,1],[107,0,107,1],[108,0,108,1],[109,0,109,1],[110,0,110,1],[111,0,111,1],[116,0,119,5],[112,0,112,1]]}
[null,null,null,null,"File Number:",{"$f":"'LDC Info'!$E$18","v":"EB-2012-0126"}]
[null,null,null,null,"Exhibit:",7]
[null,null,null,null,"Tab:",1]
[null,null,null,null,"Schedule:",1]
[null,null,null,null,"Attachment:",3]
[]
[null,null,null,null,"Date:","9 November 2012"]
[]
["Appendix 2-P"]
["Cost Allocation"]
[]
["Please complete the following four tables."]
[]
["A)  Allocated Costs"]
[]
["Classes","Costs Allocated from Previous Study","%","Costs Allocated in Test Year Study                    (Column 7A)","%"]
["Residential",12265368,{"$f":"IF(B$28=0,\"\",B17/B$28)","v":0.59651425329623209},16056242,{"$f":"IF(D$28=0,\"\",D17/D$28)","v":0.63956886315320705}]
["GS < 50 kW",3045667,{"$f":"IF(B$28=0,\"\",B18/B$28)","v":0.148123054790853},3309627,0.13183249093101357]
["GS > 50 kW (or 50 kW < GS < xxx kW, if applicable)",4312464,0.2097324958229449,4862853,0.19370219786741893]
["GS > xxx kW, if applicable",null,0,null,0]
["Large User, if applicable",null,0,null,0]
["Street Lighting",844907,4.1091230871324817E-2,785187,3.1276381917554379E-2]
["Sentinel Lighting",46633,2.267950637434049E-3,47618,1.8967695009597771E-3]
["Unmetered Scattered Load (USL)",46696,2.2710145812111673E-3,43263,1.7232966298463361E-3]
["Other class, if applicable",null,0,null,0]
[null,null,0,null,0]
["Embedded distributor class",null,0,null,0]
["Total",{"$f":"SUM(B17:B27)","v":20561735},{"$f":"SUM(C17:C27)","v":0.99999999999999989},{"$f":"SUM(D17:D27)","v":25104790},{"$f":"SUM(E17:E27)","v":1}]
[]
["Notes"]
[]
["1     Customer Classification - If proposed rate classes differ from those in place in the previous Cost Allocation study, modify the rate classes to match the current application as closely as possible."]
[]
[]
["2     Host Distributors -  Provide information on embedded distributor(s) as a separate class, if applicable.   If embedded distributor(s) are billed as customers in a General Service class, include the allocated cost and revenue of the embedded distributor(s) in the applicable class.  Also complete Appendix 2-Q."]
[]
[]
["  "]
["3     Class Revenue Requirements - If using the Board-issued model, in column 7A enter the results from Worksheet O-1, Revenue Requirement (row 40 in the 2013 model).  This excludes costs in deferral and variance accounts.  Note to Embedded Distributor(s), it also does not include Account 4750 - Low Voltage (LV) Costs. "]
[]
[]
[]
["B)  Calculated Class Revenues"]
[]
[null,null,"Column 7B","Column 7C","Column 7D","Column 7E"]
["Classes (same as previous table)",null,"Load Forecast (LF) X current approved rates","L.F. X current approved rates X (1 + d)","LF X proposed rates","Miscellaneous Revenue"]
[]
[{"$f":"A17","v":"Residential"},null,13210751,{"$f":"13701877-1","v":13701876},13747467,1075603]
["GS < 50 kW",null,3688713,3825845,3780417,191135]
["GS > 50 kW (or 50 kW < GS < xxx kW, if applicable)",null,5056676,5244664,5244664,220805]
["GS > xxx kW, if applicable"]
["Large User, if applicable"]
["Street Lighting",null,668848,693713,693713,55108]
["Sentinel Lighting",null,34475,35756,40080,3880]
["Unmetered Scattered Load (USL)",null,51010,52906,48419,3497]
["Other class, if applicable"]
[]
[{"$f":"A27","v":"Embedded distributor class"}]
[{"$f":"A28","v":"Total"},null,{"$f":"SUM(C48:C58)","v":22710473},{"$f":"SUM(D48:D58)","v":23554760},{"$f":"SUM(E48:E58)","v":23554760},{"$f":"SUM(F48:F58)","v":1550028}]
[]
["Notes:"]
[]
["1     Columns 7B to 7D - LF means Load Forecast of Annual Billing Quantities (i.e. customers or connections X 12, (kWh or kW, as applicable).  Revenue Quantities should be net of Transfomrer Ownership Allowance.  Exclude revenue from rate adders and rate riders.  "]
[]
[]
["2     Columns 7C and 7D - Column total in each column should equal the Base Revenue Requirement"]
[]
["3     Columns 7C - The Board cost allocation model calculates \"1+d\" in worksheet O-1, cell C21. \"d\" is defined as Revenue Deficiency/ Revenue at Current Rates."]
[]
[]
["4     Columns 7E - If using the Board-issued Cost Allocation model, enter Miscellaneous Revenue as it appears in Worksheet O-1, row 19."]
[]
[]
["C)  Rebalancing Revenue-to-Cost (R/C) Ratios"]
[]
["Class",null,"Previously Approved Ratios","Status Quo Ratios","Proposed Ratios","Policy Range"]
[null,null,"Most Recent Year:","(7C + 7E) / (7A)","(7D + 7E) / (7A)"]
[null,null,2011]
[null,null,"%","%","%","%"]
[{"$f":"A48","v":"Residential"},null,96.87,{"$f":"IF(D17=0,\"\",(D48+F48)/D17*100)","v":92.035726666302125},{"$f":"IF(D17=0,\"\",(E48+F48)/D17*100)","v":92.31967231186475},"85 - 115"]
["GS < 50 kW",null,106.33,{"$f":"IF(D18=0,\"\",(D49+F49)/D18*100)","v":121.37258972083561},102.48,"80 - 120"]
["GS > 50 kW (or 50 kW < GS < xxx kW, if applicable)",null,110.26,112.39223147399274,112.39223147399274,"80 - 120"]
["GS > xxx kW, if applicable",null,null,"","","80 - 120"]
["Large User, if applicable",null,null,"","","85 - 115"]
["Street Lighting",null,70,95.368491836976403,95.368491836976403,"70 - 120"]
["Sentinel Lighting",null,70,83.237431223486908,92.318030996681927,"80 - 120"]
["Unmetered Scattered Load (USL)",null,115.19,130.37237362180153,120.00092457758362,"80 - 120"]
["Other class, if applicable",null,null,"",""]
[null,null,null,"",""]
[{"$f":"A58","v":"Embedded distributor class"},null,null,"",""]
[]
["Notes"]
[]
["1     Previously Approved Revenue-to-Cost Ratios - For most applicants, Most Recent Year would be the third year of the IRM 3 period,  e.g. if the applicant rebased in 2009 with further adjustments over 2 years, the Most recent year is 2011.  For applicants that have had rates adjusted only under IRM 2, the Most Recent Year is 2006, and the applicant should enter the ratios from their Informational Filing."]
[]
[]
["2     Status Quo Ratios - The Board's updated Cost Allocation Model yields the Status Quo Ratios in Worksheet O-1.  Status Quo means \"Before Rebalancing\"."]
[]
["D)  Proposed Revenue-to-Cost Ratios"]
[]
["Class",null,"Proposed Revenue-to-Cost Ratios",null,null,"Policy Range"]
[null,null,2013,2014,2015]
[null,null,"%","%","%","%"]
[{"$f":"A80","v":"Residential"},null,{"$f":"E80","v":92.31967231186475},null,null,{"$f":"F80","v":"85 - 115"}]
[{"$f":"A81","v":"GS < 50 kW"},null,{"$f":"E81","v":102.48},null,null,{"$f":"F81","v":"80 - 120"}]
["GS > 50 kW (or 50 kW < GS < xxx kW, if applicable)",null,112.39223147399274,null,null,"80 - 120"]
["GS > xxx kW, if applicable",null,"",null,null,"80 - 120"]
["Large User, if applicable",null,"",null,null,"85 - 115"]
["Street Lighting",null,95.368491836976403,null,null,"70 - 120"]
["Sentinel Lighting",null,92.318030996681927,null,null,"80 - 120"]
["Unmetered Scattered Load (USL)",null,120.00092457758362,null,null,"80 - 120"]
["Other class, if applicable",null,"",null,null,{"$f":"F88","v":0}]
[null,null,"",null,null,{"$f":"F89","v":0}]
["Embedded distributor class",null,""]
[]
["Note"]
["1     The applicant should complete Table D if it is applying for approval of a revenue to cost ratio in 2012 that is outside the Board’s policy range for any customer class. Table (d) will show the information that the distributor would likely enter in the IRM model) in 2013.  In 2013 Table (d), enter the planned ratios for the classes that will be ‘Change’ and ‘No Change’ in 2013 (in the current Revenue Cost Ratio Adjustment Workform, Worksheet C1.1 ‘Decision – Cost Revenue Adjustment’, column d), and enter TBD for class(es) that will be entered as ‘Rebalance’. "]

{"sheet":"App.2-R_Loss Factors","index":26,"n_rows":73,"n_cols":8,"rows_kept":73,"cut":false,"hidden":false,"merged":[[8,0,8,7],[9,0,9,7],[11,0,11,7],[13,0,14,1],[13,2,13,6],[13,7,14,7],[15,1,15,7],[24,1,24,7],[26,1,26,7],[54,1,55,7],[36,1,39,7],[43,1,45,7],[47,1,50,7],[57,1,58,7],[60,1,61,7],[32,1,34,7],[71,1,71,7],[63,1,63,7],[65,1,65,7],[67,1,69,6],[52,1,52,7]]}
[null,null,null,null,null,null,"File Number:",{"$f":"'LDC Info'!$E$18","v":"EB-2012-0126"}]
[null,null,null,null,null,null,"Exhibit:",8]
[null,null,null,null,null,null,"Tab:",3]
[null,null,null,null,null,null,"Schedule:",6]
[null,null,null,null,null,null,"Attachment:",1]
[]
[null,null,null,null,null,null,"Date:","9 November, 2012"]
[]
["Appendix 2-R"]
["Loss Factors"]
[]
[]
[]
[null,null,"Historical Years",null,null,null,null,"5-Year Average"]
[null,null,{"$f":"IF(ISBLANK('LDC Info'!E26-5), \"Year 5\", 'LDC Info'!E26-5)","v":2007},{"$f":"IF(ISBLANK('LDC Info'!E26-4), \"Year 5\", 'LDC Info'!E26-4)","v":2008},{"$f":"IF(ISBLANK('LDC Info'!E26-3), \"Year 5\", 'LDC Info'!E26-3)","v":2009},{"$f":"IF(ISBLANK('LDC Info'!E26-2), \"Year 5\", 'LDC Info'!E26-2)","v":2010},{"$f":"IF(ISBLANK('LDC Info'!E26-1), \"Year 5\", 'LDC Info'!E26-1)","v":2011}]
[null,"Losses Within Distributor's System"]
["A(1)","\"Wholesale\" kWh delivered to distributor (higher value)",1001862965.3972714,1006112850.7130091,1004442975.7268792,966894707.21973991,967341538.334203,{"$f":"IF(SUM(C17:G17)=0,0,AVERAGE(C17:G17))","v":989331007.47822058}]
["A(2)","\"Wholesale\" kWh delivered to distributor (lower value)",1006978300.7001251,1012883013.4918065,1008534280.8386738,975012465.97879589,979395602.21056998,{"$f":"IF(SUM(C18:G18)=0,0,AVERAGE(C18:G18))","v":996560732.64399433}]
["B","Portion of \"Wholesale\" kWh delivered to distributor for its Large Use Customer(s)",0,0,0,0,0,{"$f":"IF(SUM(C19:G19)=0,0,AVERAGE(C19:G19))","v":0}]
["C","Net \"Wholesale\" kWh delivered to distributor  = A(2) - B",{"$f":"C18-C19","v":1006978300.7001251},1012883013.4918065,1008534280.8386738,975012465.97879589,979395602.21056998,996560732.64399433]
["D","\"Retail\" kWh delivered by distributor",958611633,966826979,957200159.17225003,930392978.67999995,935254771.67000008,{"$f":"IF(SUM(C21:G21)=0,0,AVERAGE(C21:G21))","v":949657304.3044498}]
["E","Portion of \"Retail\" kWh delivered by distributor to its Large Use Customer(s)",0,0,0,0,0,{"$f":"IF(SUM(C22:G22)=0,0,AVERAGE(C22:G22))","v":0}]
["F","Net \"Retail\" kWh delivered by distributor = D - E",{"$f":"C21-C22","v":958611633},966826979,957200159.17225003,930392978.67999995,935254771.67000008,949657304.3044498]
["G","Loss Factor in Distributor's system = C / F",{"$f":"IF(C23=0,\"\",C20/C23)","v":1.0504549142062467},1.0476362735961742,1.0536294537506299,1.047957678444758,1.0471965841582949,1.0493898463445166]
[null,"Losses Upstream of Distributor's System"]
["H","Supply Facilities Loss Factor",1.0043839891546535,1.0043792172047119,1.0043811243105032,1.0043774903985332,1.0043801659259177,{"$f":"IF(SUM(C26:G26)=0,0,AVERAGE(C26:G26))","v":1.0043803973988639}]
[null,"Total Losses"]
["I","Total Loss Factor = G x H",{"$f":"IF(C24=\"\",\"\",C24*C26)","v":1.0550600971575794},1.0522241003897868,1.0582455353647189,1.0525451031202191,1.0517834789539624,1.0539865908978383]
[]
["Notes"]
[]
[]
["A(1)","If directly connected to the IESO-controlled grid, kWh pertains to the virtual meter on the primary or high voltage side of the transformer at the interface with the transmission grid.  This corresponds to the \"With Losses\" kWh value provided by the IESO's MV-WEB.  It is the higher of the two values provided by MV-WEB."]
[]
[]
[]
[null,"If fully embedded within a host distributor, kWh pertains to the virtual meter on the primary or high voltage side of the transformer, at the interface between the host distributor and the transmission grid.  For example, if the host distributor is Hydro One Networks Inc., kWh from the Hydro One Networks' invoice corresponding to \"Total kWh w Losses\" should be reported.  This corresponds to the higher of the two kWh values provided in Hydro One Networks' invoice."]
[]
[]
[]
[]
[null,"If partially embedded, kWh pertains to the sum of the above."]
[]
["A(2)","If directly connected to the IESO-controlled grid, kWh pertains to a metering installation on the secondary or low voltage side of the transformer at the interface with the transmission grid.  This corresponds to the \"Without Losses\" kWh value provided by the IESO's MV-WEB.  It is the lower of the two kWh values provided by MV-WEB."]
[]
[]
[]
[null,"If fully embedded with the host distributor, kWh pertains to an actual or virtual meter at the interface between the embedded distributor and the host distributor.  For example, if the host distributor is Hydro One Networks Inc., kWh from the Hydro One Networks' invoice corresponding to \"Total kWh\" should be reported.  This corresponds to the lower of the two kWh values provided in Hydro One Networks' invoice."]
[]
[]
[]
[]
[null,"If partially embedded, kWh pertains to the sum of the above."]
[]
[null,"Additionally, kWh pertaining to distributed generation directly connected to the distributor's own distribution network should be included in A(2)."]
[]
[]
["B","If a Large Use Customer is metered on the secondary or low voltage side of the transformer, the default loss is 1%                         (i.e., B = 1.01 X E)."]
[]
[]
["D","kWh corresponding to D should equal metered or estimated kWh at the customer’s delivery point."]
[]
[]
["G and I","These loss factors pertain to secondary-metered customers with demand less than 5,000 kW."]
[]
["H","If directly connected to the IESO-controlled grid, SFLF = 1.0045."]
[]
[null,"If fully embedded within a host distributor, SFLF = loss factor re losses in transformer at grid interface X loss factor re losses in host distributor's system.  If the host distributor is Hydro One Networks Inc., SFLF = 1.0060 X 1.0278 = 1.0340. If partially embedded, SFLF should be calculated as the weighted average of above."]
[]
[]
[]
[null,"Distributors that wish to propose a different SFLF should provide appropriate justification for any such proposal including supporting"]
[null,"calculations and any other relevant material."]

{"sheet":"App.2-S_Stranded Meters","index":27,"n_rows":96,"n_cols":8,"rows_kept":96,"cut":false,"hidden":false,"merged":[[95,0,98,7],[87,1,89,7],[92,1,93,7],[68,1,69,7],[77,1,79,7],[82,1,84,7],[72,1,74,7],[85,1,85,6],[90,1,90,6],[94,1,94,6],[70,1,70,6],[75,1,75,6],[80,1,80,6],[61,2,63,7],[65,0,66,7],[34,1,35,7],[37,1,39,7],[42,1,45,7],[48,1,51,7],[56,2,59,7],[8,0,8,7],[9,0,9,7],[26,0,29,7],[31,0,32,7],[53,2,54,7]]}
[null,null,null,null,null,null,"File Number:",{"$f":"'LDC Info'!$E$18","v":"EB-2012-0126"}]
[null,null,null,null,null,null,"Exhibit:",9]
[null,null,null,null,null,null,"Tab:",1]
[null,null,null,null,null,null,"Schedule:",3]
[null,null,null,null,null,null,"Attachment:",1]
[]
[null,null,null,null,null,null,"Date:","9 November, 2012"]
[]
["Appendix 2-S"]
["Stranded Meter Treatment"]
[]
["Year","Notes","Gross Asset Value","Accumulated Amortization","Contributed Capital (Net of Amortization)","Net Asset","Proceeds on Disposition","Residual Net Book Value"]
[null,null,"(A)","(B)","(C)","(D ) = (A) - (B) - (C)","(E)","(F) = (D) - (E)"]
[2006,null,null,null,null,{"$f":"C14-D14-E14","v":0},null,{"$f":"F14-G14","v":0}]
[2007,null,null,null,null,0,null,0]
[2008,null,null,null,null,0,null,0]
[2009,null,null,null,null,0,null,0]
[2010,null,null,null,null,0,null,0]
[2011,null,null,null,null,0,null,0]
[2012,"(1)",7076701.2999999998,5868346.9500000002,0,1208354.3499999996,14493,1193861.3499999996]
[]
["Notes:"]
[]
["(1)","For 2012, please indicate whether the amounts provided are on a forecast or actual basis."]
[null,null,"GSHi :  Scenerio B applies and all amounts are on an actual basis"]
[]
["Some distributors have transferred the cost of stranded meters from Account 1860 - Meters to \"Sub-account Stranded Meter Costs of Account 1555\", while in some cases distributors have left these costs in Account 1860.  Depending on which treatment the applicant has chosen. please provide the information under either of the two scenarios (A and B below), as applicable."]
[]
[]
[]
[]
["Scenario A:  If the stranded meter costs were transferred to \"Sub-account Stranded Meter Costs\" of Account 1555, the above table should be completed and the following information should be provided."]
[]
[]
[1,"A description of the accounting treatment followed by the applicant on stranded meter costs for financial accounting and reporting purposes."]
[]
[]
[2,"The amount of the pooled residual net book value of the removed from service stranded meters, less any contributed capital (net of accumulated amortization), and less any net proceeds from sales, which were transferred to this sub-account as of December 31, 2010."]
[]
[]
[]
[]
[3,"A statement as to whether or not, since transferring the removed stranded meter costs to the sub-account, the recording of depreciation expenses was continued in order to reduce the net book value through accumulated depreciation.  If so, the total depreciation expense amount for the period from the time the costs for the stranded meters were transferred to the sub-account to December 31, 2010 should be provided."]
[]
[]
[]
[]
[]
[null,"If no depreciation expenses were recorded to reduce the net book value of stranded meter costs through accumulated depreciation, the total depreciation expense amount that would have been applicable from the time that the stranded meter costs were transferred to the sub-account of Account 1555 to December 31, 2010 should be provided.  In addition, the following information should be provided:"]
[]
[]
[]
[]
[null,"a)","Whether or not carrying charges were recorded for the stranded meter cost balances in the sub-account, and if so, the total carrying charges recorded to December 31, 2010."]
[]
[]
[null,"b)","The estimated amount of the pooled residual net book value of the removed from service meters, less any net proceeds from sales and contributed capital, at the time when the smart meters will have been fully deployed (e.g., as of December 31, 2010).  If the smart meters have been fully deployed, the actual amount should be provided."]
[]
[]
[]
[]
[null,"c)","A description as to how the applicant intends to recover in rates the remaining costs for stranded meters, including the proposed accounting treatment, the proposed disposition period, and the associated bill impacts."]
[]
[]
[]
["Scenario B:  If the stranded meter costs remained recorded in Account 1860, the above table should be completed and the following information should be provided:"]
[]
[]
[1,"A description of the accounting treatment followed by the applicant on stranded meter costs for financial accounting and reporting purposes."]
[]
[null,"GSHI:  Refer to Exhibit 9, Tab 1, Schedule 3"]
[]
[2,"The amount of the pooled residual net book value of the removed from service stranded meters, less any contributed capital (net of accumulated amortization), and less any net proceeds from sales, as of December 31, 2010."]
[]
[]
[null,"GSHI:  Refer to chart above"]
[]
[3,"A statement as to whether or not the recording of depreciation expenses continued in order to reduce the net book value through accumulated depreciation.  If so, provision of the total (cumulative) depreciation expense for the period from the time that the meters became stranded to December 31, 2010."]
[]
[]
[null,"GSHI:  Refer to Exhibit 9, Tab 1, Schedule 3"]
[]
[4,"If no depreciation expenses were recorded to reduce the net book value of stranded meters through accumulated depreciation, the total (cumulative) depreciation expense amount that would have been applicable for the period from the time that the meters became stranded to December 31, 2010."]
[]
[]
[null,"GSHI:  not applicable"]
[]
[5,"The estimated amount of the pooled residual net book value of the removed from service meters, less any net proceeds from sales and contributed capital, at the time when smart meters will have been fully deployed.  If the smart meters have been fully deployed, please provide the actual amount."]
[]
[]
[null,"GSHI:  Refer to Exhibit 9, Tab 1, Schedule 3"]
[]
[6,"A description as to how the applicant intends to recover in rates the costs for stranded meters, including the proposed accounting treatment, the proposed disposition period and the associated bill impacts."]
[]
[null,"GSHI:  Refer to Exhibit 9, Tab 1, Schedule 3"]
["Distributors should also provide the Net Book Value per class of meter as of December 31, 2010 as well as the number of meters that were removed / stranded.  In preparing this information, distributors should review the Board's letter of January 16, 2007 Stranded Meter Costs Related to the Installation of Smart Meters   which stated that records were to be kept of the type and number of each meter to support the stranded meter costs."]

{"sheet":"App.2-T_1592_Tax_Variance","index":28,"n_rows":113,"n_cols":6,"rows_kept":113,"cut":false,"hidden":false,"merged":[[27,0,27,2],[56,1,57,4],[35,0,36,0],[42,0,43,0],[46,0,47,0],[50,0,53,0],[56,0,57,0],[35,1,36,4],[39,1,39,4],[50,1,53,4],[37,1,37,4],[48,1,48,4],[54,1,54,4],[29,0,29,2],[8,0,8,4],[9,0,9,4],[11,0,11,4],[13,0,15,2],[16,0,16,2],[17,0,17,2],[18,0,18,2],[19,0,19,2],[24,0,24,2],[46,1,47,4],[31,0,31,2],[42,1,43,4],[25,0,25,2],[26,0,26,2],[28,0,28,2],[30,0,30,2],[39,0,41,0],[20,0,20,2],[21,0,21,2],[22,0,22,2],[23,0,23,2]]}
[null,null,"File Number:",null,{"$f":"'LDC Info'!$E$18","v":"EB-2012-0126"}]
[null,null,"Exhibit:",null,9]
[null,null,"Tab:",null,1]
[null,null,"Schedule:",null,5]
[null,null,"Attachment:",null,1]
[]
[null,null,"Date:",null,"9 November, 2012"]
[]
["Appendix 2-T"]
["Deferred PILs Account 1592 Balances"]
[]
["The following table should be completed based on the information requested below, in accordance with the notes following the table. An explanation should be provided for any blank entries."]
[]
["Tax Item",null,null,null,"Principal as of"]
[null,null,null,null,"December 31,"]
[null,null,null,null,2011]
["Large Corporation Tax grossed-up proxy from 2006 EDR application PILs model for the period from May 1, 2006 to April 30, 2007                                                                                                       Response:  GSHi was not subject to LCT and therefore no proxy was included in the 2006 EDR rate apllication          ",null,null,null,"n/a"]
["Large Corporation Tax grossed-up proxy from 2006 EDR application PILs model for the period from January 1, 2006 to April 30, 2006 (4/12ths of the approved grossed-up proxy), if not recorded in PILs account 1562                                                                                                    Response:  GSHi was not subject to LCT and therefore no proxy was included in the 2006 EDR rate application.",null,null,null,"n/a"]
["Ontario Capital Tax rate decrease and increase in capital deduction for 2007                                  Response:  Refer to Note 7.",null,null,null,-16421.68]
["Ontario Capital Tax rate decrease and increase in capital deduction for 2008                              Response:  Refer to note 8.",null,null,null,-57733.4]
["Ontario Capital Tax rate decrease and increase in capital deduction for 2009                              Response:  Refer to Note 9 (GSHi rebased May 1, 2009)",null,null,null,-7994.47]
["Ontario Capital Tax rate decrease and increase in capital deduction for 2010",null,null,null,"n/a"]
["Capital Cost Allowance class changes from 2006 EDR application for 2006",null,null,null,"n/a"]
["Capital Cost Allowance class changes from 2006 EDR application for 2007",null,null,null,"n/a"]
["Capital Cost Allowance class changes from 2006 EDR application for 2008",null,null,null,"n/a"]
["Capital Cost Allowance class changes from 2006 EDR application for 2009",null,null,null,"n/a"]
["Capital Cost Allowance class changes from 2006 EDR application for 2010",null,null,null,"n/a"]
["Capital Cost Allowance class changes from 2006 EDR application for 2011",null,null,null,"n/a"]
["Capital Cost Allowance class changes from any prior application not recorded above.  Please provide details and explanation separately.",null,null,null,"n/a"]
["Corporate tax rate decrease from 36.12% to 33.50% for 2008 (Jan to April)",null,null,null,-31400]
["Corporate tax rate decrease from 33.5% to 33.00% for 2009 (Jan to April)",null,null,null,-5991]
["Total",null,null,null,{"$f":"SUM(E17:E31)","v":-119540.55}]
[]
["Notes:"]
[]
[1,"Revise the deferral and variance account continuity schedule to include account 1592 as a group 2 account and enter all relevant information for transactions, adjustments, etc., for all relevant years."]
[]
[null,"Response:  Account 1592 has been included as a Group 2 Account in the continuity schedule"]
[]
[2,"Describe each type of tax item that has been recorded in account 1592."]
[null,"Response:  Refer to notes (7) to (11) "]
[]
[3,"Provide the calculations that show how each item was determined and provide any pertinent supporting evidence and documentation."]
[]
[null,"Response:  Refer to notes (7) to (11) "]
[]
[4,"Please state whether or not the applicant followed the guidance provided in the FAQ of July 2007.  If not, please provide an explanation."]
[]
[null,"Response:  GSHi has followed the guidance provided in the FAQ of July 2007."]
[]
[5,"Identify the account balance as of December 31, 2011 as per the 2011 Audited Financial Statements.  Identify the account balance as of December 31, 2011 as per the April 2012 2.1.7 RRR filing to the Board.  Provide a reconciliation if the balances provided are not identical to each other and to the total shown on the continuity schedule."]
[]
[]
[]
[null,"Response:  The balance in the 2011 audited financial statements and the 2.1.7 RRR filing were both NIL."]
[]
[6,"Complete the above table based on the answers to the previous.  Add rows as required to complete the analysis in an informative manner.  Please provide the completed table as a working Excel spreadsheet."]
[]
[]
[null,"Response:  Completed."]
[]
[]
[7]
[null,"Ontario Capital Tax rate decrease and increase in capital deduction for calendar 2007:"]
[]
[null,null,null,null,"2006EDR",2007]
[null,"Taxable capital per 2006 EDR",null,null,71977864,71977864]
[null,"Deduction",null,null,-10000000,-12500000]
[null,"Net taxable capital",null,null,{"$f":"SUM(E67:E68)","v":61977864},{"$f":"SUM(F67:F68)","v":59477864}]
[null,"Ontario Capital tax rate",null,null,3.0000000000000001E-3,2.8500000000000001E-3]
[null,"Capital tax",null,null,{"$f":"+E69*E70","v":185933.592},{"$f":"+F69*F70","v":169511.9124}]
[null,"Difference  = credit entry to Account 1592 for the year.",null,null,null,{"$f":"+F71-E71","v":-16421.679600000003}]
[]
[8]
[null,"Ontario Capital Tax rate decrease and increase in capital deduction for calendar 2008:"]
[null,null,null,null,"2006EDR",2008]
[null,"Taxable capital per 2006 EDR",null,null,71977864,71977864]
[null,"Deduction",null,null,-10000000,-15000000]
[null,"Net taxable capital",null,null,{"$f":"SUM(E77:E78)","v":61977864},{"$f":"SUM(F77:F78)","v":56977864}]
[null,"Ontario Capital tax rate",null,null,3.0000000000000001E-3,2.2499999999999998E-3]
[null,"Capital tax",null,null,{"$f":"+E79*E80","v":185933.592},{"$f":"+F79*F80","v":128200.19399999999}]
[null,"Difference  = credit entry to Account 1592  for the year.",null,null,null,{"$f":"+F81-E81","v":-57733.398000000016}]
[]
[9]
[null,"Ontario Capital Tax rate decrease and increase in capital deduction for January to April 2009:"]
[null,null,null,null,"2006EDR",2009]
[null,"Taxable capital per 2009 EDR",null,null,71977864,71977864]
[null,"Deduction",null,null,-10000000,0]
[null,"Net taxable capital",null,null,{"$f":"SUM(E87:E88)","v":61977864},{"$f":"SUM(F87:F88)","v":71977864}]
[null,"Ontario Capital tax rate",null,null,3.0000000000000001E-3,2.2499999999999998E-3]
[null,"Capital tax",null,null,{"$f":"+E89*E90","v":185933.592},{"$f":"+F89*F90","v":161950.19399999999}]
[null,"Difference  = credit entry to Account 1592  for the 1st quarter",null,null,null,{"$f":"+(F91-E91)/12*4","v":-7994.4660000000049}]
[]
[10]
[null,"Income tax decrease from 36.12 o 33.50% from January to April 2008"]
[null,null,null,null,"2006EDR","2008IRM"]
[null,"Regulatory taxable income - per 2006 EDR",null,null,3595405,3595405]
[null,"Corporate income tax rate",null,null,0.36120000000000002,0.33500000000000002]
[null,"Income tax",null,null,{"$f":"+E97*E98","v":1298660.2860000001},{"$f":"+F97*F98","v":1204460.675}]
[null,"Difference",null,null,null,{"$f":"+F99-E99","v":-94199.611000000034}]
[null,null,null,null,null,"/12 x 4"]
[null,"Credit entry to Account 1592 for January to April 2008",null,null,null,{"$f":"+F100/12*4","v":-31399.870333333343}]
[]
[]
[11]
[null,"Income tax decrease from 36.12 o 33.50% from January to April 2009"]
[null,null,null,null,"2008IRM",2009]
[null,"Regulatory taxable income - per 2008 IRM",null,null,3595405,3595405]
[null,"Corporate income tax rate",null,null,0.33500000000000002,{"$f":"(829119-178813)/1970623","v":0.33000020805603103}]
[null,"Income tax",null,null,{"$f":"+E108*E109","v":1204460.675},{"$f":"+F108*F109","v":1186484.3980456942}]
[null,"Difference",null,null,null,{"$f":"+F110-E110","v":-17976.276954305824}]
[null,null,null,null,null,"/12 x 4"]
[null,"Credit entry to Account 1592 for January to April 2009",null,null,null,{"$f":"+F111/12*4","v":-5992.0923181019416}]

{"sheet":"App.2-U_IFRS Transition Costs","index":29,"n_rows":37,"n_cols":15,"rows_kept":37,"cut":false,"hidden":false,"merged":[[44,0,47,0],[44,1,47,4],[49,0,50,0],[49,1,50,4],[29,0,29,2],[33,0,34,0],[33,1,34,14],[36,0,37,0],[36,1,36,14],[41,0,42,0],[41,1,42,4],[20,0,20,2],[21,0,21,2],[38,0,39,0],[38,1,39,4],[23,0,23,2],[24,0,24,2],[25,0,25,2],[26,0,26,2],[27,0,27,2],[28,0,28,2],[22,0,22,2],[16,0,16,2],[17,0,17,2],[18,0,18,2],[19,0,19,2],[8,0,8,14],[9,0,9,14],[11,0,11,14],[13,0,15,2],[13,14,15,14]]}
[null,null,null,null,null,null,null,null,null,null,null,null,null,"File Number:",{"$f":"'LDC Info'!$E$18","v":"EB-2012-0126"}]
[null,null,null,null,null,null,null,null,null,null,null,null,null,"Exhibit:",9]
[null,null,null,null,null,null,null,null,null,null,null,null,null,"Tab:",2]
[null,null,null,null,null,null,null,null,null,null,null,null,null,"Schedule:",1]
[null,null,null,null,null,null,null,null,null,null,null,null,null,"Attachment:",1]
[]
[null,null,null,null,null,null,null,null,null,null,null,null,null,"Date:","9 November 2012"]
[]
["Appendix 2-U"]
["One-Time Incremental IFRS Transition Costs"]
[]
["The following table should be completed based on the information requested below. An explanation should be provided for any blank entries.  The entries should include one-time incremental IFRS transition costs that are currently included in Account 1508, Other Regulatory Assets, sub-account Deferred IFRS Transition Costs Account, or Account 1508, Other Regulatory Assets, sub-account IFRS Transition Costs Variance Account."]
[]
["Nature of One-Time Incremental IFRS Transition Costs 1",null,null,null,"Audited Actual","Audited Actual","Audited Actual","Audited Carrying","Total Audited","RRR 2.1.7","Variance 2"," Actual","Carrying Charges","Total","Reasons why the costs recorded meet the criteria of one-time IFRS administrative incremental costs"]
[null,null,null,null,"Costs Incurred","Costs Incurred","Costs Incurred","Charges","Actual Costs","Balance",null,"Costs Incurred","Jan 1 2012","Costs to "]
[null,null,null,null,2009,2010,2011,"to Dec 31, 2011","to Dec 31, 2011","2011-12-313",null," Jan -Sept 30, 2012","to April 30 2012","April 30 2012"]
["professional accounting fees",null,null,null,null,{"$f":"25000+13717","v":38717},{"$f":"12241+15000+10000","v":37241},819.6,{"$f":"SUM(E17:H17)","v":76777.600000000006},null,null,27000,1287,{"$f":"I17+L17+M17","v":105064.6},"Incremental IFRS professional accounting fees"]
["professional legal fees",null,null,null,null,null,null,null,0]
["salaries, wages and benefits of staff added to support the transition to IFRS",null,null,null,null,null,null,null,0,null,null,{"$f":"13750+2664.22","v":16414.22},781,{"$f":"I19+L19+M19","v":17195.22},"Incremental staff to support transition to IFRS"]
["associated staff training and development costs",null,null,null,474.9,{"$f":"117.74+223.03+4139","v":4479.7700000000004},1072.45,{"$f":"4+57","v":61},6088.12,null,null,{"$f":"520","v":520},42,{"$f":"I20+L20+M20","v":6650.12},"Incremental IFRS training costs"]
["costs related to system upgrades, or replacements or changes where IFRS was the major reason for conversion",null,null,null,null,null,null,null,0]
[null,null,null,null,null,null,null,null,0]
[null,null,null,null,null,null,null,null,0]
[null,null,null,null,null,null,null,null,0]
[null,null,null,null,null,null,null,null,0]
[null,null,null,null,null,null,null,null,0]
[null,null,null,null,null,null,null,null,0]
[null,null,null,null,null,null,null,null,0]
["Insert description of additional item(s) and new rows if needed.",null,null,null,null,null,null,null,0]
["Total",null,null,null,{"$f":"SUM(E17:E29)","v":474.9},{"$f":"SUM(F17:F29)","v":43196.770000000004},{"$f":"SUM(G17:G29)","v":38313.449999999997},{"$f":"SUM(H17:H29)","v":880.6},{"$f":"SUM(I17:I29)","v":82865.72},82866,{"$f":"+I30-J30","v":-0.27999999999883585},{"$f":"SUM(L17:L29)","v":43934.22},{"$f":"SUM(M17:M29)","v":2110},{"$f":"SUM(N17:N29)","v":128909.94}]
[]
[]
["Note:"]
[1,"The Deferred IFRS Transition Costs Account and the IFRS Transition Costs Variance Account are exclusively for necessary, incremental transition costs and shall not include ongoing IFRS compliance costs or impacts arising from adopting accounting policy changes that reflect changes in the timing of the recognition of income. The incremental costs in these accounts shall not include costs related to system upgrades, or replacements or changes where IFRS was not the major reason for conversion. In addition, incremental IFRS costs shall not include capital assets or expenditures."]
[]
[2,"Applicants are to provide an explanation of material variances in evidence"]
[3,"Please note that although 1508 includes other balances, such as HONI incremental capital and OEB costs assessment in the 2.1.7 filing, these have not been included as only the 1508 Sub-account Deferred IFRS Transition Costs are shown. "]

{"sheet":"App.2-V_Rev_Reconciliation","index":30,"n_rows":34,"n_cols":16,"rows_kept":34,"cut":false,"hidden":false,"merged":[[33,0,34,13],[8,0,8,15],[11,10,12,10],[9,0,9,15],[11,5,11,6],[11,2,11,4],[11,12,12,12],[11,13,12,13],[11,14,12,14],[11,15,12,15],[11,1,12,1],[12,8,12,9],[11,7,11,9]]}
[null,null,null,null,null,null,null,null,null,null,null,null,null,null,"File Number:",{"$f":"'LDC Info'!$E$18","v":"EB-2012-0126"}]
[null,null,null,null,null,null,null,null,null,null,null,null,null,null,"Exhibit:",8]
[null,null,null,null,null,null,null,null,null,null,null,null,null,null,"Tab:",4]
[null,null,null,null,null,null,null,null,null,null,null,null,null,null,"Schedule:",1]
[null,null,null,null,null,null,null,null,null,null,null,null,null,null,"Attachment:",1]
[]
[null,null,null,null,null,null,null,null,null,null,null,null,null,null,"Date:","9 November, 2012"]
[]
["Appendix 2-V"]
["Revenue Reconciliation"]
[]
["Rate Class","Customers/ Connections","Number of Customers/Connections",null,null,"Test Year Consumption",null,"Proposed Rates",null,null,"Revenues at Proposed Rates",null,"Class Specific Revenue Requirement","Transformer Allowance Credit","Total","Difference"]
[null,null,"Start of Test Year","End of Test Year","Average","kWh","kW","Monthly Service Charge","Volumetric"]
[null,null,null,null,null,null,null,null,"kWh","kW"]
[]
["Residential","Customers",null,42512,{"$f":"IF(SUM(C16:D16)=0,0,AVERAGE(C16:D16))","v":42512},401373120,null,16.8,1.29E-2,null,{"$f":"H16*E16*12+I16*F16+J16*G16","v":13748132.447999999},null,13747467.017892389,null,{"$f":"SUM(M16:N16)","v":13747467.017892389},{"$f":"O16-K16","v":-665.43010761030018}]
["GS < 50 kW","Customers",null,4061,4061,141856898,null,22.09,1.9099999999999999E-2,null,3785956.6317999996,null,3780417.073220958,null,3780417.073220958,-5539.5585790416226]
["GS > 50 to 4,999 kW","Customers",null,531,531,385479346,969057,170.61,null,4.4246999999999996,5374913.4278999995,null,5244663.6139778681,130200,5374863.6139778681,-49.813922131434083]
["Large Use",null,null,null,0,null,null,null,null,null,0,null,null,null,0,0]
["Streetlighting","Connections",null,9578,9578,7985224,22306,5.25,null,4.0481999999999996,693713.14919999999,null,693713.35897022346,null,693713.35897022346,0.20977022347506136]
["Sentinel Lighting","Connections",null,436,436,460643,1269,4.3099999999999996,0,13.8009,{"$f":"H21*E21*12+I21*F21+J21*G21","v":40063.2621},null,40080.433348902647,null,40080.433348902647,17.171248902646767]
["Unmetered Scattered Load","Connections",null,345,{"$f":"IF(SUM(C22:D22)=0,0,AVERAGE(C22:D22))","v":345},1437650,null,7.64,1.17E-2,null,48450.104999999996,null,48419.001464219356,null,48419.001464219356,-31.103535780639504]
["Standby Power",null,null,null,0,null,null,null,null,null,0,null,null,null,0,0]
["Embedded Distributor Class",null,null,null,0,null,null,null,null,null,0,null,null,null,0,0]
["etc.",null,null,null,0,null,null,null,null,null,0,null,null,null,0,0]
[null,null,null,null,0,null,null,null,null,null,0,null,null,null,0,0]
[null,null,null,null,0,null,null,null,null,null,0,null,null,null,0,0]
[null,null,null,null,0,null,null,null,null,null,0,null,null,null,0,0]
[]
["Total",null,null,null,null,null,null,null,null,null,{"$f":"SUM(K16:K28)","v":23691229.023999996},null,{"$f":"SUM(M16:M28)","v":23554760.49887456},{"$f":"SUM(N16:N28)","v":130200},{"$f":"M30+N30","v":23684960.49887456},{"$f":"O30-K30","v":-6268.5251254364848}]
[]
["Note"]
[]
["1       The class specific revenue requirements in column N must be the amounts used in the final rate design process.  The total of column N should equate to the proposed base revenue requirement"]

{"sheet":"App.2-W Bill Impacts","index":31,"n_rows":536,"n_cols":15,"rows_kept":536,"cut":false,"hidden":false,"merged":[[2,0,2,10],[9,1,9,14],[10,1,10,14],[13,3,13,14],[17,5,17,7],[17,9,17,11],[17,13,17,14],[93,5,93,7],[93,9,93,11],[93,13,93,14],[18,3,19,3],[18,13,19,13],[18,14,19,14],[51,1,51,3],[52,1,52,3],[57,1,57,3],[58,1,58,3],[78,0,78,10],[85,1,85,14],[86,1,86,14],[89,3,89,14],[170,5,170,7],[170,9,170,11],[170,13,170,14],[94,3,95,3],[94,13,95,13],[94,14,95,14],[127,1,127,3],[128,1,128,3],[133,1,133,3],[134,1,134,3],[155,0,155,10],[162,1,162,14],[163,1,163,14],[166,3,166,14],[247,5,247,7],[247,9,247,11],[247,13,247,14],[171,3,172,3],[171,13,172,13],[171,14,172,14],[204,1,204,3],[205,1,205,3],[210,1,210,3],[211,1,211,3],[232,0,232,10],[239,1,239,14],[240,1,240,14],[243,3,243,14],[324,5,324,7],[324,9,324,11],[324,13,324,14],[248,3,249,3],[248,13,249,13],[248,14,249,14],[281,1,281,3],[282,1,282,3],[287,1,287,3],[288,1,288,3],[309,0,309,10],[316,1,316,14],[317,1,317,14],[320,3,320,14],[401,5,401,7],[401,9,401,11],[401,13,401,14],[325,3,326,3],[325,13,326,13],[325,14,326,14],[358,1,358,3],[359,1,359,3],[364,1,364,3],[365,1,365,3],[386,0,386,10],[393,1,393,14],[394,1,394,14],[397,3,397,14],[478,5,478,7],[478,9,478,11],[478,13,478,14],[402,3,403,3],[402,13,403,13],[402,14,403,14],[435,1,435,3],[436,1,436,3],[441,1,441,3],[442,1,442,3],[463,0,463,10],[470,1,470,14],[471,1,471,14],[474,3,474,14],[518,1,518,3],[479,3,480,3],[479,13,480,13],[479,14,480,14],[511,1,511,3],[512,1,512,3],[517,1,517,3]]}
[null,null,null,null,null,null,null,null,null,null,null,null,null,"File Number:","EB-2012-0126"]
[null,null,null,null,null,null,null,null,null,null,null,null,null,"Exhibit:",8]
[null,null,null,null,null,null,null,null,null,null,null,null,null,"Tab:",4]
[null,null,null,null,null,null,null,null,null,null,null,null,null,"Schedule:",2]
[null,null,null,null,null,null,null,null,null,null,null,null,null,"Attachment:",2]
[]
[null,null,null,null,null,null,null,null,null,null,null,null,null,"Date:","9 November, 2012"]
[]
[]
[null,"Appendix 2-W"]
[null,"Bill Impacts"]
[]
[]
[null,"Customer Class:",null,"Residential"]
[]
[null,null,null,"Consumption",null,800," kWh"]
[]
[null,null,null,null,null,"Current Board-Approved",null,null,null,"Proposed",null,null,null,"Impact"]
[null,null,null,"Charge Unit",null,"Rate","Volume","Charge",null,"Rate","Volume","Charge",null,"$ Change","% Change"]
[null,null,null,null,null,"($)",null,"($)",null,"($)",null,"($)"]
[null,"Monthly Service Charge",null,"Monthly",null,16.14,1,{"$f":"G21*F21","v":16.14},null,16.8,1,{"$f":"K21*J21","v":16.8},null,{"$f":"L21-H21","v":0.66000000000000014},{"$f":"IF((H21)=0,\"\",(N21/H21))","v":4.0892193308550193E-2}]
[null,"Smart Meter Rate Adder",null,"Monthly",null,0,1,{"$f":"G22*F22","v":0},null,0,1,{"$f":"K22*J22","v":0},null,{"$f":"L22-H22","v":0},{"$f":"IF((H22)=0,\"\",(N22/H22))","v":""}]
[null,"Rate Rider for Late Payment Penalty Litigation Costs",null,"Monthly",null,0,1,0,null,0,1,{"$f":"K23*J23","v":0},null,{"$f":"L23-H23","v":0},{"$f":"IF((H23)=0,\"\",(N23/H23))","v":""}]
[null,"Distribution Volumetric Rate",null,"kWh",null,1.24E-2,{"$f":"F16","v":800},9.92,null,1.29E-2,{"$f":"F16","v":800},10.32,null,0.40000000000000036,4.0322580645161324E-2]
[null,"Smart Meter Disposition Rider",null,"Monthly",null,0,1,0,null,0.31,1,0.31,null,0.31,""]
[null,"Rate Rider for Loss Revenue Adjustment Mechanism Recovery",null,"kWh",null,2.0000000000000001E-4,{"$f":"F16","v":800},0.16,null,0,{"$f":"F16","v":800},0,null,-0.16,{"$f":"IF((H26)=0,\"\",(N26/H26))","v":-1}]
[null,"Rate Rider for Tax Change",null,"kWh",null,-5.0000000000000001E-4,{"$f":"F16","v":800},-0.4,null,0,{"$f":"F16","v":800},0,null,0.4,-1]
[null,"LRAM",null,"kWh",null,0,{"$f":"F16","v":800},0,null,0,{"$f":"F16","v":800},0,null,0,""]
[null,"Stranded Assets Disposition",null,"Monthly",null,0,{"$f":"F16","v":800},0,null,1.07,1,1.07,null,1.07,""]
[null,"Sub-Total A",null,null,null,null,null,{"$f":"SUM(H21:H29)","v":25.820000000000004},null,null,null,{"$f":"SUM(L21:L29)","v":28.5},null,2.6799999999999962,0.10379550735863655]
[null,"Rate Rider for Deferral/Variance Account Disposition",null,"kWh",null,-2.0000000000000001E-4,{"$f":"F16","v":800},{"$f":"G31*F31","v":-0.16},null,-1.4E-3,{"$f":"F16","v":800},{"$f":"K31*J31","v":-1.1199999999999999},null,-0.95999999999999985,{"$f":"IF((H31)=0,\"\",(N31/H31))","v":5.9999999999999991}]
[null,"Rate Rider for Global Adjustment Sub Account (Applicable only to Non-RPP Customers) ",null,"kWh",null,0,{"$f":"F16","v":800},{"$f":"G32*F32","v":0},null,2E-3,{"$f":"F16","v":800},{"$f":"K32*J32","v":1.6},null,1.6,{"$f":"IF((H32)=0,\"\",(N32/H31))","v":""}]
[null,"Low Voltage Service Charge",null,"kWh",null,2.0000000000000001E-4,{"$f":"F16","v":800},{"$f":"G33*F33","v":0.16},null,2.0000000000000001E-4,{"$f":"F16","v":800},{"$f":"K33*J33","v":0.16},null,0,{"$f":"IF((H33)=0,\"\",(N33/H33))","v":0}]
[null,"Smart Meter Entity Charge",null,null,null,null,null,null,null,null,{"$f":"F16","v":800},{"$f":"K34*J34","v":0},null,0]
[null,"Sub-Total B - Distribution (includes Sub-Total A)",null,null,null,null,null,{"$f":"SUM(H30:H34)","v":25.820000000000004},null,null,null,{"$f":"SUM(L30:L34)","v":29.14},null,3.3199999999999967,{"$f":"IF((H35)=0,\"\",(N35/H35))","v":0.12858249419054982}]
[null,"RTSR - Network",null,"kWh",null,5.8999999999999999E-3,{"$f":"F16*(1+F62)","v":842.16},{"$f":"G36*F36","v":4.968744},null,5.7000000000000002E-3,{"$f":"F16*(1+J62)","v":843.17733039780262},{"$f":"K36*J36","v":4.8061107832674752},null,-0.16263321673252484,-3.2731252954977121E-2]
[null,"RTSR - Line and Transformation Connection",null,"kWh",null,3.7000000000000002E-3,{"$f":"G36","v":842.16},{"$f":"G37*F37","v":3.1159919999999999},null,3.5999999999999999E-3,{"$f":"K36","v":843.17733039780262},{"$f":"K37*J37","v":3.0354383894320893},null,-8.055361056791055E-2,-2.5851674384244426E-2]
[null,"Sub-Total C - Delivery (including Sub-Total B)",null,null,null,null,null,{"$f":"SUM(H35:H37)","v":33.904736000000007},null,null,null,{"$f":"SUM(L35:L37)","v":36.981549172699566},null,3.0768131726995591,9.074877246351537E-2]
[null,"Wholesale Market Service Charge (WMSC)",null,"kWh",null,5.1999999999999998E-3,{"$f":"F16*(1+F62)","v":842.16},{"$f":"G39*F39","v":4.379232},null,5.1999999999999998E-3,{"$f":"F16*(1+J62)","v":843.17733039780262},{"$f":"K39*J39","v":4.3845221180685732},null,5.2901180685731575E-3,1.2080013273042299E-3]
[null,"Rural and Remote Rate Protection (RRRP)",null,"kWh",null,1.1000000000000001E-3,{"$f":"F16*(1+F62)","v":842.16},0.92637599999999998,null,1.1000000000000001E-3,{"$f":"F16*(1+J62)","v":843.17733039780262},0.92749506343758292,null,1.1190634375829456E-3,1.2080013273044051E-3]
[null,"Standard Supply Service Charge",null,null,null,null,1,0,null,null,1,0,null,0,""]
[null,"Debt Retirement Charge (DRC)",null,"kWh",null,7.0000000000000001E-3,{"$f":"F16","v":800},5.6000000000000005,null,7.0000000000000001E-3,{"$f":"F16","v":800},5.6000000000000005,null,0,0]
[null,"Energy - RPP - Tier 1",null,"kWh",null,6.5000000000000002E-2,{"$f":"IF($G$39>=600,600,$G$39)","v":600},{"$f":"G43*F43","v":39},null,6.5000000000000002E-2,{"$f":"IF($K$39>=600,600,$K$39)","v":600},{"$f":"K43*J43","v":39},null,0,0]
[null,"Energy - RPP - Tier 2",null,"kWh",null,7.4999999999999997E-2,{"$f":"IF($G$39>=600,$G$39-600,0)","v":242.15999999999997},{"$f":"G44*F44","v":18.161999999999995},null,7.4999999999999997E-2,{"$f":"IF($K$39>=600,$K$39-600,0)","v":243.17733039780262},{"$f":"K44*J44","v":18.238299779835195},null,7.6299779835199644E-2,4.2010670540248689E-3]
[null,"TOU - Off Peak",null,"kWh",null,6.5000000000000002E-2,{"$f":"0.64*$G$39","v":538.98239999999998},35.033856,null,6.5000000000000002E-2,{"$f":"0.64*$K$39","v":539.6334914545937},35.076176944548592,null,4.2320944548592365E-2,1.2080013273044327E-3]
[null,"TOU - Mid Peak",null,"kWh",null,0.1,{"$f":"0.18*$G$39","v":151.58879999999999},15.15888,null,0.1,{"$f":"0.18*$K$39","v":151.77191947160446},15.177191947160447,null,1.8311947160446707E-2,1.2080013273043065E-3]
[null,"TOU - On Peak",null,"kWh",null,0.11700000000000001,{"$f":"0.18*$G$39","v":151.58879999999999},17.7358896,null,0.11700000000000001,{"$f":"0.18*$K$39","v":151.77191947160446},17.757314578177724,null,2.1424978177723375E-2,1.2080013273043477E-3]
[]
[null,"Total Bill on RPP (before Taxes)",null,null,null,null,null,{"$f":"SUM(H38:H44)","v":101.97234400000001},null,null,null,{"$f":"SUM(L38:L44)","v":105.13186613404091},null,3.1595221340408983,3.0984108142506739E-2]
[null,"HST",null,null,null,0.13,null,{"$f":"H49*F50","v":13.256404720000001},null,0.13,null,{"$f":"L49*J50","v":13.667142597425318},null,0.41073787742531742,3.0984108142506787E-2]
[null,"Total Bill (including HST)",null,null,null,null,null,{"$f":"H49+H50","v":115.22874872000001},null,null,null,{"$f":"L49+L50","v":118.79900873146622},null,3.5702600114662033,3.0984108142506635E-2]
[null,"Ontario Clean Energy Benefit 1",null,null,null,null,null,{"$f":"ROUND(-H51*10%,2)","v":-11.52},null,null,null,{"$f":"ROUND(-L51*10%,2)","v":-11.88},null,-0.36000000000000121,3.1250000000000104E-2]
[null,"Total Bill on RPP (including OCEB)",null,null,null,null,null,{"$f":"SUM(H51:H52)","v":103.70874872000002},null,null,null,{"$f":"SUM(L51:L52)","v":106.91900873146622},null,3.2102600114662039,3.0954572792440915E-2]
[]
[null,"Total Bill on TOU (before Taxes)",null,null,null,null,null,{"$f":"SUM(H38:H42,H45:H47)","v":112.73896959999999},null,null,null,{"$f":"SUM(L38:L42,L45:L47)","v":115.90424982409249},null,{"$f":"L55-H55","v":3.1652802240924984},{"$f":"IF((H55)=0,\"\",(N55/H55))","v":2.807618550464824E-2}]
[null,"HST",null,null,null,0.13,null,{"$f":"H55*F56","v":14.656066048},null,0.13,null,{"$f":"L55*J56","v":15.067552477132024},null,0.41148642913202416,2.8076185504648195E-2]
[null,"Total Bill (including HST)",null,null,null,null,null,{"$f":"H55+H56","v":127.39503564799999},null,null,null,{"$f":"L55+L56","v":130.9718023012245},null,3.5767666532245102,2.8076185504648139E-2]
[null,"Ontario Clean Energy Benefit 1",null,null,null,null,null,{"$f":"ROUND(-H57*10%,2)","v":-12.74},null,null,null,{"$f":"ROUND(-L57*10%,2)","v":-13.1},null,-0.35999999999999943,2.8257456828885356E-2]
[null,"Total Bill on TOU (including OCEB)",null,null,null,null,null,{"$f":"H57+H58","v":114.65503564799999},null,null,null,{"$f":"L57+L58","v":117.87180230122451},null,3.2167666532245107,2.8056043374320147E-2]
[]
[]
[null,"Loss Factor (%)",null,null,null,5.2699999999999969E-2,null,null,null,5.3971662997253311E-2]
[]
["1 Applicable to eligible customers only.  Refer to the Ontario Clean Energy Benefit Act, 2010."]
[]
["Note that the \"Charge $\" columns provide breakdowns of the amounts that each bill component contributes to the total monthly bill at the referenced "]
["consumption level at existing and proposed rates."]
[]
["Applicants must provide bill impacts for residential at 800 kWh and GS<50kW at 2000 kWh. In addition, their filing should cover the range that is relevant"]
["to their service territory, class by class. A general guideline of consumption levels follows:"]
[]
["Residential (kWh) - 100, 250, 500, 800, 1000, 1500, 2000"]
["GS<50kW (kWh) - 1000, 2000, 5000, 10000, 15000"]
["GS>50kW (kW) - 60, 100, 500, 1000"]
["Large User - range appropriate for utility"]
["Lighting Classes and USL - 150 kWh and 1 kW, range appropriate for utility."]
[null,null,null,null,null,null,null,null,null,null,null,null,null,"File Number:","EB-2012-0126"]
[null,null,null,null,null,null,null,null,null,null,null,null,null,"Exhibit:",8]
[null,null,null,null,null,null,null,null,null,null,null,null,null,"Tab:",4]
[null,null,null,null,null,null,null,null,null,null,null,null,null,"Schedule:",2]
[null,null,null,null,null,null,null,null,null,null,null,null,null,"Attachment:",2]
[]
[null,null,null,null,null,null,null,null,null,null,null,null,null,"Date:","9 November, 2012"]
[]
[]
[null,"Appendix 2-W"]
[null,"Bill Impacts"]
[]
[]
[null,"Customer Class:",null,"Residential"]
[]
[null,null,null,"Consumption",null,500," kWh"]
[]
[null,null,null,null,null,"Current Board-Approved",null,null,null,"Proposed",null,null,null,"Impact"]
[null,null,null,"Charge Unit",null,"Rate","Volume","Charge",null,"Rate","Volume","Charge",null,"$ Change","% Change"]
[null,null,null,null,null,"($)",null,"($)",null,"($)",null,"($)"]
[null,"Monthly Service Charge",null,"Monthly",null,16.14,1,{"$f":"G97*F97","v":16.14},null,16.8,1,{"$f":"K97*J97","v":16.8},null,{"$f":"L97-H97","v":0.66000000000000014},{"$f":"IF((H97)=0,\"\",(N97/H97))","v":4.0892193308550193E-2}]
[null,"Smart Meter Rate Adder",null,"Monthly",null,0,1,{"$f":"G98*F98","v":0},null,0,1,{"$f":"K98*J98","v":0},null,{"$f":"L98-H98","v":0},{"$f":"IF((H98)=0,\"\",(N98/H98))","v":""}]
[null,"Rate Rider for Late Payment Penalty Litigation Costs",null,"Monthly",null,0,1,0,null,0,1,{"$f":"K99*J99","v":0},null,{"$f":"L99-H99","v":0},{"$f":"IF((H99)=0,\"\",(N99/H99))","v":""}]
[null,"Distribution Volumetric Rate",null,"kWh",null,1.24E-2,{"$f":"F92","v":500},6.2,null,1.29E-2,{"$f":"F92","v":500},6.45,null,0.25,4.0322580645161289E-2]
[null,"Smart Meter Disposition Rider",null,"Monthly",null,0,1,0,null,0.31,1,0.31,null,0.31,""]
[null,"Rate Rider for Loss Revenue Adjustment Mechanism Recovery",null,"kWh",null,2.0000000000000001E-4,{"$f":"F92","v":500},0.1,null,0,{"$f":"F92","v":500},0,null,-0.1,{"$f":"IF((H102)=0,\"\",(N102/H102))","v":-1}]
[null,"Rate Rider for Tax Change",null,"kWh",null,-5.0000000000000001E-4,{"$f":"F92","v":500},-0.25,null,0,{"$f":"F92","v":500},0,null,0.25,{"$f":"IF((H103)=0,\"\",(N103/H103))","v":-1}]
[null,"LRAM",null,"kWh",null,0,{"$f":"F92","v":500},0,null,0,{"$f":"F92","v":500},0,null,0,""]
[null,"Stranded Assets Disposition",null,"Monthly",null,0,{"$f":"F92","v":500},0,null,1.07,1,1.07,null,1.07,""]
[null,"Sub-Total A",null,null,null,null,null,{"$f":"SUM(H97:H105)","v":22.19},null,null,null,{"$f":"SUM(L97:L105)","v":24.63},null,2.4399999999999977,0.10995944118972499]
[null,"Rate Rider for Deferral/Variance Account Disposition",null,"kWh",null,-2.0000000000000001E-4,{"$f":"F92","v":500},{"$f":"G107*F107","v":-0.1},null,-1.4E-3,{"$f":"F92","v":500},{"$f":"K107*J107","v":-0.7},null,-0.6,{"$f":"IF((H107)=0,\"\",(N107/H107))","v":5.9999999999999991}]
[null,"Rate Rider for Global Adjustment Sub Account (Applicable only to Non-RPP Customers) ",null,"kWh",null,0,{"$f":"F92","v":500},{"$f":"G108*F108","v":0},null,2E-3,{"$f":"F92","v":500},{"$f":"K108*J108","v":1},null,1,{"$f":"IF((H108)=0,\"\",(N108/H107))","v":""}]
[null,"Low Voltage Service Charge",null,"kWh",null,2.0000000000000001E-4,{"$f":"F92","v":500},{"$f":"G109*F109","v":0.1},null,2.0000000000000001E-4,{"$f":"F92","v":500},{"$f":"K109*J109","v":0.1},null,0,{"$f":"IF((H109)=0,\"\",(N109/H109))","v":0}]
[null,"Smart Meter Entity Charge",null,null,null,null,null,null,null,null,{"$f":"F92","v":500},{"$f":"K110*J110","v":0},null,0]
[null,"Sub-Total B - Distribution (includes Sub-Total A)",null,null,null,null,null,{"$f":"SUM(H106:H110)","v":22.19},null,null,null,{"$f":"SUM(L106:L110)","v":25.03},null,2.84,{"$f":"IF((H111)=0,\"\",(N111/H111))","v":0.12798557908968003}]
[null,"RTSR - Network",null,"kWh",null,5.8999999999999999E-3,{"$f":"F92*(1+F138)","v":526.35},{"$f":"G112*F112","v":3.1054650000000001},null,5.7000000000000002E-3,{"$f":"F92*(1+J138)","v":526.98583149862668},{"$f":"K112*J112","v":3.0038192395421723},null,-0.10164576045782781,-3.2731252954977051E-2]
[null,"RTSR - Line and Transformation Connection",null,"kWh",null,3.7000000000000002E-3,{"$f":"G112","v":526.35},{"$f":"G113*F113","v":1.9474950000000002},null,3.5999999999999999E-3,{"$f":"K112","v":526.98583149862668},{"$f":"K113*J113","v":1.897148993395056},null,-5.0346006604944149E-2,-2.585167438424445E-2]
[null,"Sub-Total C - Delivery (including Sub-Total B)",null,null,null,null,null,{"$f":"SUM(H111:H113)","v":27.24296},null,null,null,{"$f":"SUM(L111:L113)","v":29.930968232937229},null,2.6880082329372286,9.8667994701648734E-2]
[null,"Wholesale Market Service Charge (WMSC)",null,"kWh",null,5.1999999999999998E-3,{"$f":"F92*(1+F138)","v":526.35},{"$f":"G115*F115","v":2.7370199999999998},null,5.1999999999999998E-3,{"$f":"F92*(1+J138)","v":526.98583149862668},{"$f":"K115*J115","v":2.7403263237928588},null,3.3063237928590006E-3,1.208001327304514E-3]
[null,"Rural and Remote Rate Protection (RRRP)",null,"kWh",null,1.1000000000000001E-3,{"$f":"F92*(1+F138)","v":526.35},0.57898500000000008,null,1.1000000000000001E-3,{"$f":"F92*(1+J138)","v":526.98583149862668},0.57968441464848941,null,6.9941464848932711E-4,1.2080013273043809E-3]
[null,"Standard Supply Service Charge",null,null,null,null,1,0,null,null,1,0,null,0,""]
[null,"Debt Retirement Charge (DRC)",null,"kWh",null,7.0000000000000001E-3,{"$f":"F92","v":500},3.5,null,7.0000000000000001E-3,{"$f":"F92","v":500},3.5,null,0,0]
[null,"Energy - RPP - Tier 1",null,"kWh",null,6.5000000000000002E-2,{"$f":"IF($G$39>=600,600,$G$39)","v":600},{"$f":"G119*F119","v":39},null,6.5000000000000002E-2,{"$f":"IF($K$39>=600,600,$K$39)","v":600},{"$f":"K119*J119","v":39},null,0,0]
[null,"Energy - RPP - Tier 2",null,"kWh",null,7.4999999999999997E-2,{"$f":"IF($G$39>=600,$G$39-600,0)","v":242.15999999999997},{"$f":"G120*F120","v":18.161999999999995},null,7.4999999999999997E-2,{"$f":"IF($K$39>=600,$K$39-600,0)","v":243.17733039780262},{"$f":"K120*J120","v":18.238299779835195},null,7.6299779835199644E-2,4.2010670540248689E-3]
[null,"TOU - Off Peak",null,"kWh",null,6.5000000000000002E-2,{"$f":"0.64*$G$39","v":538.98239999999998},{"$f":"G121*F121","v":35.033856},null,6.5000000000000002E-2,{"$f":"0.64*$K$39","v":539.6334914545937},{"$f":"K121*J121","v":35.076176944548592},null,4.2320944548592365E-2,1.2080013273044327E-3]
[null,"TOU - Mid Peak",null,"kWh",null,0.1,{"$f":"0.18*$G$39","v":151.58879999999999},15.15888,null,0.1,{"$f":"0.18*$K$39","v":151.77191947160446},15.177191947160447,null,1.8311947160446707E-2,1.2080013273043065E-3]
[null,"TOU - On Peak",null,"kWh",null,0.11700000000000001,{"$f":"0.18*$G$39","v":151.58879999999999},17.7358896,null,0.11700000000000001,{"$f":"0.18*$K$39","v":151.77191947160446},17.757314578177724,null,2.1424978177723375E-2,1.2080013273043477E-3]
[]
[null,"Total Bill on RPP (before Taxes)",null,null,null,null,null,{"$f":"SUM(H114:H120)","v":91.220964999999993},null,null,null,{"$f":"SUM(L114:L120)","v":93.98927875121376},null,{"$f":"L125-H125","v":2.7683137512137677},{"$f":"IF((H125)=0,\"\",(N125/H125))","v":3.0347341219354212E-2}]
[null,"HST",null,null,null,0.13,null,{"$f":"H125*F126","v":11.85872545},null,0.13,null,{"$f":"L125*J126","v":12.21860623765779},null,0.35988078765779008,3.0347341219354233E-2]
[null,"Total Bill (including HST)",null,null,null,null,null,{"$f":"H125+H126","v":103.07969044999999},null,null,null,{"$f":"L125+L126","v":106.20788498887156},null,3.1281945388715684,3.0347341219354319E-2]
[null,"Ontario Clean Energy Benefit 1",null,null,null,null,null,{"$f":"ROUND(-H127*10%,2)","v":-10.31},null,null,null,{"$f":"ROUND(-L127*10%,2)","v":-10.62},null,-0.30999999999999872,3.0067895247332561E-2]
[null,"Total Bill on RPP (including OCEB)",null,null,null,null,null,{"$f":"SUM(H127:H128)","v":92.769690449999985},null,null,null,{"$f":"SUM(L127:L128)","v":95.587884988871551},null,2.8181945388715661,3.037839756930618E-2]
[]
[null,"Total Bill on TOU (before Taxes)",null,null,null,null,null,{"$f":"SUM(H114:H118,H121:H123)","v":101.9875906},null,null,null,{"$f":"SUM(L114:L118,L121:L123)","v":104.76166244126534},null,{"$f":"L131-H131","v":2.7740718412653393},{"$f":"IF((H131)=0,\"\",(N131/H131))","v":2.7200091942022397E-2}]
[null,"HST",null,null,null,0.13,null,{"$f":"H131*F132","v":13.258386778},null,0.13,null,{"$f":"L131*J132","v":13.619016117364495},null,{"$f":"L132-H132","v":0.36062933936449504},{"$f":"IF((H132)=0,\"\",(N132/H132))","v":2.720009194202247E-2}]
[null,"Total Bill (including HST)",null,null,null,null,null,{"$f":"H131+H132","v":115.24597737800001},null,null,null,{"$f":"L131+L132","v":118.38067855862984},null,3.1347011806298326,2.720009194202239E-2]
[null,"Ontario Clean Energy Benefit 1",null,null,null,null,null,{"$f":"ROUND(-H133*10%,2)","v":-11.52},null,null,null,{"$f":"ROUND(-L133*10%,2)","v":-11.84},null,-0.32000000000000028,2.7777777777777804E-2]
[null,"Total Bill on TOU (including OCEB)",null,null,null,null,null,{"$f":"H133+H134","v":103.72597737800001},null,null,null,{"$f":"L133+L134","v":106.54067855862984},null,2.8147011806298252,2.7135933078484692E-2]
[]
[]
[null,"Loss Factor (%)",null,null,null,5.2699999999999969E-2,null,null,null,5.3971662997253311E-2]
[]
["1 Applicable to eligible customers only.  Refer to the Ontario Clean Energy Benefit Act, 2010."]
[]
["Note that the \"Charge $\" columns provide breakdowns of the amounts that each bill component contributes to the total monthly bill at the referenced "]
["consumption level at existing and proposed rates."]
[]
["Applicants must provide bill impacts for residential at 800 kWh and GS<50kW at 2000 kWh. In addition, their filing should cover the range that is relevant"]
["to their service territory, class by class. A general guideline of consumption levels follows:"]
[]
["Residential (kWh) - 100, 250, 500, 800, 1000, 1500, 2000"]
["GS<50kW (kWh) - 1000, 2000, 5000, 10000, 15000"]
["GS>50kW (kW) - 60, 100, 500, 1000"]
["Large User - range appropriate for utility"]
["Lighting Classes and USL - 150 kWh and 1 kW, range appropriate for utility."]
[]
[null,null,null,null,null,null,null,null,null,null,null,null,null,"File Number:","EB-2012-0126"]
[null,null,null,null,null,null,null,null,null,null,null,null,null,"Exhibit:",8]
[null,null,null,null,null,null,null,null,null,null,null,null,null,"Tab:",4]
[null,null,null,null,null,null,null,null,null,null,null,null,null,"Schedule:",2]
[null,null,null,null,null,null,null,null,null,null,null,null,null,"Attachment:",2]
[]
[null,null,null,null,null,null,null,null,null,null,null,null,null,"Date:","9 November, 2012"]
[]
[]
[null,"Appendix 2-W"]
[null,"Bill Impacts"]
[]
[]
[null,"Customer Class:",null,"General Service < 50 kW"]
[]
[null,null,null,"Consumption",null,2000," kWh"]
[]
[null,null,null,null,null,"Current Board-Approved",null,null,null,"Proposed",null,null,null,"Impact"]
[null,null,null,"Charge Unit",null,"Rate","Volume","Charge",null,"Rate","Volume","Charge",null,"$ Change","% Change"]
[null,null,null,null,null,"($)",null,"($)",null,"($)",null,"($)"]
[null,"Monthly Service Charge",null,"Monthly",null,21.55,1,{"$f":"G174*F174","v":21.55},null,22.09,1,{"$f":"K174*J174","v":22.09},null,{"$f":"L174-H174","v":0.53999999999999915},{"$f":"IF((H174)=0,\"\",(N174/H174))","v":2.5058004640371188E-2}]
[null,"Smart Meter Rate Adder",null,"Monthly",null,0,1,{"$f":"G175*F175","v":0},null,0,1,{"$f":"K175*J175","v":0},null,{"$f":"L175-H175","v":0},{"$f":"IF((H175)=0,\"\",(N175/H175))","v":""}]
[null,"Rate Rider for Late Payment Penalty Litigation Costs",null,"Monthly",null,0,1,0,null,0,1,{"$f":"K176*J176","v":0},null,{"$f":"L176-H176","v":0},{"$f":"IF((H176)=0,\"\",(N176/H176))","v":""}]
[null,"Distribution Volumetric Rate",null,"kWh",null,1.8599999999999998E-2,{"$f":"F169","v":2000},37.199999999999996,null,1.9099999999999999E-2,{"$f":"F169","v":2000},38.199999999999996,null,1,2.6881720430107531E-2]
[null,"Smart Meter Disposition Rider",null,"Monthly",null,0,1,0,null,5.59,1,5.59,null,5.59,""]
[null,"Rate Rider for Loss Revenue Adjustment Mechanism Recovery",null,"kWh",null,1E-4,{"$f":"F169","v":2000},0.2,null,0,{"$f":"F169","v":2000},0,null,-0.2,-1]
[null,"Rate Rider for Tax Change",null,"kWh",null,-4.0000000000000002E-4,{"$f":"F169","v":2000},-0.8,null,0,{"$f":"F169","v":2000},0,null,0.8,-1]
[null,"LV Charges",null,"kWh",null,0,{"$f":"F169","v":2000},0,null,0,{"$f":"F169","v":2000},0,null,0,""]
[null,"Stranded Assets Disposition",null,"Monthly",null,0,{"$f":"F169","v":2000},0,null,1.07,1,1.07,null,1.07,""]
[null,"Sub-Total A",null,null,null,null,null,{"$f":"SUM(H174:H182)","v":58.150000000000006},null,null,null,{"$f":"SUM(L174:L182)","v":66.949999999999989},null,8.7999999999999829,0.15133276010318111]
[null,"Rate Rider for Deferral/Variance Account Disposition",null,"kWh",null,-2.0000000000000001E-4,{"$f":"F169","v":2000},{"$f":"G184*F184","v":-0.4},null,-8.0000000000000004E-4,{"$f":"F169","v":2000},{"$f":"K184*J184","v":-1.6},null,-1.2000000000000002,{"$f":"IF((H184)=0,\"\",(N184/H184))","v":3.0000000000000004}]
[null,"Rate Rider for Global Adjustment Sub Account (Applicable only to Non-RPP Customers) ",null,"kWh",null,0,{"$f":"F169","v":2000},{"$f":"G185*F185","v":0},null,2E-3,{"$f":"F169","v":2000},{"$f":"K185*J185","v":4},null,4,{"$f":"IF((H185)=0,\"\",(N185/H185))","v":""}]
[null,"Low Voltage Service Charge",null,"kWh",null,1E-4,{"$f":"F169","v":2000},{"$f":"G186*F186","v":0.2},null,1E-4,{"$f":"F169","v":2000},{"$f":"K186*J186","v":0.2},null,0,{"$f":"IF((H186)=0,\"\",(N186/H186))","v":0}]
[null,"Smart Meter Entity Charge",null,null,null,null,null,null,null,null,{"$f":"F169","v":2000},{"$f":"K187*J187","v":0},null,0]
[null,"Sub-Total B - Distribution (includes Sub-Total A)",null,null,null,null,null,{"$f":"SUM(H183:H187)","v":57.95000000000001},null,null,null,{"$f":"SUM(L183:L187)","v":69.55},null,11.599999999999987,{"$f":"IF((H188)=0,\"\",(N188/H188))","v":0.20017256255392554}]
[null,"RTSR - Network",null,"kWh",null,4.3E-3,{"$f":"F169*(1+F215)","v":2105.4},{"$f":"G189*F189","v":9.0532199999999996},null,4.1000000000000003E-3,{"$f":"F169*(1+J215)","v":2107.9433259945067},{"$f":"K189*J189","v":8.6425676365774784},null,-0.4106523634225212,-4.5359812687918909E-2]
[null,"RTSR - Line and Transformation Connection",null,"kWh",null,2.7000000000000001E-3,{"$f":"G189","v":2105.4},{"$f":"G190*F190","v":5.6845800000000004},null,2.5999999999999999E-3,{"$f":"K189","v":2107.9433259945067},{"$f":"K190*J190","v":5.4806526475857176},null,-0.20392735241428284,-3.5873776499632838E-2]
[null,"Sub-Total C - Delivery (including Sub-Total B)",null,null,null,null,null,{"$f":"SUM(H188:H190)","v":72.68780000000001},null,null,null,{"$f":"SUM(L188:L190)","v":83.673220284163193},null,10.985420284163183,0.15113155555902341]
[null,"Wholesale Market Service Charge (WMSC)",null,"kWh",null,5.1999999999999998E-3,{"$f":"F169*(1+F215)","v":2105.4},{"$f":"G192*F192","v":10.948079999999999},null,5.1999999999999998E-3,{"$f":"F169*(1+J215)","v":2107.9433259945067},{"$f":"K192*J192","v":10.961305295171435},null,1.3225295171436002E-2,1.208001327304514E-3]
[null,"Rural and Remote Rate Protection (RRRP)",null,"kWh",null,1.1000000000000001E-3,{"$f":"F169*(1+F215)","v":2105.4},2.3159400000000003,null,1.1000000000000001E-3,{"$f":"F169*(1+J215)","v":2107.9433259945067},2.3187376585939576,null,2.7976585939573084E-3,1.2080013273043809E-3]
[null,"Standard Supply Service Charge",null,null,null,null,1,0,null,null,1,0,null,0,""]
[null,"Debt Retirement Charge (DRC)",null,"kWh",null,7.0000000000000001E-3,{"$f":"F169","v":2000},14,null,7.0000000000000001E-3,{"$f":"F169","v":2000},14,null,0,0]
[null,"Energy - RPP - Tier 1",null,"kWh",null,6.5000000000000002E-2,{"$f":"IF($G$192>=750,750,$G$192)","v":750},{"$f":"G196*F196","v":48.75},null,6.5000000000000002E-2,{"$f":"IF($K$192>=750,750,$K$192)","v":750},{"$f":"K196*J196","v":48.75},null,0,0]
[null,"Energy - RPP - Tier 2",null,"kWh",null,7.4999999999999997E-2,{"$f":"IF($G$192>=750,$G$192-750,0)","v":1355.4},{"$f":"G197*F197","v":101.655},null,7.4999999999999997E-2,{"$f":"IF($K$192>=750,$K$192-750,0)","v":1357.9433259945067},{"$f":"K197*J197","v":101.845749449588},null,0.19074944958799733,1.8764394234223336E-3]
[null,"TOU - Off Peak",null,"kWh",null,6.5000000000000002E-2,{"$f":"0.64*$G$192","v":1347.4560000000001},87.584640000000007,null,6.5000000000000002E-2,{"$f":"0.64*$K$192","v":1349.0837286364842},87.690442361371481,null,0.10580236137147381,1.2080013273043516E-3]
[null,"TOU - Mid Peak",null,"kWh",null,0.1,{"$f":"0.18*$G$192","v":378.97199999999998},37.897199999999998,null,0.1,{"$f":"0.18*$K$192","v":379.42979867901118},37.942979867901123,null,4.577986790112476E-2,1.2080013273045175E-3]
[null,"TOU - On Peak",null,"kWh",null,0.11700000000000001,{"$f":"0.18*$G$192","v":378.97199999999998},44.339723999999997,null,0.11700000000000001,{"$f":"0.18*$K$192","v":379.42979867901118},44.393286445444311,null,5.3562445444313767E-2,1.2080013273044678E-3]
[]
[null,"Total Bill on RPP (before Taxes)",null,null,null,null,null,{"$f":"SUM(H191:H197)","v":250.35682},null,null,null,{"$f":"SUM(L191:L197)","v":261.54901268751655},null,11.192192687516552,4.4704964248693337E-2]
[null,"HST",null,null,null,0.13,null,{"$f":"H202*F203","v":32.546386599999998},null,0.13,null,{"$f":"L202*J203","v":34.001371649377155},null,1.4549850493771572,4.4704964248693503E-2]
[null,"Total Bill (including HST)",null,null,null,null,null,{"$f":"H202+H203","v":282.90320659999998},null,null,null,{"$f":"L202+L203","v":295.55038433689373},null,12.647177736893752,4.470496424869351E-2]
[null,"Ontario Clean Energy Benefit 1",null,null,null,null,null,{"$f":"ROUND(-H204*10%,2)","v":-28.29},null,null,null,{"$f":"ROUND(-L204*10%,2)","v":-29.56},null,-1.2699999999999996,4.4892188052315291E-2]
[null,"Total Bill on RPP (including OCEB)",null,null,null,null,null,{"$f":"SUM(H204:H205)","v":254.61320659999998},null,null,null,{"$f":"SUM(L204:L205)","v":265.99038433689373},null,11.377177736893742,4.4684161865835216E-2]
[]
[null,"Total Bill on TOU (before Taxes)",null,null,null,null,null,{"$f":"SUM(H191:H195,H198:H200)","v":269.77338400000002},null,null,null,{"$f":"SUM(L191:L195,L198:L200)","v":280.97997191264551},null,{"$f":"L208-H208","v":11.206587912645489},{"$f":"IF((H208)=0,\"\",(N208/H208))","v":4.1540747076240433E-2}]
[null,"HST",null,null,null,0.13,null,{"$f":"H208*F209","v":35.070539920000002},null,0.13,null,{"$f":"L208*J209","v":36.527396348643919},null,1.456856428643917,4.1540747076240531E-2]
[null,"Total Bill (including HST)",null,null,null,null,null,{"$f":"H208+H209","v":304.84392392000001},null,null,null,{"$f":"L208+L209","v":317.50736826128946},null,12.663444341289448,4.1540747076240586E-2]
[null,"Ontario Clean Energy Benefit 1",null,null,null,null,null,{"$f":"ROUND(-H210*10%,2)","v":-30.48},null,null,null,{"$f":"ROUND(-L210*10%,2)","v":-31.75},null,-1.2699999999999996,4.166666666666665E-2]
[null,"Total Bill on TOU (including OCEB)",null,null,null,null,null,{"$f":"H210+H211","v":274.36392391999999},null,null,null,{"$f":"L210+L211","v":285.75736826128946},null,11.393444341289467,4.1526758250518415E-2]
[]
[]
[null,"Loss Factor (%)",null,null,null,5.2699999999999969E-2,null,null,null,5.3971662997253311E-2]
[]
["1 Applicable to eligible customers only.  Refer to the Ontario Clean Energy Benefit Act, 2010."]
[]
["Note that the \"Charge $\" columns provide breakdowns of the amounts that each bill component contributes to the total monthly bill at the referenced "]
["consumption level at existing and proposed rates."]
[]
["Applicants must provide bill impacts for residential at 800 kWh and GS<50kW at 2000 kWh. In addition, their filing should cover the range that is relevant"]
["to their service territory, class by class. A general guideline of consumption levels follows:"]
[]
["Residential (kWh) - 100, 250, 500, 800, 1000, 1500, 2000"]
["GS<50kW (kWh) - 1000, 2000, 5000, 10000, 15000"]
["GS>50kW (kW) - 60, 100, 500, 1000"]
["Large User - range appropriate for utility"]
["Lighting Classes and USL - 150 kWh and 1 kW, range appropriate for utility."]
[]
[null,null,null,null,null,null,null,null,null,null,null,null,null,"File Number:","EB-2012-0126"]
[null,null,null,null,null,null,null,null,null,null,null,null,null,"Exhibit:",8]
[null,null,null,null,null,null,null,null,null,null,null,null,null,"Tab:",4]
[null,null,null,null,null,null,null,null,null,null,null,null,null,"Schedule:",2]
[null,null,null,null,null,null,null,null,null,null,null,null,null,"Attachment:",2]
[]
[null,null,null,null,null,null,null,null,null,null,null,null,null,"Date:","9 November, 2012"]
[]
[]
[null,"Appendix 2-W"]
[null,"Bill Impacts"]
[]
[]
[null,"Customer Class:",null,"General Service < 50 kW"]
[]
[null,null,null,"Consumption",null,5000," kWh"]
[]
[null,null,null,null,null,"Current Board-Approved",null,null,null,"Proposed",null,null,null,"Impact"]
[null,null,null,"Charge Unit",null,"Rate","Volume","Charge",null,"Rate","Volume","Charge",null,"$ Change","% Change"]
[null,null,null,null,null,"($)",null,"($)",null,"($)",null,"($)"]
[null,"Monthly Service Charge",null,"Monthly",null,21.55,1,{"$f":"G251*F251","v":21.55},null,22.09,1,{"$f":"K251*J251","v":22.09},null,{"$f":"L251-H251","v":0.53999999999999915},{"$f":"IF((H251)=0,\"\",(N251/H251))","v":2.5058004640371188E-2}]
[null,"Smart Meter Rate Adder",null,"Monthly",null,0,1,{"$f":"G252*F252","v":0},null,0,1,{"$f":"K252*J252","v":0},null,{"$f":"L252-H252","v":0},{"$f":"IF((H252)=0,\"\",(N252/H252))","v":""}]
[null,"Rate Rider for Late Payment Penalty Litigation Costs",null,"Monthly",null,0,1,0,null,0,1,{"$f":"K253*J253","v":0},null,{"$f":"L253-H253","v":0},{"$f":"IF((H253)=0,\"\",(N253/H253))","v":""}]
[null,"Distribution Volumetric Rate",null,"kWh",null,1.8599999999999998E-2,{"$f":"F246","v":5000},92.999999999999986,null,1.9099999999999999E-2,{"$f":"F246","v":5000},95.5,null,2.5000000000000142,2.6881720430107683E-2]
[null,"Smart Meter Disposition Rider",null,"Monthly",null,0,1,0,null,5.59,1,5.59,null,5.59,""]
[null,"Rate Rider for Loss Revenue Adjustment Mechanism Recovery",null,"kWh",null,1E-4,{"$f":"F246","v":5000},0.5,null,0,{"$f":"F246","v":5000},0,null,-0.5,-1]
[null,"Rate Rider for Tax Change",null,"kWh",null,-4.0000000000000002E-4,{"$f":"F246","v":5000},-2,null,0,{"$f":"F246","v":5000},0,null,2,-1]
[null,"LV Charges",null,"kWh",null,0,{"$f":"F246","v":5000},0,null,0,{"$f":"F246","v":5000},0,null,0,""]
[null,"Stranded Assets Disposition",null,"Monthly",null,0,{"$f":"F246","v":5000},0,null,1.07,1,1.07,null,1.07,""]
[null,"Sub-Total A",null,null,null,null,null,{"$f":"SUM(H251:H259)","v":113.04999999999998},null,null,null,{"$f":"SUM(L251:L259)","v":124.25},null,11.200000000000017,9.907120743034073E-2]
[null,"Rate Rider for Deferral/Variance Account Disposition",null,"kWh",null,-2.0000000000000001E-4,{"$f":"F246","v":5000},{"$f":"G261*F261","v":-1},null,-8.0000000000000004E-4,{"$f":"F246","v":5000},{"$f":"K261*J261","v":-4},null,-3,{"$f":"IF((H261)=0,\"\",(N261/H261))","v":3}]
[null,"Rate Rider for Global Adjustment Sub Account (Applicable only to Non-RPP Customers) ",null,"kWh",null,0,{"$f":"F246","v":5000},{"$f":"G262*F262","v":0},null,2E-3,{"$f":"F246","v":5000},{"$f":"K262*J262","v":10},null,10,{"$f":"IF((H262)=0,\"\",(N262/H262))","v":""}]
[null,"Low Voltage Service Charge",null,"kWh",null,1E-4,{"$f":"F246","v":5000},{"$f":"G263*F263","v":0.5},null,1E-4,{"$f":"F246","v":5000},{"$f":"K263*J263","v":0.5},null,0,{"$f":"IF((H263)=0,\"\",(N263/H263))","v":0}]
[null,"Smart Meter Entity Charge",null,null,null,null,null,null,null,null,{"$f":"F246","v":5000},{"$f":"K264*J264","v":0},null,0]
[null,"Sub-Total B - Distribution (includes Sub-Total A)",null,null,null,null,null,{"$f":"SUM(H260:H264)","v":112.54999999999998},null,null,null,{"$f":"SUM(L260:L264)","v":130.75},null,18.200000000000017,{"$f":"IF((H265)=0,\"\",(N265/H265))","v":0.1617059084851179}]
[null,"RTSR - Network",null,"kWh",null,4.3E-3,{"$f":"F246*(1+F292)","v":5263.5},{"$f":"G266*F266","v":22.633050000000001},null,4.1000000000000003E-3,{"$f":"F246*(1+J292)","v":5269.8583149862661},{"$f":"K266*J266","v":21.606419091443694},null,-1.0266309085563066,-4.5359812687919061E-2]
[null,"RTSR - Line and Transformation Connection",null,"kWh",null,2.7000000000000001E-3,{"$f":"G266","v":5263.5},{"$f":"G267*F267","v":14.211450000000001},null,2.5999999999999999E-3,{"$f":"K266","v":5269.8583149862661},{"$f":"K267*J267","v":13.701631618964292},null,-0.50981838103570887,-3.5873776499632963E-2]
[null,"Sub-Total C - Delivery (including Sub-Total B)",null,null,null,null,null,{"$f":"SUM(H265:H267)","v":149.39449999999999},null,null,null,{"$f":"SUM(L265:L267)","v":166.05805071040797},null,16.663550710407975,0.11154059025203723]
[null,"Wholesale Market Service Charge (WMSC)",null,"kWh",null,5.1999999999999998E-3,{"$f":"F246*(1+F292)","v":5263.5},{"$f":"G269*F269","v":27.370199999999997},null,5.1999999999999998E-3,{"$f":"F246*(1+J292)","v":5269.8583149862661},{"$f":"K269*J269","v":27.403263237928584},null,3.3063237928587341E-2,1.2080013273044166E-3]
[null,"Rural and Remote Rate Protection (RRRP)",null,"kWh",null,1.1000000000000001E-3,{"$f":"F246*(1+F292)","v":5263.5},5.7898500000000004,null,1.1000000000000001E-3,{"$f":"F246*(1+J292)","v":5269.8583149862661},5.7968441464848928,null,6.9941464848923829E-3,1.2080013273042276E-3]
[null,"Standard Supply Service Charge",null,null,null,null,1,0,null,null,1,0,null,0,""]
[null,"Debt Retirement Charge (DRC)",null,"kWh",null,7.0000000000000001E-3,{"$f":"F246","v":5000},35,null,7.0000000000000001E-3,{"$f":"F246","v":5000},35,null,0,0]
[null,"Energy - RPP - Tier 1",null,"kWh",null,6.5000000000000002E-2,{"$f":"IF($G$192>=750,750,$G$192)","v":750},{"$f":"G273*F273","v":48.75},null,6.5000000000000002E-2,{"$f":"IF($K$192>=750,750,$K$192)","v":750},{"$f":"K273*J273","v":48.75},null,0,0]
[null,"Energy - RPP - Tier 2",null,"kWh",null,7.4999999999999997E-2,{"$f":"IF($G$192>=750,$G$192-750,0)","v":1355.4},{"$f":"G274*F274","v":101.655},null,7.4999999999999997E-2,{"$f":"IF($K$192>=750,$K$192-750,0)","v":1357.9433259945067},{"$f":"K274*J274","v":101.845749449588},null,0.19074944958799733,1.8764394234223336E-3]
[null,"TOU - Off Peak",null,"kWh",null,6.5000000000000002E-2,{"$f":"0.64*$G$192","v":1347.4560000000001},{"$f":"G275*F275","v":87.584640000000007},null,6.5000000000000002E-2,{"$f":"0.64*$K$192","v":1349.0837286364842},{"$f":"K275*J275","v":87.690442361371481},null,0.10580236137147381,1.2080013273043516E-3]
[null,"TOU - Mid Peak",null,"kWh",null,0.1,{"$f":"0.18*$G$192","v":378.97199999999998},37.897199999999998,null,0.1,{"$f":"0.18*$K$192","v":379.42979867901118},37.942979867901123,null,4.577986790112476E-2,1.2080013273045175E-3]
[null,"TOU - On Peak",null,"kWh",null,0.11700000000000001,{"$f":"0.18*$G$192","v":378.97199999999998},44.339723999999997,null,0.11700000000000001,{"$f":"0.18*$K$192","v":379.42979867901118},44.393286445444311,null,5.3562445444313767E-2,1.2080013273044678E-3]
[]
[null,"Total Bill on RPP (before Taxes)",null,null,null,null,null,{"$f":"SUM(H268:H274)","v":367.95955000000004},null,null,null,{"$f":"SUM(L268:L274)","v":384.85390754440948},null,{"$f":"L279-H279","v":16.894357544409445},{"$f":"IF((H279)=0,\"\",(N279/H279))","v":4.5913627039736955E-2}]
[null,"HST",null,null,null,0.13,null,{"$f":"H279*F280","v":47.834741500000007},null,0.13,null,{"$f":"L279*J280","v":50.031007980773232},null,2.1962664807732253,4.59136270397369E-2]
[null,"Total Bill (including HST)",null,null,null,null,null,{"$f":"H279+H280","v":415.79429150000004},null,null,null,{"$f":"L279+L280","v":434.88491552518269},null,19.090624025182649,4.59136270397369E-2]
[null,"Ontario Clean Energy Benefit 1",null,null,null,null,null,{"$f":"ROUND(-H281*10%,2)","v":-41.58},null,null,null,{"$f":"ROUND(-L281*10%,2)","v":-43.49},null,-1.9100000000000037,4.5935545935546024E-2]
[null,"Total Bill on RPP (including OCEB)",null,null,null,null,null,{"$f":"SUM(H281:H282)","v":374.21429150000006},null,null,null,{"$f":"SUM(L281:L282)","v":391.39491552518268},null,17.180624025182624,4.5911191569717541E-2]
[]
[null,"Total Bill on TOU (before Taxes)",null,null,null,null,null,{"$f":"SUM(H268:H272,H275:H277)","v":387.37611399999997},null,null,null,{"$f":"SUM(L268:L272,L275:L277)","v":404.28486676953833},null,{"$f":"L285-H285","v":16.908752769538353},{"$f":"IF((H285)=0,\"\",(N285/H285))","v":4.3649445999497931E-2}]
[null,"HST",null,null,null,0.13,null,{"$f":"H285*F286","v":50.358894819999996},null,0.13,null,{"$f":"L285*J286","v":52.557032680039981},null,{"$f":"L286-H286","v":2.198137860039985},{"$f":"IF((H286)=0,\"\",(N286/H286))","v":4.364944599949791E-2}]
[null,"Total Bill (including HST)",null,null,null,null,null,{"$f":"H285+H286","v":437.73500881999996},null,null,null,{"$f":"L285+L286","v":456.84189944957831},null,19.106890629578345,4.3649445999497945E-2]
[null,"Ontario Clean Energy Benefit 1",null,null,null,null,null,{"$f":"ROUND(-H287*10%,2)","v":-43.77},null,null,null,{"$f":"ROUND(-L287*10%,2)","v":-45.68},null,-1.9099999999999966,4.3637194425405451E-2]
[null,"Total Bill on TOU (including OCEB)",null,null,null,null,null,{"$f":"H287+H288","v":393.96500881999998},null,null,null,{"$f":"L287+L288","v":411.1618994495783},null,17.19689062957832,4.3650807164540506E-2]
[]
[]
[null,"Loss Factor (%)",null,null,null,5.2699999999999969E-2,null,null,null,5.3971662997253311E-2]
[]
["1 Applicable to eligible customers only.  Refer to the Ontario Clean Energy Benefit Act, 2010."]
[]
["Note that the \"Charge $\" columns provide breakdowns of the amounts that each bill component contributes to the total monthly bill at the referenced "]
["consumption level at existing and proposed rates."]
[]
["Applicants must provide bill impacts for residential at 800 kWh and GS<50kW at 2000 kWh. In addition, their filing should cover the range that is relevant"]
["to their service territory, class by class. A general guideline of consumption levels follows:"]
[]
["Residential (kWh) - 100, 250, 500, 800, 1000, 1500, 2000"]
["GS<50kW (kWh) - 1000, 2000, 5000, 10000, 15000"]
["GS>50kW (kW) - 60, 100, 500, 1000"]
["Large User - range appropriate for utility"]
["Lighting Classes and USL - 150 kWh and 1 kW, range appropriate for utility."]
[]
[null,null,null,null,null,null,null,null,null,null,null,null,null,"File Number:","EB-2012-0126"]
[null,null,null,null,null,null,null,null,null,null,null,null,null,"Exhibit:",8]
[null,null,null,null,null,null,null,null,null,null,null,null,null,"Tab:",4]
[null,null,null,null,null,null,null,null,null,null,null,null,null,"Schedule:",2]
[null,null,null,null,null,null,null,null,null,null,null,null,null,"Attachment:",2]
[]
[null,null,null,null,null,null,null,null,null,null,null,null,null,"Date:","9 November, 2012"]
[]
[]
[null,"Appendix 2-W"]
[null,"Bill Impacts"]
[]
[]
[null,"Customer Class:",null,"General Service > 50 to 4999 kW"]
[]
[null,null,null,"Consumption",null,68500," kWh"]
[]
[null,null,null,null,null,"Current Board-Approved",null,null,null,"Proposed",null,null,null,"Impact"]
[null,null,null,"Charge Unit",null,"Rate","Volume","Charge",null,"Rate","Volume","Charge",null,"$ Change","% Change"]
[null,null,null,null,null,"($)",null,"($)",null,"($)",null,"($)"]
[null,"Monthly Service Charge",null,"Monthly",null,164.49,1,{"$f":"G328*F328","v":164.49},null,170.61,1,{"$f":"K328*J328","v":170.61},null,{"$f":"L328-H328","v":6.1200000000000045},{"$f":"IF((H328)=0,\"\",(N328/H328))","v":3.7205909173809983E-2}]
[null,"Smart Meter Rate Adder",null,"Monthly",null,0,1,{"$f":"G329*F329","v":0},null,0,1,{"$f":"K329*J329","v":0},null,{"$f":"L329-H329","v":0},{"$f":"IF((H329)=0,\"\",(N329/H329))","v":""}]
[null,"Rate Rider for Late Payment Penalty Litigation Costs",null,"Monthly",null,0,1,0,null,0,1,{"$f":"K330*J330","v":0},null,{"$f":"L330-H330","v":0},{"$f":"IF((H330)=0,\"\",(N330/H330))","v":""}]
[null,"Distribution Volumetric Rate",null,"kW",null,4.2709000000000001,190,811.471,null,4.4246999999999996,190,840.69299999999998,null,29.22199999999998,3.6011145191879909E-2]
[null,"Smart Meter Disposition Rider",null,"Monthly",null,0,1,0,null,0,1,0,null,0,""]
[null,"Rate Rider for Loss Revenue Adjustment Mechanism Recovery",null,"kW",null,2.12E-2,190,4.0279999999999996,null,0,190,0,null,-4.0279999999999996,-1]
[null,"Rate Rider for Tax Change",null,"kW",null,-8.7900000000000006E-2,190,-16.701000000000001,null,0,190,0,null,16.701000000000001,-1]
[null,"LV Charges",null,"kW",null,0,190,0,null,0,190,0,null,0,""]
[null,"Stranded Assets Disposition",null,"Monthly",null,0,190,0,null,0,190,0,null,0,""]
[null,"Sub-Total A",null,null,null,null,null,{"$f":"SUM(H328:H336)","v":963.28800000000001},null,null,null,{"$f":"SUM(L328:L336)","v":1011.303},null,48.014999999999986,4.9844906196277732E-2]
[null,"Rate Rider for Deferral/Variance Account Disposition",null,"kW",null,-3.0800000000000001E-2,190,{"$f":"G338*F338","v":-5.8520000000000003},null,-0.2918,190,{"$f":"K338*J338","v":-55.442},null,-49.59,{"$f":"IF((H338)=0,\"\",(N338/H338))","v":8.4740259740259738}]
[null,"Rate Rider for Global Adjustment Sub Account (Applicable only to Non-RPP Customers) ",null,"kW",null,0,190,{"$f":"G339*F339","v":0},null,0.81640000000000001,190,{"$f":"K339*J339","v":155.11600000000001},null,155.11600000000001,{"$f":"IF((H339)=0,\"\",(N339/H339))","v":""}]
[null,"Low Voltage Service Charge",null,"kW",null,9.3700000000000006E-2,190,{"$f":"G340*F340","v":17.803000000000001},null,0.1027,190,{"$f":"K340*J340","v":19.513000000000002},null,1.7100000000000009,{"$f":"IF((H340)=0,\"\",(N340/H340))","v":9.6051227321238039E-2}]
[null,"Smart Meter Entity Charge",null,null,null,null,null,null,null,null,{"$f":"F323","v":68500},{"$f":"K341*J341","v":0},null,0]
[null,"Sub-Total B - Distribution (includes Sub-Total A)",null,null,null,null,null,{"$f":"SUM(H337:H341)","v":975.23900000000003},null,null,null,{"$f":"SUM(L337:L341)","v":1130.49},null,155.25099999999998,{"$f":"IF((H342)=0,\"\",(N342/H342))","v":0.15919277223326792}]
[null,"RTSR - Network",null,"kW",null,3.2978999999999998,{"$f":"190","v":190},{"$f":"G343*F343","v":626.601},null,3.1753,{"$f":"190","v":190},{"$f":"K343*J343","v":603.30700000000002},null,-23.293999999999983,-3.7175172079201887E-2]
[null,"RTSR - Line and Transformation Connection",null,"kW",null,2.0400999999999998,{"$f":"G343","v":190},{"$f":"G344*F344","v":387.61899999999997},null,1.9917,{"$f":"K343","v":190},{"$f":"K344*J344","v":378.423},null,-9.1959999999999695,-2.3724327238860764E-2]
[null,"Sub-Total C - Delivery (including Sub-Total B)",null,null,null,null,null,{"$f":"SUM(H342:H344)","v":1989.4590000000001},null,null,null,{"$f":"SUM(L342:L344)","v":2112.2200000000003},null,122.76100000000019,6.1705719997245577E-2]
[null,"Wholesale Market Service Charge (WMSC)",null,"kWh",null,5.1999999999999998E-3,{"$f":"F323*(1+F369)","v":72109.95},{"$f":"G346*F346","v":374.97173999999995},null,5.1999999999999998E-3,{"$f":"F323*(1+J369)","v":72197.058915311849},{"$f":"K346*J346","v":375.42470635962161},null,0.4529663596216551,1.2080013273044394E-3]
[null,"Rural and Remote Rate Protection (RRRP)",null,"kWh",null,1.1000000000000001E-3,{"$f":"F323*(1+F369)","v":72109.95},79.320944999999995,null,1.1000000000000001E-3,{"$f":"F323*(1+J369)","v":72197.058915311849},79.416764806843034,null,9.5819806843039146E-2,1.208001327304398E-3]
[null,"Standard Supply Service Charge",null,null,null,null,1,0,null,null,1,0,null,0,""]
[null,"Debt Retirement Charge (DRC)",null,"kWh",null,7.0000000000000001E-3,{"$f":"F323","v":68500},479.5,null,7.0000000000000001E-3,{"$f":"F323","v":68500},479.5,null,0,0]
[null,"Energy - RPP - Tier 1",null,"kWh",null,6.5000000000000002E-2,{"$f":"IF($G$346>=750,750,$G$346)","v":750},{"$f":"G350*F350","v":48.75},null,6.5000000000000002E-2,{"$f":"IF($K$346>=750,750,$K$346)","v":750},{"$f":"K350*J350","v":48.75},null,0,0]
[null,"Energy - RPP - Tier 2",null,"kWh",null,7.4999999999999997E-2,{"$f":"IF($G$346>=750,$G$346-750,0)","v":71359.95},{"$f":"G351*F351","v":5351.9962499999992},null,7.4999999999999997E-2,{"$f":"IF($K$346>=750,$K$346-750,0)","v":71447.058915311849},{"$f":"K351*J351","v":5358.5294186483889},null,6.5331686483896192,1.220697538491291E-3]
[null,"TOU - Off Peak",null,"kWh",null,6.5000000000000002E-2,{"$f":"0.64*$G$346","v":46150.368000000002},2999.7739200000001,null,6.5000000000000002E-2,{"$f":"0.64*$K$346","v":46206.117705799581},3003.3976508769729,null,3.6237308769727861,1.2080013273042876E-3]
[null,"TOU - Mid Peak",null,"kWh",null,0.1,{"$f":"0.18*$G$346","v":12979.790999999999},1297.9791,null,0.1,{"$f":"0.18*$K$346","v":12995.470604756132},1299.5470604756133,null,1.5679604756132903,1.2080013273043381E-3]
[null,"TOU - On Peak",null,"kWh",null,0.11700000000000001,{"$f":"0.18*$G$346","v":12979.790999999999},1518.6355470000001,null,0.11700000000000001,{"$f":"0.18*$K$346","v":12995.470604756132},1520.4700607564675,null,1.8345137564674587,1.2080013273042783E-3]
[]
[null,"Total Bill on RPP (before Taxes)",null,null,null,null,null,{"$f":"SUM(H345:H351)","v":8323.9979349999994},null,null,null,{"$f":"SUM(L345:L351)","v":8453.8408898148537},null,129.84295481485424,1.5598628907499152E-2]
[null,"HST",null,null,null,0.13,null,{"$f":"H356*F357","v":1082.1197315499999},null,0.13,null,{"$f":"L356*J357","v":1098.999315675931},null,16.87958412593116,1.5598628907499254E-2]
[null,"Total Bill (including HST)",null,null,null,null,null,{"$f":"H356+H357","v":9406.1176665499988},null,null,null,{"$f":"L356+L357","v":9552.8402054907856},null,146.72253894078676,1.559862890749931E-2]
[null,"Ontario Clean Energy Benefit 1",null,null,null,null,null,{"$f":"ROUND(-H358*10%,2)","v":-940.61},null,null,null,{"$f":"ROUND(-L358*10%,2)","v":-955.28},null,-14.669999999999959,1.5596262000191322E-2]
[null,"Total Bill on RPP (including OCEB)",null,null,null,null,null,{"$f":"SUM(H358:H359)","v":8465.5076665499982},null,null,null,{"$f":"SUM(L358:L359)","v":8597.5602054907849},null,132.05253894078669,1.5598891896651356E-2]
[]
[null,"Total Bill on TOU (before Taxes)",null,null,null,null,null,{"$f":"SUM(H345:H349,H352:H354)","v":8739.6402519999992},null,null,null,{"$f":"SUM(L345:L349,L352:L354)","v":8869.9762432755197},null,{"$f":"L362-H362","v":130.33599127552043},{"$f":"IF((H362)=0,\"\",(N362/H362))","v":1.4913198657770157E-2}]
[null,"HST",null,null,null,0.13,null,{"$f":"H362*F363","v":1136.15323276},null,0.13,null,{"$f":"L362*J363","v":1153.0969116258175},null,16.943678865817446,1.4913198657769971E-2]
[null,"Total Bill (including HST)",null,null,null,null,null,{"$f":"H362+H363","v":9875.793484759999},null,null,null,{"$f":"L362+L363","v":10023.073154901336},null,147.27967014133719,1.4913198657770067E-2]
[null,"Ontario Clean Energy Benefit 1",null,null,null,null,null,{"$f":"ROUND(-H364*10%,2)","v":-987.58},null,null,null,{"$f":"ROUND(-L364*10%,2)","v":-1002.31},null,-14.729999999999905,1.4915247372364673E-2]
[null,"Total Bill on TOU (including OCEB)",null,null,null,null,null,{"$f":"H364+H365","v":8888.2134847599991},null,null,null,{"$f":"L364+L365","v":9020.7631549013367},null,132.54967014133763,1.4912971022648288E-2]
[]
[]
[null,"Loss Factor (%)",null,null,null,5.2699999999999969E-2,null,null,null,5.3971662997253311E-2]
[]
["1 Applicable to eligible customers only.  Refer to the Ontario Clean Energy Benefit Act, 2010."]
[]
["Note that the \"Charge $\" columns provide breakdowns of the amounts that each bill component contributes to the total monthly bill at the referenced "]
["consumption level at existing and proposed rates."]
[]
["Applicants must provide bill impacts for residential at 800 kWh and GS<50kW at 2000 kWh. In addition, their filing should cover the range that is relevant"]
["to their service territory, class by class. A general guideline of consumption levels follows:"]
[]
["Residential (kWh) - 100, 250, 500, 800, 1000, 1500, 2000"]
["GS<50kW (kWh) - 1000, 2000, 5000, 10000, 15000"]
["GS>50kW (kW) - 60, 100, 500, 1000"]
["Large User - range appropriate for utility"]
["Lighting Classes and USL - 150 kWh and 1 kW, range appropriate for utility."]
[]
[null,null,null,null,null,null,null,null,null,null,null,null,null,"File Number:","EB-2012-0126"]
[null,null,null,null,null,null,null,null,null,null,null,null,null,"Exhibit:",8]
[null,null,null,null,null,null,null,null,null,null,null,null,null,"Tab:",4]
[null,null,null,null,null,null,null,null,null,null,null,null,null,"Schedule:",2]
[null,null,null,null,null,null,null,null,null,null,null,null,null,"Attachment:",2]
[]
[null,null,null,null,null,null,null,null,null,null,null,null,null,"Date:","9 November, 2012"]
[]
[]
[null,"Appendix 2-W"]
[null,"Bill Impacts"]
[]
[]
[null,"Customer Class:",null,"Unmetered Scattered Load"]
[]
[null,null,null,"Consumption",null,397," kWh"]
[]
[null,null,null,null,null,"Current Board-Approved",null,null,null,"Proposed",null,null,null,"Impact"]
[null,null,null,"Charge Unit",null,"Rate","Volume","Charge",null,"Rate","Volume","Charge",null,"$ Change","% Change"]
[null,null,null,null,null,"($)",null,"($)",null,"($)",null,"($)"]
[null,"Monthly Service Charge",null,"Monthly",null,8.0500000000000007,1,{"$f":"G405*F405","v":8.0500000000000007},null,7.64,1,{"$f":"K405*J405","v":7.64},null,{"$f":"L405-H405","v":-0.41000000000000103},{"$f":"IF((H405)=0,\"\",(N405/H405))","v":-5.0931677018633666E-2}]
[null,"Smart Meter Rate Adder",null,"Monthly",null,0,1,{"$f":"G406*F406","v":0},null,0,1,{"$f":"K406*J406","v":0},null,{"$f":"L406-H406","v":0},{"$f":"IF((H406)=0,\"\",(N406/H406))","v":""}]
[null,"Rate Rider for Late Payment Penalty Litigation Costs",null,"Monthly",null,0,1,0,null,0,1,{"$f":"K407*J407","v":0},null,{"$f":"L407-H407","v":0},{"$f":"IF((H407)=0,\"\",(N407/H407))","v":""}]
[null,"Distribution Volumetric Rate",null,"kWh",null,1.23E-2,{"$f":"F400","v":397},4.8830999999999998,null,1.17E-2,{"$f":"F400","v":397},4.6448999999999998,null,-0.23819999999999997,-4.8780487804878044E-2]
[null,"Smart Meter Disposition Rider",null,"Monthly",null,0,1,0,null,0,1,0,null,0,""]
[null,"Rate Rider for Loss Revenue Adjustment Mechanism Recovery",null,"kWh",null,0,{"$f":"F400","v":397},0,null,0,{"$f":"F400","v":397},0,null,0,""]
[null,"Rate Rider for Tax Change",null,"kWh",null,-4.0000000000000002E-4,{"$f":"F400","v":397},-0.1588,null,0,{"$f":"F400","v":397},0,null,0.1588,-1]
[null,"LV Charges",null,"kWh",null,0,{"$f":"F400","v":397},0,null,0,{"$f":"F400","v":397},0,null,0,""]
[null,"Stranded Assets Disposition",null,"Monthly",null,0,{"$f":"F400","v":397},0,null,0,{"$f":"F400","v":397},0,null,0,""]
[null,"Sub-Total A",null,null,null,null,null,{"$f":"SUM(H405:H413)","v":12.7743},null,null,null,{"$f":"SUM(L405:L413)","v":12.2849},null,-0.48939999999999984,-3.8311296900808645E-2]
[null,"Rate Rider for Deferral/Variance Account Disposition",null,"kWh",null,-2.0000000000000001E-4,{"$f":"F400","v":397},{"$f":"G415*F415","v":-7.9399999999999998E-2},null,-1.6999999999999999E-3,{"$f":"F400","v":397},{"$f":"K415*J415","v":-0.67489999999999994},null,-0.59549999999999992,{"$f":"IF((H415)=0,\"\",(N415/H415))","v":7.4999999999999991}]
[null,"Rate Rider for Global Adjustment Sub Account (Applicable only to Non-RPP Customers) ",null,"kWh",null,0,{"$f":"F400","v":397},{"$f":"G416*F416","v":0},null,2E-3,{"$f":"F400","v":397},{"$f":"K416*J416","v":0.79400000000000004},null,0.79400000000000004,{"$f":"IF((H416)=0,\"\",(N416/H416))","v":""}]
[null,"Low Voltage Service Charge",null,"kWh",null,1E-4,{"$f":"F400","v":397},{"$f":"G417*F417","v":3.9699999999999999E-2},null,1E-4,{"$f":"F400","v":397},{"$f":"K417*J417","v":3.9699999999999999E-2},null,0,{"$f":"IF((H417)=0,\"\",(N417/H417))","v":0}]
[null,"Smart Meter Entity Charge",null,null,null,null,null,null,null,null,{"$f":"F400","v":397},{"$f":"K418*J418","v":0},null,0]
[null,"Sub-Total B - Distribution (includes Sub-Total A)",null,null,null,null,null,{"$f":"SUM(H414:H418)","v":12.7346},null,null,null,{"$f":"SUM(L414:L418)","v":12.443700000000002},null,-0.29089999999999883,{"$f":"IF((H419)=0,\"\",(N419/H419))","v":-2.2843277370313855E-2}]
[null,"RTSR - Network",null,"kWh",null,4.3E-3,{"$f":"F400*(1+F446)","v":417.92189999999999},{"$f":"G420*F420","v":1.7970641700000001},null,4.1000000000000003E-3,{"$f":"F400*(1+J446)","v":418.42675020990959},{"$f":"K420*J420","v":1.7155496758606295},null,-8.1514494139370619E-2,-4.5359812687918992E-2]
[null,"RTSR - Line and Transformation Connection",null,"kWh",null,2.7000000000000001E-3,{"$f":"G420","v":417.92189999999999},{"$f":"G421*F421","v":1.12838913},null,2.5999999999999999E-3,{"$f":"K420","v":418.42675020990959},{"$f":"K421*J421","v":1.0879095505457648},null,-4.0479579454235193E-2,-3.587377649963288E-2]
[null,"Sub-Total C - Delivery (including Sub-Total B)",null,null,null,null,null,{"$f":"SUM(H419:H421)","v":15.660053300000001},null,null,null,{"$f":"SUM(L419:L421)","v":15.247159226406396},null,-0.41289407359360553,-2.6366070771521928E-2]
[null,"Wholesale Market Service Charge (WMSC)",null,"kWh",null,5.1999999999999998E-3,{"$f":"F400*(1+F446)","v":417.92189999999999},{"$f":"G423*F423","v":2.1731938799999999},null,5.1999999999999998E-3,{"$f":"F400*(1+J446)","v":418.42675020990959},{"$f":"K423*J423","v":2.1758191010915295},null,2.6252210915296281E-3,1.2080013273043214E-3]
[null,"Rural and Remote Rate Protection (RRRP)",null,"kWh",null,1.1000000000000001E-3,{"$f":"F400*(1+F446)","v":417.92189999999999},0.45971409000000002,null,1.1000000000000001E-3,{"$f":"F400*(1+J446)","v":418.42675020990959},0.46026942523090059,null,5.5533523090056658E-4,1.20800132730447E-3]
[null,"Standard Supply Service Charge",null,null,null,null,1,0,null,null,1,0,null,0,""]
[null,"Debt Retirement Charge (DRC)",null,"kWh",null,7.0000000000000001E-3,{"$f":"F400","v":397},2.7789999999999999,null,7.0000000000000001E-3,{"$f":"F400","v":397},2.7789999999999999,null,0,0]
[null,"Energy - RPP - Tier 1",null,"kWh",null,6.5000000000000002E-2,{"$f":"IF($G$423>=750,750,$G$423)","v":417.92189999999999},{"$f":"G427*F427","v":27.1649235},null,6.5000000000000002E-2,{"$f":"IF($K$423>=750,750,$K$423)","v":418.42675020990959},{"$f":"K427*J427","v":27.197738763644125},null,3.281526364412457E-2,1.2080013273044767E-3]
[null,"Energy - RPP - Tier 2",null,"kWh",null,7.4999999999999997E-2,{"$f":"IF($G$423>=750,$G$423-750,0)","v":0},{"$f":"G428*F428","v":0},null,7.4999999999999997E-2,{"$f":"IF($K$423>=750,$K$423-750,0)","v":0},{"$f":"K428*J428","v":0},null,0,""]
[null,"TOU - Off Peak",null,"kWh",null,6.5000000000000002E-2,{"$f":"0.64*$G$423","v":267.47001599999999},17.385551039999999,null,6.5000000000000002E-2,{"$f":"0.64*$K$423","v":267.79312013434213},17.40655280873224,null,2.1001768732240578E-2,1.2080013273045257E-3]
[null,"TOU - Mid Peak",null,"kWh",null,0.1,{"$f":"0.18*$G$423","v":75.225941999999989},7.5225941999999995,null,0.1,{"$f":"0.18*$K$423","v":75.316815037783726},7.5316815037783726,null,9.0873037783731903E-3,1.2080013273045077E-3]
[null,"TOU - On Peak",null,"kWh",null,0.11700000000000001,{"$f":"0.18*$G$423","v":75.225941999999989},8.8014352139999996,null,0.11700000000000001,{"$f":"0.18*$K$423","v":75.316815037783726},8.8120673594206966,null,1.0632145420697015E-2,1.2080013273045511E-3]
[]
[null,"Total Bill on RPP (before Taxes)",null,null,null,null,null,{"$f":"SUM(H422:H428)","v":48.236884770000003},null,null,null,{"$f":"SUM(L422:L428)","v":47.859986516372956},null,-0.3768982536270471,-7.8134866176401939E-3]
[null,"HST",null,null,null,0.13,null,{"$f":"H433*F434","v":6.2707950201000004},null,0.13,null,{"$f":"L433*J434","v":6.2217982471284845},null,-4.8996772971515945E-2,-7.8134866176401661E-3]
[null,"Total Bill (including HST)",null,null,null,null,null,{"$f":"H433+H434","v":54.507679790100006},null,null,null,{"$f":"L433+L434","v":54.081784763501439},null,-0.42589502659856748,-7.813486617640272E-3]
[null,"Ontario Clean Energy Benefit 1",null,null,null,null,null,{"$f":"ROUND(-H435*10%,2)","v":-5.45},null,null,null,{"$f":"ROUND(-L435*10%,2)","v":-5.41},null,4.0000000000000036E-2,-7.3394495412844101E-3]
[null,"Total Bill on RPP (including OCEB)",null,null,null,null,null,{"$f":"SUM(H435:H436)","v":49.057679790100003},null,null,null,{"$f":"SUM(L435:L436)","v":48.671784763501435},null,-0.38589502659856834,-7.8661491584941044E-3]
[]
[null,"Total Bill on TOU (before Taxes)",null,null,null,null,null,{"$f":"SUM(H422:H426,H429:H431)","v":54.781541724},null,null,null,{"$f":"SUM(L422:L426,L429:L431)","v":54.412549424660135},null,{"$f":"L439-H439","v":-0.36899229933986533},{"$f":"IF((H439)=0,\"\",(N439/H439))","v":-6.7357049058407283E-3}]
[null,"HST",null,null,null,0.13,null,{"$f":"H439*F440","v":7.1216004241200004},null,0.13,null,{"$f":"L439*J440","v":7.0736314252058179},null,-4.7968998914182492E-2,-6.7357049058407274E-3]
[null,"Total Bill (including HST)",null,null,null,null,null,{"$f":"H439+H440","v":61.903142148119997},null,null,null,{"$f":"L439+L440","v":61.486180849865953},null,-0.41696129825404427,-6.735704905840671E-3]
[null,"Ontario Clean Energy Benefit 1",null,null,null,null,null,{"$f":"ROUND(-H441*10%,2)","v":-6.19},null,null,null,{"$f":"ROUND(-L441*10%,2)","v":-6.15},null,4.0000000000000036E-2,-6.4620355411954822E-3]
[null,"Total Bill on TOU (including OCEB)",null,null,null,null,null,{"$f":"H441+H442","v":55.713142148119999},null,null,null,{"$f":"L441+L442","v":55.336180849865954},null,-0.37696129825404512,-6.7661108980686955E-3]
[]
[]
[null,"Loss Factor (%)",null,null,null,5.2699999999999969E-2,null,null,null,5.3971662997253311E-2]
[]
["1 Applicable to eligible customers only.  Refer to the Ontario Clean Energy Benefit Act, 2010."]
[]
["Note that the \"Charge $\" columns provide breakdowns of the amounts that each bill component contributes to the total monthly bill at the referenced "]
["consumption level at existing and proposed rates."]
[]
["Applicants must provide bill impacts for residential at 800 kWh and GS<50kW at 2000 kWh. In addition, their filing should cover the range that is relevant"]
["to their service territory, class by class. A general guideline of consumption levels follows:"]
[]
["Residential (kWh) - 100, 250, 500, 800, 1000, 1500, 2000"]
["GS<50kW (kWh) - 1000, 2000, 5000, 10000, 15000"]
["GS>50kW (kW) - 60, 100, 500, 1000"]
["Large User - range appropriate for utility"]
["Lighting Classes and USL - 150 kWh and 1 kW, range appropriate for utility."]
[]
[null,null,null,null,null,null,null,null,null,null,null,null,null,"File Number:","EB-2012-0126"]
[null,null,null,null,null,null,null,null,null,null,null,null,null,"Exhibit:",8]
[null,null,null,null,null,null,null,null,null,null,null,null,null,"Tab:",4]
[null,null,null,null,null,null,null,null,null,null,null,null,null,"Schedule:",2]
[null,null,null,null,null,null,null,null,null,null,null,null,null,"Attachment:",2]
[]
[null,null,null,null,null,null,null,null,null,null,null,null,null,"Date:","9 November, 2012"]
[]
[]
[null,"Appendix 2-W"]
[null,"Bill Impacts"]
[]
[]
[null,"Customer Class:",null,"Street Lighting"]
[]
[null,null,null,"Consumption",null,72.000000000000014," kWh"]
[]
[null,null,null,null,null,"Current Board-Approved",null,null,null,"Proposed",null,null,null,"Impact"]
[null,null,null,"Charge Unit",null,"Rate","Volume","Charge",null,"Rate","Volume","Charge",null,"$ Change","% Change"]
[null,null,null,null,null,"($)",null,"($)",null,"($)",null,"($)"]
[null,"Monthly Service Charge",null,"Monthly",null,3.72,1,{"$f":"G482*F482","v":3.72},null,5.25,1,{"$f":"K482*J482","v":5.25},null,{"$f":"L482-H482","v":1.5299999999999998},{"$f":"IF((H482)=0,\"\",(N482/H482))","v":0.41129032258064507}]
[null,"Smart Meter Rate Adder",null,"Monthly",null,0,1,{"$f":"G483*F483","v":0},null,0,1,{"$f":"K483*J483","v":0},null,{"$f":"L483-H483","v":0},{"$f":"IF((H483)=0,\"\",(N483/H483))","v":""}]
[null,"Rate Rider for Late Payment Penalty Litigation Costs",null,"Monthly",null,0,1,0,null,0,1,{"$f":"K484*J484","v":0},null,{"$f":"L484-H484","v":0},{"$f":"IF((H484)=0,\"\",(N484/H484))","v":""}]
[null,"Distribution Volumetric Rate",null,"kW",null,10.8171,0.2,2.1634199999999999,null,4.0481999999999996,0.2,0.80963999999999992,null,-1.35378,-0.62575921457691985]
[null,"Smart Meter Disposition Rider",null,"Monthly",null,0,1,0,null,0,1,0,null,0,""]
[null,"Rate Rider for Loss Revenue Adjustment Mechanism Recovery",null,"kW",null,0,0.2,0,null,0,0.2,0,null,0,""]
[null,"Rate Rider for Tax Change",null,"kW",null,-0.47149999999999997,0.2,-9.4299999999999995E-2,null,0,0.2,0,null,9.4299999999999995E-2,-1]
[null,"LV Charges",null,"kW",null,0,0.2,0,null,0,0.2,0,null,0,""]
[null,"Stranded Assets Disposition",null,"kW",null,0,0.2,0,null,0,0.2,0,null,0,""]
[null,"Sub-Total A",null,null,null,null,null,{"$f":"SUM(H482:H490)","v":5.7891200000000005},null,null,null,{"$f":"SUM(L482:L490)","v":6.0596399999999999},null,0.27051999999999943,4.6729036537504737E-2]
[null,"Rate Rider for Deferral/Variance Account Disposition",null,"kW",null,-0.19389999999999999,0.2,{"$f":"G492*F492","v":-3.8780000000000002E-2},null,-2.7239,0.2,{"$f":"K492*J492","v":-0.54478000000000004},null,-0.50600000000000001,{"$f":"IF((H492)=0,\"\",(N492/H492))","v":13.047962867457452}]
[null,"Low Voltage Service Charge",null,"kW",null,4.7500000000000001E-2,0.2,{"$f":"G493*F493","v":9.5000000000000015E-3},null,5.21E-2,0.2,{"$f":"K493*J493","v":1.042E-2},null,9.1999999999999894E-4,{"$f":"IF((H493)=0,\"\",(N493/H493))","v":9.6842105263157771E-2}]
[null,"Smart Meter Entity Charge",null,null,null,null,null,null,null,null,{"$f":"F477","v":72.000000000000014},{"$f":"K494*J494","v":0},null,0]
[null,"Sub-Total B - Distribution (includes Sub-Total A)",null,null,null,null,null,{"$f":"SUM(H491:H494)","v":5.7598400000000005},null,null,null,{"$f":"SUM(L491:L494)","v":5.5252799999999995},null,-0.23456000000000099,{"$f":"IF((H495)=0,\"\",(N495/H495))","v":-4.0723353426484241E-2}]
[null,"RTSR - Network",null,"kW",null,1.6741999999999999,{"$f":"0.2","v":0.2},{"$f":"G496*F496","v":0.33484000000000003},null,1.6120000000000001,{"$f":"0.2","v":0.2},{"$f":"K496*J496","v":0.32240000000000002},null,-1.2440000000000007E-2,-3.7152072631704711E-2]
[null,"RTSR - Line and Transformation Connection",null,"kW",null,1.0355000000000001,{"$f":"G496","v":0.2},{"$f":"G497*F497","v":0.20710000000000003},null,1.0108999999999999,{"$f":"K496","v":0.2},{"$f":"K497*J497","v":0.20218},null,-4.9200000000000355E-3,-2.3756639304683896E-2]
[null,"Sub-Total C - Delivery (including Sub-Total B)",null,null,null,null,null,{"$f":"SUM(H495:H497)","v":6.3017799999999999},null,null,null,{"$f":"SUM(L495:L497)","v":6.0498599999999998},null,-0.25192000000000014,-3.9976006779037059E-2]
[null,"Wholesale Market Service Charge (WMSC)",null,"kWh",null,5.1999999999999998E-3,{"$f":"F477*(1+F522)","v":75.79440000000001},{"$f":"G499*F499","v":0.39413088000000002},null,5.1999999999999998E-3,{"$f":"F477*(1+J522)","v":75.88595973580226},{"$f":"K499*J499","v":0.39460699062617172},null,4.7611062617169964E-4,1.2080013273045229E-3]
[null,"Rural and Remote Rate Protection (RRRP)",null,"kWh",null,1.1000000000000001E-3,{"$f":"F477*(1+F522)","v":75.79440000000001},8.3373840000000018E-2,null,1.1000000000000001E-3,{"$f":"F477*(1+J522)","v":75.88595973580226},8.3474555709382489E-2,null,1.0071570938247065E-4,1.2080013273044715E-3]
[null,"Standard Supply Service Charge",null,null,null,null,1,0,null,null,1,0,null,0,""]
[null,"Debt Retirement Charge (DRC)",null,"kWh",null,7.0000000000000001E-3,{"$f":"F477","v":72.000000000000014},0.50400000000000011,null,7.0000000000000001E-3,{"$f":"F477","v":72.000000000000014},0.50400000000000011,null,0,0]
[null,"Energy - RPP - Tier 1",null,"kWh",null,6.5000000000000002E-2,{"$f":"IF($G$499>=750,750,$G$499)","v":75.79440000000001},{"$f":"G503*F503","v":4.9266360000000011},null,6.5000000000000002E-2,{"$f":"IF($K$499>=750,750,$K$499)","v":75.88595973580226},{"$f":"K503*J503","v":4.9325873828271467},null,5.9513828271455793E-3,1.2080013273043874E-3]
[null,"Energy - RPP - Tier 2",null,"kWh",null,7.4999999999999997E-2,{"$f":"IF($G$499>=750,$G$499-750,0)","v":0},{"$f":"G504*F504","v":0},null,7.4999999999999997E-2,{"$f":"IF($K$499>=750,$K$499-750,0)","v":0},{"$f":"K504*J504","v":0},null,0,""]
[null,"TOU - Off Peak",null,"kWh",null,6.5000000000000002E-2,{"$f":"0.64*$G$499","v":48.508416000000011},3.153047040000001,null,6.5000000000000002E-2,{"$f":"0.64*$K$499","v":48.56701423091345},3.1568559250093742,null,3.808885009373153E-3,1.2080013273043817E-3]
[null,"TOU - Mid Peak",null,"kWh",null,0.1,{"$f":"0.18*$G$499","v":13.642992000000001},1.3642992000000003,null,0.1,{"$f":"0.18*$K$499","v":13.659472752444406},1.3659472752444408,null,1.64807524444055E-3,1.2080013273045602E-3]
[null,"TOU - On Peak",null,"kWh",null,0.11700000000000001,{"$f":"0.18*$G$499","v":13.642992000000001},1.5962300640000002,null,0.11700000000000001,{"$f":"0.18*$K$499","v":13.659472752444406},1.5981583120359957,null,1.9282480359954501E-3,1.2080013273045645E-3]
[]
[null,"Total Bill on RPP (before Taxes)",null,null,null,null,null,{"$f":"SUM(H498:H504)","v":12.209920720000001},null,null,null,{"$f":"SUM(L498:L504)","v":11.9645289291627},null,-0.24539179083730112,-2.0097738262570889E-2]
[null,"HST",null,null,null,0.13,null,{"$f":"H509*F510","v":1.5872896936000003},null,0.13,null,{"$f":"L509*J510","v":1.5553887607911512},null,-3.1900932808849092E-2,-2.0097738262570854E-2]
[null,"Total Bill (including HST)",null,null,null,null,null,{"$f":"H509+H510","v":13.797210413600002},null,null,null,{"$f":"L509+L510","v":13.519917689953852},null,-0.27729272364615021,-2.0097738262570882E-2]
[null,"Ontario Clean Energy Benefit 1",null,null,null,null,null,{"$f":"ROUND(-H511*10%,2)","v":-1.38},null,null,null,{"$f":"ROUND(-L511*10%,2)","v":-1.35},null,2.9999999999999805E-2,-2.1739130434782469E-2]
[null,"Total Bill on RPP (including OCEB)",null,null,null,null,null,{"$f":"SUM(H511:H512)","v":12.417210413600003},null,null,null,{"$f":"SUM(L511:L512)","v":12.169917689953852},null,-0.24729272364615085,-1.9915320382692593E-2]
[]
[null,"Total Bill on TOU (before Taxes)",null,null,null,null,null,{"$f":"SUM(H498:H502,H505:H507)","v":13.396861024000001},null,null,null,{"$f":"SUM(L498:L502,L505:L507)","v":13.152903058625364},null,{"$f":"L515-H515","v":-0.2439579653746371},{"$f":"IF((H515)=0,\"\",(N515/H515))","v":-1.8210084059063915E-2}]
[null,"HST",null,null,null,0.13,null,{"$f":"H515*F516","v":1.7415919331200003},null,0.13,null,{"$f":"L515*J516","v":1.7098773976212975},null,-3.1714535498702734E-2,-1.8210084059063863E-2]
[null,"Total Bill (including HST)",null,null,null,null,null,{"$f":"H515+H516","v":15.138452957120002},null,null,null,{"$f":"L515+L516","v":14.862780456246663},null,-0.27567250087333939,-1.821008405906388E-2]
[null,"Ontario Clean Energy Benefit 1",null,null,null,null,null,{"$f":"ROUND(-H517*10%,2)","v":-1.51},null,null,null,{"$f":"ROUND(-L517*10%,2)","v":-1.49},null,2.0000000000000018E-2,-1.3245033112582794E-2]
[null,"Total Bill on TOU (including OCEB)",null,null,null,null,null,{"$f":"H517+H518","v":13.628452957120002},null,null,null,{"$f":"L517+L518","v":13.372780456246662},null,-0.25567250087333981,-1.876019983176206E-2]
[]
[]
[null,"Loss Factor (%)",null,null,null,5.2699999999999969E-2,null,null,null,5.3971662997253311E-2]
[]
["1 Applicable to eligible customers only.  Refer to the Ontario Clean Energy Benefit Act, 2010."]
[]
["Note that the \"Charge $\" columns provide breakdowns of the amounts that each bill component contributes to the total monthly bill at the referenced "]
["consumption level at existing and proposed rates."]
[]
["Applicants must provide bill impacts for residential at 800 kWh and GS<50kW at 2000 kWh. In addition, their filing should cover the range that is relevant"]
["to their service territory, class by class. A general guideline of consumption levels follows:"]
[]
["Residential (kWh) - 100, 250, 500, 800, 1000, 1500, 2000"]
["GS<50kW (kWh) - 1000, 2000, 5000, 10000, 15000"]
["GS>50kW (kW) - 60, 100, 500, 1000"]
["Large User - range appropriate for utility"]
["Lighting Classes and USL - 150 kWh and 1 kW, range appropriate for utility."]

{"sheet":"App.2-X_CoS_Flowchart","index":32,"n_rows":16,"n_cols":7,"rows_kept":16,"cut":false,"hidden":false,"merged":[[15,1,15,6],[12,1,12,6],[13,1,13,6]]}
[null,null,null,null,null,"File Number:",{"$f":"'LDC Info'!$E$18","v":"EB-2012-0126"}]
[null,null,null,null,null,"Exhibit:"]
[null,null,null,null,null,"Tab:"]
[null,null,null,null,null,"Schedule:"]
[null,null,null,null,null,"Page:"]
[]
[null,null,null,null,null,"Date:"]
[]
[]
[]
[]
[]
[null,"Appendix 2-X"]
[null,"Cost of Service Rate Application Schematic"]
[]
[null,"The Cost of Service Rate Application Schematic is a flowchart appended to Chapter 2 of the Filing Requirements as a guide for the components of an application and how demand and costs interrelate to derive the revenue requirement and then how the revenue requirement is allocated between classes and through fixed/variable splits to derive rates that will be compensatory for the annual revenue requirement, based on the the forecasted demand.  There is no form to be filled out; therefore, this Schedule is not required to be filed. "]

{"sheet":"App.2-B_FA Con'ty 2012 MIFRS NA","index":33,"n_rows":74,"n_cols":14,"rows_kept":74,"cut":false,"hidden":false,"merged":[[68,1,69,13],[71,1,71,13],[8,0,8,13],[9,0,9,13],[13,4,13,7],[54,0,54,2],[56,0,56,2],[65,1,66,13]]}
[null,null,null,null,null,null,null,null,null,null,null,null,"File Number:",{"$f":"'LDC Info'!E18","v":"EB-2012-0126"}]
[null,null,"Note: This appendix does not apply to GSHi as the company is not adopting MIFRS until 2014",null,null,null,null,null,null,null,null,null,"Exhibit:"]
[null,null,null,null,null,null,null,null,null,null,null,null,"Tab:"]
[null,null,null,null,null,null,null,null,null,null,null,null,"Schedule:"]
[null,null,null,null,null,null,null,null,null,null,null,null,"Page:"]
[]
[null,null,null,null,null,null,null,null,null,null,null,null,"Date:"]
[]
["Appendix 2-B"]
["Fixed Asset Continuity Schedule-MIFRS"]
[]
[null,null,null,null,null,"Year ",2012]
[]
[null,null,null,null,"Cost",null,null,null,null,null,"Accumulated Depreciation"]
["CCA Class","OEB","Description","Depreciation Rate","Opening Balance","Additions","Disposals","Closing Balance",null,"Opening Balance","Additions","Disposals","Closing Balance","Net Book Value"]
[12,1611,"Computer Software (Formally known as Account 1925)",null,null,null,null,{"$f":"E16+F16+G16","v":0},null,null,null,null,{"$f":"J16+K16+L16","v":0},{"$f":"H16+M16","v":0}]
["CEC",1612,"Land Rights (Formally known as Account 1906)",null,null,null,null,{"$f":"E17+F17+G17","v":0},null,null,null,null,{"$f":"J17+K17+L17","v":0},{"$f":"H17+M17","v":0}]
["N/A",1805,"Land",null,null,null,null,{"$f":"E18+F18+G18","v":0},null,null,null,null,{"$f":"J18+K18+L18","v":0},{"$f":"H18+M18","v":0}]
[47,1808,"Buildings",null,null,null,null,{"$f":"E19+F19+G19","v":0},null,null,null,null,{"$f":"J19+K19+L19","v":0},{"$f":"H19+M19","v":0}]
[13,1810,"Leasehold Improvements",null,null,null,null,0,null,null,null,null,0,0]
[47,1815,"Transformer Station Equipment >50 kV",null,null,null,null,0,null,null,null,null,0,0]
[47,1820,"Distribution Station Equipment <50 kV",null,null,null,null,0,null,null,null,null,0,0]
[47,1825,"Storage Battery Equipment",null,null,null,null,0,null,null,null,null,0,0]
[47,1830,"Poles, Towers & Fixtures",null,null,null,null,0,null,null,null,null,0,0]
[47,1835,"Overhead Conductors & Devices",null,null,null,null,0,null,null,null,null,0,0]
[47,1840,"Underground Conduit",null,null,null,null,0,null,null,null,null,0,0]
[47,1845,"Underground Conductors & Devices",null,null,null,null,0,null,null,null,null,0,0]
[47,1850,"Line Transformers",null,null,null,null,0,null,null,null,null,0,0]
[47,1855,"Services (Overhead & Underground)",null,null,null,null,0,null,null,null,null,0,0]
[47,1860,"Meters",null,null,null,null,0,null,null,null,null,0,0]
[47,1860,"Meters (Smart Meters)",null,null,null,null,0,null,null,null,null,0,0]
["N/A",1905,"Land",null,null,null,null,0,null,null,null,null,0,0]
[47,1908,"Buildings & Fixtures",null,null,null,null,0,null,null,null,null,0,0]
[13,1910,"Leasehold Improvements",null,null,null,null,0,null,null,null,null,0,0]
[8,1915,"Office Furniture & Equipment (10 years)",null,null,null,null,0,null,null,null,null,0,0]
[8,1915,"Office Furniture & Equipment (5 years)",null,null,null,null,0,null,null,null,null,0,0]
[10,1920,"Computer Equipment - Hardware",null,null,null,null,0,null,null,null,null,0,0]
[45,1920,"Computer Equip.-Hardware(Post Mar. 22/04)",null,null,null,null,0,null,null,null,null,0,0]
[45.1,1920,"Computer Equip.-Hardware(Post Mar. 19/07)",null,null,null,null,0,null,null,null,null,0,0]
[10,1930,"Transportation Equipment",null,null,null,null,0,null,null,null,null,0,0]
[8,1935,"Stores Equipment",null,null,null,null,0,null,null,null,null,0,0]
[8,1940,"Tools, Shop & Garage Equipment",null,null,null,null,0,null,null,null,null,0,0]
[8,1945,"Measurement & Testing Equipment",null,null,null,null,0,null,null,null,null,0,0]
[8,1950,"Power Operated Equipment",null,null,null,null,0,null,null,null,null,0,0]
[8,1955,"Communications Equipment",null,null,null,null,0,null,null,null,null,0,0]
[8,1955,"Communication Equipment (Smart Meters)",null,null,null,null,0,null,null,null,null,0,0]
[8,1960,"Miscellaneous Equipment ",null,null,null,null,0,null,null,null,null,0,0]
[47,1975,"Load Management Controls Utility Premises",null,null,null,null,0,null,null,null,null,0,0]
[47,1980,"System Supervisory Equipment",null,null,null,null,0,null,null,null,null,0,0]
[47,1985,"Miscellaneous Fixed Assets",null,null,null,null,0,null,null,null,null,0,0]
[47,1995,"Contributions & Grants",null,null,null,null,0,null,null,null,null,0,0]
[null,1330,"WIP - Capital Inventory",null,null,null,null,0,null,null,null,null,0,0]
[null,2055,"Work in Process",null,null,null,null,0,null,null,null,null,0,0]
[null,null,null,null,{"$f":"'App.2-B_Fixed Asset Con''ty 2011'!H54","v":0},null,null,null,null,{"$f":"'App.2-B_Fixed Asset Con''ty 2011'!M54","v":0}]
["Total prior to Board ordered removal of CIS related to water billing",null,null,null,{"$f":"SUM(E16:E54)","v":0},{"$f":"SUM(F16:F54)","v":0},{"$f":"SUM(G16:G54)","v":0},{"$f":"SUM(H16:H54)","v":0},null,{"$f":"SUM(J16:J53)","v":0},0,0,0,0]
[12,1925,"Computer Software",null,null,null,null,{"$f":"E56+F56+G56","v":0},null,null,null,null,{"$f":"J56+K56+L56","v":0},{"$f":"H56+M56","v":0}]
["Total subsequent to Board ordered removal of CIS related to water billing",null,null,null,{"$f":"SUM(E55:E56)","v":0},{"$f":"SUM(F55:F56)","v":0},{"$f":"SUM(G55:G56)","v":0},{"$f":"SUM(H55:H56)","v":0},null,{"$f":"SUM(J55:J56)","v":0},{"$f":"SUM(K55:K56)","v":0},0,0,0]
[]
[null,null,null,null,null,null,null,null,null,"Less: Fully Allocated Depreciation"]
[10,null,"Transportation",null,null,null,null,null,null,"Transportation"]
[8,null,"Stores Equipment",null,null,null,null,null,null,"Stores Equipment"]
[null,null,null,null,null,null,null,null,null,"Net Depreciation",null,{"$f":"K57-L60-L61","v":0}]
[]
["Notes:"]
[]
[1,"Tables in the format outlined above covering all fixed asset accounts should be submitted for the Test Year, Bridge Year and all relevant historical years.  At a minimum , the applicant must provide data for the earlier of: 1) all historical years back to its last rebasing; or 2) at least three years of historical actuals, in addition to Bridge Year and Test Year forecasts."]
[]
[]
[2,"The \"CCA Class\" for fixed assets should agree with the CCA Class used for tax purposes in Tax Returns. Fixed Assets sub-components may be used where the underlying asset components are classified under multiple CCA Classes for tax purposes. If an applicant uses any different classes from those shown in the table, an explanation should be provided. (also see note 3 below)."]
[]
[]
[3,"The table may need to be customized for a utility's asset categories or for any new asset accounts announced or authorized by the Board."]
[]
[4,"The depreciation column (D) is not required as the relevant information will be provided in the following 2-C series of appendices."]

{"sheet":"App.2-CA_CGAAP_DepExp_2011","index":34,"n_rows":61,"n_cols":12,"rows_kept":61,"cut":false,"hidden":false,"merged":[[10,0,10,11],[8,0,8,11],[9,0,9,11],[57,1,57,11],[60,1,61,11],[58,1,59,9],[13,0,14,0],[13,1,14,1],[13,10,14,10]]}
[null,null,null,null,null,null,null,null,null,null,"File Number:",{"$f":"'LDC Info'!$E$18","v":"EB-2012-0126"}]
["Note: This appendix does not apply to GSHi as the company is not adopting MIFRS until 2014",null,null,null,null,null,null,null,null,null,"Exhibit:"]
[null,null,null,null,null,null,null,null,null,null,"Tab:"]
[null,null,null,null,null,null,null,null,null,null,"Schedule:"]
[null,null,null,null,null,null,null,null,null,null,"Page:"]
[]
[null,null,null,null,null,null,null,null,null,null,"Date:"]
[]
["Appendix 2-CA"]
["Depreciation and Amortization Expense"]
["Assumes the applicant adopted IFRS for financial reporting purposes January 1, 2012"]
[null,null,"Year",2011,"CGAAP"]
[]
["Account","Description","Opening Regulatory Gross PP&E as at Jan 1, 2011 ","Less Fully Depreciated","Net for Depreciation","Additions","Total for Depreciation","Years","Depreciation Rate","Depreciation Expense","2011 Depreciation Expense per Appendix 2-B Fixed Assets, Column K \n (l)","Variance 2"]
[null,null,"(a)","(b)","(c)","(d)","(e) = (c) + ½ x (d) 1","(f)","(g) = 1 / (f)","(h) = (e) / (f)",null,"(m) = (h) - (l)"]
[1611,"Computer Software (Formally known as Account 1925)",null,null,{"$f":"C16-D16","v":0},null,{"$f":"E16+0.5*F16","v":0},null,{"$f":"IF(H16=0,0,1/H16)","v":0},{"$f":"IF(H16=0,0,G16/H16)","v":0},null,{"$f":"IF(ISERROR(+J16-K16), 0, +J16-K16)","v":0}]
[1612,"Land Rights (Formally known as Account 1906)",null,null,{"$f":"C17-D17","v":0},null,{"$f":"E17+0.5*F17","v":0},null,0,0,null,0]
[1805,"Land",null,null,0,null,0,null,0,0,null,0]
[1808,"Buildings",null,null,0,null,0,null,0,0,null,0]
[1810,"Leasehold Improvements",null,null,0,null,0,null,0,0,null,0]
[1815,"Transformer Station Equipment >50 kV",null,null,0,null,0,null,0,0,null,0]
[1820,"Distribution Station Equipment <50 kV",null,null,0,null,0,null,0,0,null,0]
[1825,"Storage Battery Equipment",null,null,0,null,0,null,0,0,null,0]
[1830,"Poles, Towers & Fixtures",null,null,0,null,0,null,0,0,null,0]
[1835,"Overhead Conductors & Devices",null,null,0,null,0,null,0,0,null,0]
[1840,"Underground Conduit",null,null,0,null,0,null,0,0,null,0]
[1845,"Underground Conductors & Devices",null,null,0,null,0,null,0,0,null,0]
[1850,"Line Transformers",null,null,0,null,0,null,0,0,null,0]
[1855,"Services (Overhead & Underground)",null,null,0,null,0,null,0,0,null,0]
[1860,"Meters",null,null,0,null,0,null,0,0,null,0]
[1860,"Meters (Smart Meters)",null,null,0,null,0,null,0,0,null,0]
[1905,"Land",null,null,0,null,0,null,0,0,null,0]
[1908,"Buildings & Fixtures",null,null,0,null,0,null,0,0,null,0]
[1910,"Leasehold Improvements",null,null,0,null,0,null,0,0,null,0]
[1915,"Office Furniture & Equipment (10 years)",null,null,0,null,0,null,0,0,null,0]
[1915,"Office Furniture & Equipment (5 years)",null,null,0,null,0,null,0,0,null,0]
[1920,"Computer Equipment - Hardware",null,null,0,null,0,null,0,0,null,0]
[1920,"Computer Equip.-Hardware(Post Mar. 22/04)",null,null,0,null,0,null,0,0,null,0]
[1920,"Computer Equip.-Hardware(Post Mar. 19/07)",null,null,0,null,0,null,0,0,null,0]
[1930,"Transportation Equipment",null,null,0,null,0,null,0,0,null,0]
[1935,"Stores Equipment",null,null,0,null,0,null,0,0,null,0]
[1940,"Tools, Shop & Garage Equipment",null,null,0,null,0,null,0,0,null,0]
[1945,"Measurement & Testing Equipment",null,null,0,null,0,null,0,0,null,0]
[1950,"Power Operated Equipment",null,null,0,null,0,null,0,0,null,0]
[1955,"Communications Equipment",null,null,0,null,0,null,0,0,null,0]
[1955,"Communication Equipment (Smart Meters)",null,null,0,null,0,null,0,0,null,0]
[1960,"Miscellaneous Equipment ",null,null,0,null,0,null,0,0,null,0]
[1975,"Load Management Controls Utility Premises",null,null,0,null,0,null,0,0,null,0]
[1980,"System Supervisor Equipment",null,null,0,null,0,null,0,0,null,0]
[1985,"Miscellaneous Fixed Assets",null,null,0,null,0,null,0,0,null,0]
[1995,"Contributions & Grants",null,null,0,null,0,null,0,0,null,0]
["etc.",null,null,null,0,null,0,null,0,0,null,0]
[null,null,null,null,0,null,0,null,0,0,null,0]
[null,"Total",{"$f":"SUM(C16:C53)","v":0},{"$f":"SUM(D16:D53)","v":0},{"$f":"SUM(E16:E53)","v":0},{"$f":"SUM(F16:F53)","v":0},{"$f":"SUM(G16:G53)","v":0},null,null,{"$f":"SUM(J16:J53)","v":0},{"$f":"SUM(K16:K53)","v":0},{"$f":"SUM(L16:L53)","v":0}]
[]
["Notes:"]
[]
[1,"Board policy of the \"half-year\" rule - the applicant must ensure that additions in the year attract a half-year depreciation expense in the first year.  Deviations from this standard practice must be supported in the application."]
[2,"The applicant must provide an explanation of material variances in evidence"]
[]
["General","Applicants must provide a breakdown of depreciation and amortization expense in the above format for all relevant accounts.  Asset Retirement Obligations (AROs), depreciation and accretion expense should be disclosed separately consistent with the Notes of historical Audited Financial Statements."]

{"sheet":"App.2-CB_MIFRS_DepExp_2011","index":35,"n_rows":65,"n_cols":15,"rows_kept":65,"cut":false,"hidden":false,"merged":[[8,0,8,14],[9,0,9,14],[10,0,10,14],[61,1,61,14],[64,1,65,14],[57,1,57,14],[58,1,58,14],[59,1,59,14],[60,1,60,14],[13,0,14,0],[13,1,14,1],[13,10,14,10],[13,13,14,13],[62,1,62,14]]}
[null,null,null,null,null,null,null,null,null,null,null,null,null,"File Number:",{"$f":"'LDC Info'!$E$18","v":"EB-2012-0126"}]
["Note: This appendix does not apply to GSHi as the company is not adopting MIFRS until 2014",null,null,null,null,null,null,null,null,null,null,null,null,"Exhibit:"]
[null,null,null,null,null,null,null,null,null,null,null,null,null,"Tab:"]
[null,null,null,null,null,null,null,null,null,null,null,null,null,"Schedule:"]
[null,null,null,null,null,null,null,null,null,null,null,null,null,"Page:"]
[]
[null,null,null,null,null,null,null,null,null,null,null,null,null,"Date:"]
[]
["Appendix 2-CB"]
["Depreciation and Amortization Expense"]
["Assumes the applicant adopted IFRS for financial reporting purposes January 1, 2012"]
[null,null,"Year",2011,"MIFRS"]
[]
["Account","Description","Opening NBV as at Jan 1, 2011 5","Additions","Average Remaining Life of Opening NBV 4","Years (new additions only) 3","Depreciation Rate on New Additions","Depreciation Expense on Opening NBV","Depreciation Expense on Additions 1","2011 Depreciation Expense","2011 Depreciation Expense per Appendix 2-B Fixed Assets, Column K \n (l)","Variance 2","Depreciation Expense on 2011 Full Year Additions","Less Depreciation Expense on Assets Fully Depreciated during the year\n(o)","2011 Full Year Depreciation 6"]
[null,null,"(a)","(d)","(i)","(f)","(g) = 1 / (f)","(j) = (a) / (i)","(h)=((d)*0.5)/(f) ","(k) = (j) + (h)",null,"(m) = (k) - (l)","(n) = (d)/(f) ",null,"(p) = (j) + (n) - (o)"]
[1611,"Computer Software (Formally known as Account 1925)",null,null,null,null,{"$f":"IF(F16=0,0,1/F16)","v":0},{"$f":"IF(E16=0,0,+C16/E16)","v":0},{"$f":"IF(F16=0,0,+(D16*0.5)/F16)","v":0},{"$f":"IF(ISERROR(+H16+I16), 0, +H16+I16)","v":0},null,{"$f":"IF(ISERROR(+J16-K16), 0, +J16-K16)","v":0},{"$f":"IF(F16=0,0,+(D16)/F16)","v":0},null,{"$f":"IF(ISERROR(+M16+H16-N16), 0, +M16+H16-N16)","v":0}]
[1612,"Land Rights (Formally known as Account 1906)",null,null,null,null,0,0,0,0,null,0,0,null,{"$f":"IF(ISERROR(+M17+H17-N17), 0, +M17+H17-N17)","v":0}]
[1805,"Land",null,null,null,null,0,0,0,0,null,0,0,null,0]
[1808,"Buildings",null,null,null,null,0,0,0,0,null,0,0,null,0]
[1810,"Leasehold Improvements",null,null,null,null,0,0,0,0,null,0,0,null,0]
[1815,"Transformer Station Equipment >50 kV",null,null,null,null,0,0,0,0,null,0,0,null,0]
[1820,"Distribution Station Equipment <50 kV",null,null,null,null,0,0,0,0,null,0,0,null,0]
[1825,"Storage Battery Equipment",null,null,null,null,0,0,0,0,null,0,0,null,0]
[1830,"Poles, Towers & Fixtures",null,null,null,null,0,0,0,0,null,0,0,null,0]
[1835,"Overhead Conductors & Devices",null,null,null,null,0,0,0,0,null,0,0,null,0]
[1840,"Underground Conduit",null,null,null,null,0,0,0,0,null,0,0,null,0]
[1845,"Underground Conductors & Devices",null,null,null,null,0,0,0,0,null,0,0,null,0]
[1850,"Line Transformers",null,null,null,null,0,0,0,0,null,0,0,null,0]
[1855,"Services (Overhead & Underground)",null,null,null,null,0,0,0,0,null,0,0,null,0]
[1860,"Meters",null,null,null,null,0,0,0,0,null,0,0,null,0]
[1860,"Meters (Smart Meters)",null,null,null,null,0,0,0,0,null,0,0,null,0]
[1905,"Land",null,null,null,null,0,0,0,0,null,0,0,null,0]
[1908,"Buildings & Fixtures",null,null,null,null,0,0,0,0,null,0,0,null,0]
[1910,"Leasehold Improvements",null,null,null,null,0,0,0,0,null,0,0,null,0]
[1915,"Office Furniture & Equipment (10 years)",null,null,null,null,0,0,0,0,null,0,0,null,0]
[1915,"Office Furniture & Equipment (5 years)",null,null,null,null,0,0,0,0,null,0,0,null,0]
[1920,"Computer Equipment - Hardware",null,null,null,null,0,0,0,0,null,0,0,null,0]
[1920,"Computer Equip.-Hardware(Post Mar. 22/04)",null,null,null,null,0,0,0,0,null,0,0,null,0]
[1920,"Computer Equip.-Hardware(Post Mar. 19/07)",null,null,null,null,0,0,0,0,null,0,0,null,0]
[1930,"Transportation Equipment",null,null,null,null,0,0,0,0,null,0,0,null,0]
[1935,"Stores Equipment",null,null,null,null,0,0,0,0,null,0,0,null,0]
[1940,"Tools, Shop & Garage Equipment",null,null,null,null,0,0,0,0,null,0,0,null,0]
[1945,"Measurement & Testing Equipment",null,null,null,null,0,0,0,0,null,0,0,null,0]
[1950,"Power Operated Equipment",null,null,null,null,0,0,0,0,null,0,0,null,0]
[1955,"Communications Equipment",null,null,null,null,0,0,0,0,null,0,0,null,0]
[1955,"Communication Equipment (Smart Meters)",null,null,null,null,0,0,0,0,null,0,0,null,0]
[1960,"Miscellaneous Equipment ",null,null,null,null,0,0,0,0,null,0,0,null,0]
[1975,"Load Management Controls Utility Premises",null,null,null,null,0,0,0,0,null,0,0,null,0]
[1980,"System Supervisor Equipment",null,null,null,null,0,0,0,0,null,0,0,null,0]
[1985,"Miscellaneous Fixed Assets",null,null,null,null,0,0,0,0,null,0,0,null,0]
[1995,"Contributions & Grants",null,null,null,null,0,0,0,0,null,0,0,null,0]
["etc.",null,null,null,null,null,0,0,0,0,null,0,0,null,0]
[null,null,null,null,null,null,0,0,0,0,null,0,0,null,0]
[null,"Total",{"$f":"SUM(C16:C53)","v":0},{"$f":"SUM(D16:D53)","v":0},null,null,null,{"$f":"SUM(H16:H53)","v":0},0,0,0,0,0,{"$f":"SUM(N16:N53)","v":0},0]
[]
["Notes:"]
[]
[1,"Board policy of the \"half-year\" rule - the applicant must ensure that additions in the year attract a half-year depreciation expense in the first year.  Deviations from this standard practice must be supported in the application."]
[2,"The applicant must provide an explanation of material variances in evidence"]
[3,"The applicant should ensure that the years for new additions of assets are the asset useful lives determined by management in accordance with IFRS. "]
[4,"A recalculation should be performed to determine the average remaining life of opening balance of assets (i.e. excluding 2011 additions) under IFRS.  For example, Asset A had a useful life of 20 years under CGAAP.  On January 1, 2011, the date of transition, Asset A was 3 years depreciated. As a result, Asset A would have a remaining service life of 17 years (20 years less 3 years) under CGAAP as of January 1, 2011.  Due to the transition to IFRS, management re-assessed the asset useful lives under IFRS principles and concluded that the revised useful life of Asset A is now 30 years. Therefore, the average remaining useful life of opening balance of Asset A is determined to be 27 years (30 years less 3 years) under IFRS as of January 1, 2011."]
[5," NBV must exclude assets still on the books but which have been fully amortized or depreciated."]
[6,"This column refers to the calculated full year depreciation but excludes the depreciation expense on assets fully depreciated during the year.  This column is used for the purpose of calculating depreciation expense in the following year on the next worksheet."]
[]
["General:","Applicants must provide a breakdown of depreciation and amortization expense in the above format for all relevant accounts.  Asset Retirement Obligations (AROs), depreciation and accretion expense should be disclosed separately consistent with the Notes of historical Audited Financial Statements."]

{"sheet":"App.2-CC_MIFRS_DepExp_2012","index":36,"n_rows":61,"n_cols":11,"rows_kept":61,"cut":false,"hidden":false,"merged":[[60,1,61,10],[13,0,14,0],[13,1,14,1],[13,6,14,6],[10,0,10,10],[13,9,14,9],[8,0,8,10],[56,1,56,10],[57,1,57,10],[58,1,58,10],[9,0,9,10]]}
[null,null,null,null,null,null,null,null,null,"File Number:",{"$f":"'LDC Info'!$E$18","v":"EB-2012-0126"}]
["Note: This appendix does not apply to GSHi as the company is not adopting MIFRS until 2014",null,null,null,null,null,null,null,null,"Exhibit:"]
[null,null,null,null,null,null,null,null,null,"Tab:"]
[null,null,null,null,null,null,null,null,null,"Schedule:"]
[null,null,null,null,null,null,null,null,null,"Page:"]
[]
[null,null,null,null,null,null,null,null,null,"Date:"]
[]
["Appendix 2-CC"]
["Depreciation and Amortization Expense"]
["Assumes the applicant adopted IFRS for financial reporting purposes January 1, 2012"]
[null,null,2012,"MIFRS"]
[]
["Account","Description","Additions","Years (new additions only)","Depreciation Rate on New Additions","2012 Depreciation Expense 1","2012 Depreciation Expense per Apppendix 2-B Fixed Assets, Column K\n (l)","Variance 2","Depreciation Expense on 2012 Full Year Additions","Less Depreciation Expense on Assets Fully Depreciated during the year\n(o)","2012 Full Year Depreciation 3"]
[null,null,"(d)","(f)","(g) = 1 / (f)","(h)=2011 Full Year Deprecation + ((d)*0.5)/(f) ",null,"(m) = (h) - (l)","(n)=((d))/(f) ",null,"(o) = 2011 Full Year Depreciation  + (n) - (o)"]
[1611,"Computer Software (Formally known as Account 1925)",null,null,{"$f":"IF(D16=0,0,1/D16)","v":0},{"$f":"IF(D16=0,+'App.2-CB_MIFRS_DepExp_2011'!O16,+'App.2-CB_MIFRS_DepExp_2011'!O16+((C16*0.5)/D16))","v":0},null,{"$f":"IF(ISERROR(+F16-G16), 0, +F16-G16)","v":0},{"$f":"IF(D16=0,0,+(C16)/D16)","v":0},null,{"$f":"IF(ISERROR(+I16+'App.2-CB_MIFRS_DepExp_2011'!O16-J16), 0, +I16+'App.2-CB_MIFRS_DepExp_2011'!O16-J16)","v":0}]
[1612,"Land Rights (Formally known as Account 1906)",null,null,0,{"$f":"IF(D17=0,+'App.2-CB_MIFRS_DepExp_2011'!O17,+'App.2-CB_MIFRS_DepExp_2011'!O17+((C17*0.5)/D17))","v":0},null,0,0,null,{"$f":"IF(ISERROR(+I17+'App.2-CB_MIFRS_DepExp_2011'!O17-J17), 0, +I17+'App.2-CB_MIFRS_DepExp_2011'!O17-J17)","v":0}]
[1805,"Land",null,null,0,{"$f":"IF(D18=0,+'App.2-CB_MIFRS_DepExp_2011'!O18,+'App.2-CB_MIFRS_DepExp_2011'!O18+((C18*0.5)/D18))","v":0},null,0,0,null,{"$f":"IF(ISERROR(+I18+'App.2-CB_MIFRS_DepExp_2011'!O18-J18), 0, +I18+'App.2-CB_MIFRS_DepExp_2011'!O18-J18)","v":0}]
[1808,"Buildings",null,null,0,{"$f":"IF(D19=0,+'App.2-CB_MIFRS_DepExp_2011'!O19,+'App.2-CB_MIFRS_DepExp_2011'!O19+((C19*0.5)/D19))","v":0},null,0,0,null,{"$f":"IF(ISERROR(+I19+'App.2-CB_MIFRS_DepExp_2011'!O19-J19), 0, +I19+'App.2-CB_MIFRS_DepExp_2011'!O19-J19)","v":0}]
[1810,"Leasehold Improvements",null,null,0,{"$f":"IF(D20=0,+'App.2-CB_MIFRS_DepExp_2011'!O20,+'App.2-CB_MIFRS_DepExp_2011'!O20+((C20*0.5)/D20))","v":0},null,0,0,null,{"$f":"IF(ISERROR(+I20+'App.2-CB_MIFRS_DepExp_2011'!O20-J20), 0, +I20+'App.2-CB_MIFRS_DepExp_2011'!O20-J20)","v":0}]
[1815,"Transformer Station Equipment >50 kV",null,null,0,{"$f":"IF(D21=0,+'App.2-CB_MIFRS_DepExp_2011'!O21,+'App.2-CB_MIFRS_DepExp_2011'!O21+((C21*0.5)/D21))","v":0},null,0,0,null,{"$f":"IF(ISERROR(+I21+'App.2-CB_MIFRS_DepExp_2011'!O21-J21), 0, +I21+'App.2-CB_MIFRS_DepExp_2011'!O21-J21)","v":0}]
[1820,"Distribution Station Equipment <50 kV",null,null,0,{"$f":"IF(D22=0,+'App.2-CB_MIFRS_DepExp_2011'!O22,+'App.2-CB_MIFRS_DepExp_2011'!O22+((C22*0.5)/D22))","v":0},null,0,0,null,{"$f":"IF(ISERROR(+I22+'App.2-CB_MIFRS_DepExp_2011'!O22-J22), 0, +I22+'App.2-CB_MIFRS_DepExp_2011'!O22-J22)","v":0}]
[1825,"Storage Battery Equipment",null,null,0,{"$f":"IF(D23=0,+'App.2-CB_MIFRS_DepExp_2011'!O23,+'App.2-CB_MIFRS_DepExp_2011'!O23+((C23*0.5)/D23))","v":0},null,0,0,null,{"$f":"IF(ISERROR(+I23+'App.2-CB_MIFRS_DepExp_2011'!O23-J23), 0, +I23+'App.2-CB_MIFRS_DepExp_2011'!O23-J23)","v":0}]
[1830,"Poles, Towers & Fixtures",null,null,0,{"$f":"IF(D24=0,+'App.2-CB_MIFRS_DepExp_2011'!O24,+'App.2-CB_MIFRS_DepExp_2011'!O24+((C24*0.5)/D24))","v":0},null,0,0,null,{"$f":"IF(ISERROR(+I24+'App.2-CB_MIFRS_DepExp_2011'!O24-J24), 0, +I24+'App.2-CB_MIFRS_DepExp_2011'!O24-J24)","v":0}]
[1835,"Overhead Conductors & Devices",null,null,0,{"$f":"IF(D25=0,+'App.2-CB_MIFRS_DepExp_2011'!O25,+'App.2-CB_MIFRS_DepExp_2011'!O25+((C25*0.5)/D25))","v":0},null,0,0,null,{"$f":"IF(ISERROR(+I25+'App.2-CB_MIFRS_DepExp_2011'!O25-J25), 0, +I25+'App.2-CB_MIFRS_DepExp_2011'!O25-J25)","v":0}]
[1840,"Underground Conduit",null,null,0,{"$f":"IF(D26=0,+'App.2-CB_MIFRS_DepExp_2011'!O26,+'App.2-CB_MIFRS_DepExp_2011'!O26+((C26*0.5)/D26))","v":0},null,0,0,null,{"$f":"IF(ISERROR(+I26+'App.2-CB_MIFRS_DepExp_2011'!O26-J26), 0, +I26+'App.2-CB_MIFRS_DepExp_2011'!O26-J26)","v":0}]
[1845,"Underground Conductors & Devices",null,null,0,{"$f":"IF(D27=0,+'App.2-CB_MIFRS_DepExp_2011'!O27,+'App.2-CB_MIFRS_DepExp_2011'!O27+((C27*0.5)/D27))","v":0},null,0,0,null,{"$f":"IF(ISERROR(+I27+'App.2-CB_MIFRS_DepExp_2011'!O27-J27), 0, +I27+'App.2-CB_MIFRS_DepExp_2011'!O27-J27)","v":0}]
[1850,"Line Transformers",null,null,0,{"$f":"IF(D28=0,+'App.2-CB_MIFRS_DepExp_2011'!O28,+'App.2-CB_MIFRS_DepExp_2011'!O28+((C28*0.5)/D28))","v":0},null,0,0,null,{"$f":"IF(ISERROR(+I28+'App.2-CB_MIFRS_DepExp_2011'!O28-J28), 0, +I28+'App.2-CB_MIFRS_DepExp_2011'!O28-J28)","v":0}]
[1855,"Services (Overhead & Underground)",null,null,0,{"$f":"IF(D29=0,+'App.2-CB_MIFRS_DepExp_2011'!O29,+'App.2-CB_MIFRS_DepExp_2011'!O29+((C29*0.5)/D29))","v":0},null,0,0,null,{"$f":"IF(ISERROR(+I29+'App.2-CB_MIFRS_DepExp_2011'!O29-J29), 0, +I29+'App.2-CB_MIFRS_DepExp_2011'!O29-J29)","v":0}]
[1860,"Meters",null,null,0,{"$f":"IF(D30=0,+'App.2-CB_MIFRS_DepExp_2011'!O30,+'App.2-CB_MIFRS_DepExp_2011'!O30+((C30*0.5)/D30))","v":0},null,0,0,null,{"$f":"IF(ISERROR(+I30+'App.2-CB_MIFRS_DepExp_2011'!O30-J30), 0, +I30+'App.2-CB_MIFRS_DepExp_2011'!O30-J30)","v":0}]
[1860,"Meters (Smart Meters)",null,null,0,{"$f":"IF(D31=0,+'App.2-CB_MIFRS_DepExp_2011'!O31,+'App.2-CB_MIFRS_DepExp_2011'!O31+((C31*0.5)/D31))","v":0},null,0,0,null,{"$f":"IF(ISERROR(+I31+'App.2-CB_MIFRS_DepExp_2011'!O31-J31), 0, +I31+'App.2-CB_MIFRS_DepExp_2011'!O31-J31)","v":0}]
[1905,"Land",null,null,0,{"$f":"IF(D32=0,+'App.2-CB_MIFRS_DepExp_2011'!O32,+'App.2-CB_MIFRS_DepExp_2011'!O32+((C32*0.5)/D32))","v":0},null,0,0,null,{"$f":"IF(ISERROR(+I32+'App.2-CB_MIFRS_DepExp_2011'!O32-J32), 0, +I32+'App.2-CB_MIFRS_DepExp_2011'!O32-J32)","v":0}]
[1908,"Buildings & Fixtures",null,null,0,{"$f":"IF(D33=0,+'App.2-CB_MIFRS_DepExp_2011'!O33,+'App.2-CB_MIFRS_DepExp_2011'!O33+((C33*0.5)/D33))","v":0},null,0,0,null,{"$f":"IF(ISERROR(+I33+'App.2-CB_MIFRS_DepExp_2011'!O33-J33), 0, +I33+'App.2-CB_MIFRS_DepExp_2011'!O33-J33)","v":0}]
[1910,"Leasehold Improvements",null,null,0,{"$f":"IF(D34=0,+'App.2-CB_MIFRS_DepExp_2011'!O34,+'App.2-CB_MIFRS_DepExp_2011'!O34+((C34*0.5)/D34))","v":0},null,0,0,null,{"$f":"IF(ISERROR(+I34+'App.2-CB_MIFRS_DepExp_2011'!O34-J34), 0, +I34+'App.2-CB_MIFRS_DepExp_2011'!O34-J34)","v":0}]
[1915,"Office Furniture & Equipment (10 years)",null,null,0,{"$f":"IF(D35=0,+'App.2-CB_MIFRS_DepExp_2011'!O35,+'App.2-CB_MIFRS_DepExp_2011'!O35+((C35*0.5)/D35))","v":0},null,0,0,null,{"$f":"IF(ISERROR(+I35+'App.2-CB_MIFRS_DepExp_2011'!O35-J35), 0, +I35+'App.2-CB_MIFRS_DepExp_2011'!O35-J35)","v":0}]
[1915,"Office Furniture & Equipment (5 years)",null,null,0,{"$f":"IF(D36=0,+'App.2-CB_MIFRS_DepExp_2011'!O36,+'App.2-CB_MIFRS_DepExp_2011'!O36+((C36*0.5)/D36))","v":0},null,0,0,null,{"$f":"IF(ISERROR(+I36+'App.2-CB_MIFRS_DepExp_2011'!O36-J36), 0, +I36+'App.2-CB_MIFRS_DepExp_2011'!O36-J36)","v":0}]
[1920,"Computer Equipment - Hardware",null,null,0,{"$f":"IF(D37=0,+'App.2-CB_MIFRS_DepExp_2011'!O37,+'App.2-CB_MIFRS_DepExp_2011'!O37+((C37*0.5)/D37))","v":0},null,0,0,null,{"$f":"IF(ISERROR(+I37+'App.2-CB_MIFRS_DepExp_2011'!O37-J37), 0, +I37+'App.2-CB_MIFRS_DepExp_2011'!O37-J37)","v":0}]
[1920,"Computer Equip.-Hardware(Post Mar. 22/04)",null,null,0,{"$f":"IF(D38=0,+'App.2-CB_MIFRS_DepExp_2011'!O38,+'App.2-CB_MIFRS_DepExp_2011'!O38+((C38*0.5)/D38))","v":0},null,0,0,null,{"$f":"IF(ISERROR(+I38+'App.2-CB_MIFRS_DepExp_2011'!O38-J38), 0, +I38+'App.2-CB_MIFRS_DepExp_2011'!O38-J38)","v":0}]
[1920,"Computer Equip.-Hardware(Post Mar. 19/07)",null,null,0,{"$f":"IF(D39=0,+'App.2-CB_MIFRS_DepExp_2011'!O39,+'App.2-CB_MIFRS_DepExp_2011'!O39+((C39*0.5)/D39))","v":0},null,0,0,null,{"$f":"IF(ISERROR(+I39+'App.2-CB_MIFRS_DepExp_2011'!O39-J39), 0, +I39+'App.2-CB_MIFRS_DepExp_2011'!O39-J39)","v":0}]
[1930,"Transportation Equipment",null,null,0,{"$f":"IF(D40=0,+'App.2-CB_MIFRS_DepExp_2011'!O40,+'App.2-CB_MIFRS_DepExp_2011'!O40+((C40*0.5)/D40))","v":0},null,0,0,null,{"$f":"IF(ISERROR(+I40+'App.2-CB_MIFRS_DepExp_2011'!O40-J40), 0, +I40+'App.2-CB_MIFRS_DepExp_2011'!O40-J40)","v":0}]
[1935,"Stores Equipment",null,null,0,{"$f":"IF(D41=0,+'App.2-CB_MIFRS_DepExp_2011'!O41,+'App.2-CB_MIFRS_DepExp_2011'!O41+((C41*0.5)/D41))","v":0},null,0,0,null,{"$f":"IF(ISERROR(+I41+'App.2-CB_MIFRS_DepExp_2011'!O41-J41), 0, +I41+'App.2-CB_MIFRS_DepExp_2011'!O41-J41)","v":0}]
[1940,"Tools, Shop & Garage Equipment",null,null,0,{"$f":"IF(D42=0,+'App.2-CB_MIFRS_DepExp_2011'!O42,+'App.2-CB_MIFRS_DepExp_2011'!O42+((C42*0.5)/D42))","v":0},null,0,0,null,{"$f":"IF(ISERROR(+I42+'App.2-CB_MIFRS_DepExp_2011'!O42-J42), 0, +I42+'App.2-CB_MIFRS_DepExp_2011'!O42-J42)","v":0}]
[1945,"Measurement & Testing Equipment",null,null,0,{"$f":"IF(D43=0,+'App.2-CB_MIFRS_DepExp_2011'!O43,+'App.2-CB_MIFRS_DepExp_2011'!O43+((C43*0.5)/D43))","v":0},null,0,0,null,{"$f":"IF(ISERROR(+I43+'App.2-CB_MIFRS_DepExp_2011'!O43-J43), 0, +I43+'App.2-CB_MIFRS_DepExp_2011'!O43-J43)","v":0}]
[1950,"Power Operated Equipment",null,null,0,{"$f":"IF(D44=0,+'App.2-CB_MIFRS_DepExp_2011'!O44,+'App.2-CB_MIFRS_DepExp_2011'!O44+((C44*0.5)/D44))","v":0},null,0,0,null,{"$f":"IF(ISERROR(+I44+'App.2-CB_MIFRS_DepExp_2011'!O44-J44), 0, +I44+'App.2-CB_MIFRS_DepExp_2011'!O44-J44)","v":0}]
[1955,"Communications Equipment",null,null,0,{"$f":"IF(D45=0,+'App.2-CB_MIFRS_DepExp_2011'!O45,+'App.2-CB_MIFRS_DepExp_2011'!O45+((C45*0.5)/D45))","v":0},null,0,0,null,{"$f":"IF(ISERROR(+I45+'App.2-CB_MIFRS_DepExp_2011'!O45-J45), 0, +I45+'App.2-CB_MIFRS_DepExp_2011'!O45-J45)","v":0}]
[1955,"Communication Equipment (Smart Meters)",null,null,0,{"$f":"IF(D46=0,+'App.2-CB_MIFRS_DepExp_2011'!O46,+'App.2-CB_MIFRS_DepExp_2011'!O46+((C46*0.5)/D46))","v":0},null,0,0,null,{"$f":"IF(ISERROR(+I46+'App.2-CB_MIFRS_DepExp_2011'!O46-J46), 0, +I46+'App.2-CB_MIFRS_DepExp_2011'!O46-J46)","v":0}]
[1960,"Miscellaneous Equipment ",null,null,0,{"$f":"IF(D47=0,+'App.2-CB_MIFRS_DepExp_2011'!O47,+'App.2-CB_MIFRS_DepExp_2011'!O47+((C47*0.5)/D47))","v":0},null,0,0,null,{"$f":"IF(ISERROR(+I47+'App.2-CB_MIFRS_DepExp_2011'!O47-J47), 0, +I47+'App.2-CB_MIFRS_DepExp_2011'!O47-J47)","v":0}]
[1975,"Load Management Controls Utility Premises",null,null,0,{"$f":"IF(D48=0,+'App.2-CB_MIFRS_DepExp_2011'!O48,+'App.2-CB_MIFRS_DepExp_2011'!O48+((C48*0.5)/D48))","v":0},null,0,0,null,{"$f":"IF(ISERROR(+I48+'App.2-CB_MIFRS_DepExp_2011'!O48-J48), 0, +I48+'App.2-CB_MIFRS_DepExp_2011'!O48-J48)","v":0}]
[1980,"System Supervisor Equipment",null,null,0,{"$f":"IF(D49=0,+'App.2-CB_MIFRS_DepExp_2011'!O49,+'App.2-CB_MIFRS_DepExp_2011'!O49+((C49*0.5)/D49))","v":0},null,0,0,null,{"$f":"IF(ISERROR(+I49+'App.2-CB_MIFRS_DepExp_2011'!O49-J49), 0, +I49+'App.2-CB_MIFRS_DepExp_2011'!O49-J49)","v":0}]
[1985,"Miscellaneous Fixed Assets",null,null,0,{"$f":"IF(D50=0,+'App.2-CB_MIFRS_DepExp_2011'!O50,+'App.2-CB_MIFRS_DepExp_2011'!O50+((C50*0.5)/D50))","v":0},null,0,0,null,{"$f":"IF(ISERROR(+I50+'App.2-CB_MIFRS_DepExp_2011'!O50-J50), 0, +I50+'App.2-CB_MIFRS_DepExp_2011'!O50-J50)","v":0}]
[1995,"Contributions & Grants",null,null,0,{"$f":"IF(D51=0,+'App.2-CB_MIFRS_DepExp_2011'!O51,+'App.2-CB_MIFRS_DepExp_2011'!O51+((C51*0.5)/D51))","v":0},null,0,0,null,{"$f":"IF(ISERROR(+I51+'App.2-CB_MIFRS_DepExp_2011'!O51-J51), 0, +I51+'App.2-CB_MIFRS_DepExp_2011'!O51-J51)","v":0}]
["etc.",null,null,null,0,{"$f":"IF(D52=0,+'App.2-CB_MIFRS_DepExp_2011'!O52,+'App.2-CB_MIFRS_DepExp_2011'!O52+((C52*0.5)/D52))","v":0},null,0,0,null,{"$f":"IF(ISERROR(+I52+'App.2-CB_MIFRS_DepExp_2011'!O52-J52), 0, +I52+'App.2-CB_MIFRS_DepExp_2011'!O52-J52)","v":0}]
[null,null,null,null,0,{"$f":"IF(D53=0,+'App.2-CB_MIFRS_DepExp_2011'!O53,+'App.2-CB_MIFRS_DepExp_2011'!O53+((C53*0.5)/D53))","v":0},null,0,0,null,{"$f":"IF(ISERROR(+I53+'App.2-CB_MIFRS_DepExp_2011'!O53-J53), 0, +I53+'App.2-CB_MIFRS_DepExp_2011'!O53-J53)","v":0}]
[null,"Total",{"$f":"SUM(C16:C53)","v":0},null,null,{"$f":"SUM(F16:F53)","v":0},0,0,0,0,0]
[]
["Notes:"]
[1,"Board policy of the \"half-year\" rule - the applicant must ensure that additions in the year attract a half-year depreciation expense in the first year.  Deviations from this standard practice must be supported in the application."]
[2,"The applicant must provide an explanation of material variances in evidence"]
[3,"This column refers to the calculated full year depreciation but excludes the depreciation expense on assets fully depreciated during the year.  This column is used for the purpose of calculating depreciation expense in the following year on the next worksheet."]
[]
["General:","Applicants must provide a breakdown of depreciation and amortization expense in the above format for all relevant accounts.  Asset Retirement Obligations (AROs), depreciation and accretion expense should be disclosed separately consistent with the Notes of historical Audited Financial Statements."]

{"sheet":"App.2-CD_MIFRS_DepExp_2013","index":37,"n_rows":61,"n_cols":8,"rows_kept":61,"cut":false,"hidden":false,"merged":[[54,1,54,4],[13,1,14,1],[13,6,14,6],[8,0,8,9],[9,0,9,9],[10,0,10,9],[59,1,59,9],[58,1,58,9],[55,1,55,4],[57,1,57,7],[60,1,61,7]]}
[null,null,null,null,null,null,"File Number:",{"$f":"'LDC Info'!$E$18","v":"EB-2012-0126"}]
["Note: This appendix does not apply to GSHi as the company is not adopting MIFRS until 2014",null,null,null,null,null,"Exhibit:"]
[null,null,null,null,null,null,"Tab:"]
[null,null,null,null,null,null,"Schedule:"]
[null,null,null,null,null,null,"Page:"]
[]
[null,null,null,null,null,null,"Date:"]
[]
["Appendix 2-CD"]
["Depreciation and Amortization Expense"]
["Assumes the applicant adopted IFRS for financial reporting purposes January 1, 2012"]
[null,null,2013,"MIFRS"]
[]
["Account","Description","Additions","Years (new additions only)","Depreciation Rate on New Additions","2013 Depreciation Expense 1","2013 Depreciation Expense per Appendix 2-B Fixed Assets, Column K\n (l)","Variance 2"]
[null,null,"(d)","(f)","(g) = 1 / (f)","(h)=2012 Full Year Depreciation + ((d)*0.5)/(f) ",null,"(m) = (h) - (l)"]
[1611,"Computer Software (Formally known as Account 1925)",null,null,{"$f":"IF(D16=0,0,1/D16)","v":0},{"$f":"IF(D16=0,'App.2-CC_MIFRS_DepExp_2012'!K16,+'App.2-CC_MIFRS_DepExp_2012'!K16+((C16*0.5)/D16))","v":0},null,{"$f":"IF(ISERROR(+F16-G16), 0, +F16-G16)","v":0}]
[1612,"Land Rights (Formally known as Account 1906)",null,null,0,{"$f":"IF(D17=0,'App.2-CC_MIFRS_DepExp_2012'!K17,+'App.2-CC_MIFRS_DepExp_2012'!K17+((C17*0.5)/D17))","v":0},null,0]
[1805,"Land",null,null,0,{"$f":"IF(D18=0,'App.2-CC_MIFRS_DepExp_2012'!K18,+'App.2-CC_MIFRS_DepExp_2012'!K18+((C18*0.5)/D18))","v":0},null,0]
[1808,"Buildings",null,null,0,{"$f":"IF(D19=0,'App.2-CC_MIFRS_DepExp_2012'!K19,+'App.2-CC_MIFRS_DepExp_2012'!K19+((C19*0.5)/D19))","v":0},null,0]
[1810,"Leasehold Improvements",null,null,0,{"$f":"IF(D20=0,'App.2-CC_MIFRS_DepExp_2012'!K20,+'App.2-CC_MIFRS_DepExp_2012'!K20+((C20*0.5)/D20))","v":0},null,0]
[1815,"Transformer Station Equipment >50 kV",null,null,0,{"$f":"IF(D21=0,'App.2-CC_MIFRS_DepExp_2012'!K21,+'App.2-CC_MIFRS_DepExp_2012'!K21+((C21*0.5)/D21))","v":0},null,0]
[1820,"Distribution Station Equipment <50 kV",null,null,0,{"$f":"IF(D22=0,'App.2-CC_MIFRS_DepExp_2012'!K22,+'App.2-CC_MIFRS_DepExp_2012'!K22+((C22*0.5)/D22))","v":0},null,0]
[1825,"Storage Battery Equipment",null,null,0,{"$f":"IF(D23=0,'App.2-CC_MIFRS_DepExp_2012'!K23,+'App.2-CC_MIFRS_DepExp_2012'!K23+((C23*0.5)/D23))","v":0},null,0]
[1830,"Poles, Towers & Fixtures",null,null,0,{"$f":"IF(D24=0,'App.2-CC_MIFRS_DepExp_2012'!K24,+'App.2-CC_MIFRS_DepExp_2012'!K24+((C24*0.5)/D24))","v":0},null,0]
[1835,"Overhead Conductors & Devices",null,null,0,{"$f":"IF(D25=0,'App.2-CC_MIFRS_DepExp_2012'!K25,+'App.2-CC_MIFRS_DepExp_2012'!K25+((C25*0.5)/D25))","v":0},null,0]
[1840,"Underground Conduit",null,null,0,{"$f":"IF(D26=0,'App.2-CC_MIFRS_DepExp_2012'!K26,+'App.2-CC_MIFRS_DepExp_2012'!K26+((C26*0.5)/D26))","v":0},null,0]
[1845,"Underground Conductors & Devices",null,null,0,{"$f":"IF(D27=0,'App.2-CC_MIFRS_DepExp_2012'!K27,+'App.2-CC_MIFRS_DepExp_2012'!K27+((C27*0.5)/D27))","v":0},null,0]
[1850,"Line Transformers",null,null,0,{"$f":"IF(D28=0,'App.2-CC_MIFRS_DepExp_2012'!K28,+'App.2-CC_MIFRS_DepExp_2012'!K28+((C28*0.5)/D28))","v":0},null,0]
[1855,"Services (Overhead & Underground)",null,null,0,{"$f":"IF(D29=0,'App.2-CC_MIFRS_DepExp_2012'!K29,+'App.2-CC_MIFRS_DepExp_2012'!K29+((C29*0.5)/D29))","v":0},null,0]
[1860,"Meters",null,null,0,{"$f":"IF(D30=0,'App.2-CC_MIFRS_DepExp_2012'!K30,+'App.2-CC_MIFRS_DepExp_2012'!K30+((C30*0.5)/D30))","v":0},null,0]
[1860,"Meters (Smart Meters)",null,null,0,{"$f":"IF(D31=0,'App.2-CC_MIFRS_DepExp_2012'!K31,+'App.2-CC_MIFRS_DepExp_2012'!K31+((C31*0.5)/D31))","v":0},null,0]
[1905,"Land",null,null,0,{"$f":"IF(D32=0,'App.2-CC_MIFRS_DepExp_2012'!K32,+'App.2-CC_MIFRS_DepExp_2012'!K32+((C32*0.5)/D32))","v":0},null,0]
[1908,"Buildings & Fixtures",null,null,0,{"$f":"IF(D33=0,'App.2-CC_MIFRS_DepExp_2012'!K33,+'App.2-CC_MIFRS_DepExp_2012'!K33+((C33*0.5)/D33))","v":0},null,0]
[1910,"Leasehold Improvements",null,null,0,{"$f":"IF(D34=0,'App.2-CC_MIFRS_DepExp_2012'!K34,+'App.2-CC_MIFRS_DepExp_2012'!K34+((C34*0.5)/D34))","v":0},null,0]
[1915,"Office Furniture & Equipment (10 years)",null,null,0,{"$f":"IF(D35=0,'App.2-CC_MIFRS_DepExp_2012'!K35,+'App.2-CC_MIFRS_DepExp_2012'!K35+((C35*0.5)/D35))","v":0},null,0]
[1915,"Office Furniture & Equipment (5 years)",null,null,0,{"$f":"IF(D36=0,'App.2-CC_MIFRS_DepExp_2012'!K36,+'App.2-CC_MIFRS_DepExp_2012'!K36+((C36*0.5)/D36))","v":0},null,0]
[1920,"Computer Equipment - Hardware",null,null,0,{"$f":"IF(D37=0,'App.2-CC_MIFRS_DepExp_2012'!K37,+'App.2-CC_MIFRS_DepExp_2012'!K37+((C37*0.5)/D37))","v":0},null,0]
[1920,"Computer Equip.-Hardware(Post Mar. 22/04)",null,null,0,{"$f":"IF(D38=0,'App.2-CC_MIFRS_DepExp_2012'!K38,+'App.2-CC_MIFRS_DepExp_2012'!K38+((C38*0.5)/D38))","v":0},null,0]
[1920,"Computer Equip.-Hardware(Post Mar. 19/07)",null,null,0,{"$f":"IF(D39=0,'App.2-CC_MIFRS_DepExp_2012'!K39,+'App.2-CC_MIFRS_DepExp_2012'!K39+((C39*0.5)/D39))","v":0},null,0]
[1930,"Transportation Equipment",null,null,0,{"$f":"IF(D40=0,'App.2-CC_MIFRS_DepExp_2012'!K40,+'App.2-CC_MIFRS_DepExp_2012'!K40+((C40*0.5)/D40))","v":0},null,0]
[1935,"Stores Equipment",null,null,0,{"$f":"IF(D41=0,'App.2-CC_MIFRS_DepExp_2012'!K41,+'App.2-CC_MIFRS_DepExp_2012'!K41+((C41*0.5)/D41))","v":0},null,0]
[1940,"Tools, Shop & Garage Equipment",null,null,0,{"$f":"IF(D42=0,'App.2-CC_MIFRS_DepExp_2012'!K42,+'App.2-CC_MIFRS_DepExp_2012'!K42+((C42*0.5)/D42))","v":0},null,0]
[1945,"Measurement & Testing Equipment",null,null,0,{"$f":"IF(D43=0,'App.2-CC_MIFRS_DepExp_2012'!K43,+'App.2-CC_MIFRS_DepExp_2012'!K43+((C43*0.5)/D43))","v":0},null,0]
[1950,"Power Operated Equipment",null,null,0,{"$f":"IF(D44=0,'App.2-CC_MIFRS_DepExp_2012'!K44,+'App.2-CC_MIFRS_DepExp_2012'!K44+((C44*0.5)/D44))","v":0},null,0]
[1955,"Communications Equipment",null,null,0,{"$f":"IF(D45=0,'App.2-CC_MIFRS_DepExp_2012'!K45,+'App.2-CC_MIFRS_DepExp_2012'!K45+((C45*0.5)/D45))","v":0},null,0]
[1955,"Communication Equipment (Smart Meters)",null,null,0,{"$f":"IF(D46=0,'App.2-CC_MIFRS_DepExp_2012'!K46,+'App.2-CC_MIFRS_DepExp_2012'!K46+((C46*0.5)/D46))","v":0},null,0]
[1960,"Miscellaneous Equipment ",null,null,0,{"$f":"IF(D47=0,'App.2-CC_MIFRS_DepExp_2012'!K47,+'App.2-CC_MIFRS_DepExp_2012'!K47+((C47*0.5)/D47))","v":0},null,0]
[1975,"Load Management Controls Utility Premises",null,null,0,{"$f":"IF(D48=0,'App.2-CC_MIFRS_DepExp_2012'!K48,+'App.2-CC_MIFRS_DepExp_2012'!K48+((C48*0.5)/D48))","v":0},null,0]
[1980,"System Supervisor Equipment",null,null,0,{"$f":"IF(D49=0,'App.2-CC_MIFRS_DepExp_2012'!K49,+'App.2-CC_MIFRS_DepExp_2012'!K49+((C49*0.5)/D49))","v":0},null,0]
[1985,"Miscellaneous Fixed Assets",null,null,0,{"$f":"IF(D50=0,'App.2-CC_MIFRS_DepExp_2012'!K50,+'App.2-CC_MIFRS_DepExp_2012'!K50+((C50*0.5)/D50))","v":0},null,0]
[1995,"Contributions & Grants",null,null,0,{"$f":"IF(D51=0,'App.2-CC_MIFRS_DepExp_2012'!K51,+'App.2-CC_MIFRS_DepExp_2012'!K51+((C51*0.5)/D51))","v":0},null,0]
["etc.",null,null,null,0,{"$f":"IF(D52=0,'App.2-CC_MIFRS_DepExp_2012'!K52,+'App.2-CC_MIFRS_DepExp_2012'!K52+((C52*0.5)/D52))","v":0},null,0]
[null,null,null,null,0,{"$f":"IF(D53=0,'App.2-CC_MIFRS_DepExp_2012'!K53,+'App.2-CC_MIFRS_DepExp_2012'!K53+((C53*0.5)/D53))","v":0},null,0]
[null,"Total",{"$f":"SUM(C16:C53)","v":0},null,null,{"$f":"SUM(F16:F53)","v":0},{"$f":"SUM(G16:G53)","v":0},{"$f":"SUM(H16:H53)","v":0}]
[null,"Depreciation expense adjustment resulting from  amortization of Account 1575",null,null,null,0]
[null,"Total Depreciation expense to be included in the test year revenue requirement",null,null,null,{"$f":"+F54+F55","v":0}]
["Notes:"]
[1,"Board policy of the \"half-year\" rule - the applicant must ensure that additions in the year attract a half-year depreciation expense in the first year.  Deviations from this standard practice must be supported in the application."]
[2,"The applicant must provide an explanation of material variances in evidence"]
[]
["General:","Applicants must provide a breakdown of depreciation and amortization expense in the above format for all relevant accounts.  Asset Retirement Obligations (AROs), depreciation and accretion expense should be disclosed separately consistent with the Notes of historical Audited Financial Statements."]

{"sheet":"App.2-CI_AltAccStd_DepExp","index":38,"n_rows":62,"n_cols":12,"rows_kept":62,"cut":false,"hidden":false,"merged":[[8,0,8,11],[11,4,11,5],[13,0,14,0],[13,1,14,1],[13,10,14,10],[58,1,58,11],[57,1,57,11],[61,1,62,11],[10,0,10,11],[9,0,9,11]]}
[null,null,null,null,null,null,null,null,null,null,"File Number:",{"$f":"'LDC Info'!$E$18","v":"EB-2012-0126"}]
["Note: This appendix does not apply to GSHi as the company is not adopting MIFRS until 2014",null,null,null,null,null,null,null,null,null,"Exhibit:"]
[null,null,null,null,null,null,null,null,null,null,"Tab:"]
[null,null,null,null,null,null,null,null,null,null,"Schedule:"]
[null,null,null,null,null,null,null,null,null,null,"Page:"]
[]
[null,null,null,null,null,null,null,null,null,null,"Date:"]
[]
["Appendix 2-CI"]
["Depreciation and Amortization Expense"]
["Assumes the applicant adopted an alternate accounting standard other than IFRS for financial reporting purposes.  For applicants adopting an Alternate Accounting Standard for financial reporting purposes January 1, 2012, applicants must complete 4 versions of the table below (2011 CGAAP, 2011 Alternate Accounting Standard, 2012 Alternate Accounting Standard and 2013 Alternate Accounting Standard).  For applicants adopting an Alternate Accounting Standard for financial reporting purposes January 1, 2013, applicants must complete 4 versions of the table below (2011 CGAAP, 2012 CGAAP, 2012 Alternate Accounting Standard and 2013 Alternate Accounting Standard)."]
[null,"Year",null,null,"Accounting Standard"]
[]
["Account","Description","Opening\nRegulatory Gross PP&E","Less Fully Depreciated","Net for Depreciation","Additions","Total for Depreciation","Years","Depreciation Rate","Depreciation Expense","Depreciation Expense per Appendix 2-B Fixed Assets, Column K\n (l)","Variance 2"]
[null,null,"(a)","(b)","(c)","(d)","(e) = (c) + ½ x (d) 1","(f)","(g) = 1 / (f)","(h) = (e) / (f)",null,"(m) = (h) - (l)"]
[1611,"Computer Software (Formally known as Account 1925)",null,null,{"$f":"C16-D16","v":0},null,{"$f":"E16+0.5*F16","v":0},null,{"$f":"IF(H16=0,0,1/H16)","v":0},{"$f":"IF(H16=0,0,G16/H16)","v":0},null,{"$f":"IF(ISERROR(+J16-K16), 0, +J16-K16)","v":0}]
[1612,"Land Rights (Formally known as Account 1906)",null,null,{"$f":"C17-D17","v":0},null,{"$f":"E17+0.5*F17","v":0},null,0,0,null,0]
[1805,"Land",null,null,0,null,0,null,0,0,null,0]
[1808,"Buildings",null,null,0,null,0,null,0,0,null,0]
[1810,"Leasehold Improvements",null,null,0,null,0,null,0,0,null,0]
[1815,"Transformer Station Equipment >50 kV",null,null,0,null,0,null,0,0,null,0]
[1820,"Distribution Station Equipment <50 kV",null,null,0,null,0,null,0,0,null,0]
[1825,"Storage Battery Equipment",null,null,0,null,0,null,0,0,null,0]
[1830,"Poles, Towers & Fixtures",null,null,0,null,0,null,0,0,null,0]
[1835,"Overhead Conductors & Devices",null,null,0,null,0,null,0,0,null,0]
[1840,"Underground Conduit",null,null,0,null,0,null,0,0,null,0]
[1845,"Underground Conductors & Devices",null,null,0,null,0,null,0,0,null,0]
[1850,"Line Transformers",null,null,0,null,0,null,0,0,null,0]
[1855,"Services (Overhead & Underground)",null,null,0,null,0,null,0,0,null,0]
[1860,"Meters",null,null,0,null,0,null,0,0,null,0]
[1860,"Meters (Smart Meters)",null,null,0,null,0,null,0,0,null,0]
[1905,"Land",null,null,0,null,0,null,0,0,null,0]
[1908,"Buildings & Fixtures",null,null,0,null,0,null,0,0,null,0]
[1910,"Leasehold Improvements",null,null,0,null,0,null,0,0,null,0]
[1915,"Office Furniture & Equipment (10 years)",null,null,0,null,0,null,0,0,null,0]
[1915,"Office Furniture & Equipment (5 years)",null,null,0,null,0,null,0,0,null,0]
[1920,"Computer Equipment - Hardware",null,null,0,null,0,null,0,0,null,0]
[1920,"Computer Equip.-Hardware(Post Mar. 22/04)",null,null,0,null,0,null,0,0,null,0]
[1920,"Computer Equip.-Hardware(Post Mar. 19/07)",null,null,0,null,0,null,0,0,null,0]
[1930,"Transportation Equipment",null,null,0,null,0,null,0,0,null,0]
[1935,"Stores Equipment",null,null,0,null,0,null,0,0,null,0]
[1940,"Tools, Shop & Garage Equipment",null,null,0,null,0,null,0,0,null,0]
[1945,"Measurement & Testing Equipment",null,null,0,null,0,null,0,0,null,0]
[1950,"Power Operated Equipment",null,null,0,null,0,null,0,0,null,0]
[1955,"Communications Equipment",null,null,0,null,0,null,0,0,null,0]
[1955,"Communication Equipment (Smart Meters)",null,null,0,null,0,null,0,0,null,0]
[1960,"Miscellaneous Equipment ",null,null,0,null,0,null,0,0,null,0]
[1975,"Load Management Controls Utility Premises",null,null,0,null,0,null,0,0,null,0]
[1980,"System Supervisor Equipment",null,null,0,null,0,null,0,0,null,0]
[1985,"Miscellaneous Fixed Assets",null,null,0,null,0,null,0,0,null,0]
[1995,"Contributions & Grants",null,null,0,null,0,null,0,0,null,0]
["etc.",null,null,null,0,null,0,null,0,0,null,0]
[null,null,null,null,0,null,0,null,0,0,null,0]
[null,"Total",{"$f":"SUM(C16:C53)","v":0},{"$f":"SUM(D16:D53)","v":0},{"$f":"SUM(E16:E53)","v":0},0,0,null,null,{"$f":"SUM(J16:J53)","v":0},{"$f":"SUM(K16:K53)","v":0},{"$f":"SUM(L16:L53)","v":0}]
[]
["Notes:"]
[]
[1,"Board policy of the \"half-year\" rule - the applicant must ensure that additions in the year attract a half-year depreciation expense in the first year.  Deviations from this standard practice must be supported in the application."]
[2,"The applicant must provide an explanation of material variances in evidence"]
[]
[]
["General:","Applicants must provide a breakdown of depreciation and amortization expense in the above format for all relevant accounts.  Asset Retirement Obligations (AROs), depreciation and accretion expense should be disclosed separately consistent with the Notes of historical Audited Financial Statements."]

{"sheet":"App.2-EA_PP&E Deferral Account","index":39,"n_rows":55,"n_cols":10,"rows_kept":55,"cut":false,"hidden":false,"merged":[[54,0,55,8],[33,1,34,2],[25,1,26,2],[20,1,20,8],[19,1,19,2],[19,5,19,8],[25,5,26,8],[31,5,31,8],[31,1,31,2],[8,0,8,8],[9,0,9,8],[10,0,10,8],[14,0,14,8],[12,0,12,8]]}
[null,null,null,null,null,null,null,"File Number:",{"$f":"'LDC Info'!$E$18","v":"EB-2012-0126"}]
["Note: This appendix does not apply to GSHi as the company is not adopting MIFRS until 2014",null,null,null,null,null,null,"Exhibit:"]
[null,null,null,null,null,null,null,"Tab:"]
[null,null,null,null,null,null,null,"Schedule:"]
[null,null,null,null,null,null,null,"Page:"]
[]
[null,null,null,null,null,null,null,"Date:"]
[]
["Appendix 2-EA"]
["IFRS-CGAAP Transitional PP&E Amounts"]
["2012 Adopters of IFRS for Financial Reporting Purposes"]
[]
["For applicants that adopt IFRS on January 1, 2012 for financial reporting purposes"]
[]
["Note: this sheet should be filled out if the applicant adopts IFRS for its financial reporting purpose as of January 1, 2012. "]
[]
[null,"2009 Rebasing Year",2010,2011,2012,"2013 Rebasing Year",2014,2015,2016]
["Reporting Basis","CGAAP","IRM","IRM","IRM","MIFRS","IRM","IRM","IRM"]
["Forecast vs. Actual Used in Rebasing Year","Forecast","Actual","Actual","Forecast","Forecast"]
[null,null,null,"$","$"]
["PP&E Values under CGAAP"]
["            Opening net PP&E - Note 1"]
["            Additions"]
["            Depreciation (amounts should be negative)"]
["            Closing net PP&E (1)",null,null,{"$f":"D22+D23+D24","v":0},{"$f":"E22+E23+E24","v":0}]
[]
["PP&E Values under MIFRS (Starts from 2011, the transition year)"]
["            Opening net PP&E  - Note 1"]
["            Additions"]
["            Depreciation (amounts should be negative)"]
["            Closing net PP&E (2)",null,null,{"$f":"SUM(D28:D30)","v":0},{"$f":"SUM(E28:E30)","v":0}]
[]
["Difference in Closing net PP&E, CGAAP vs. MIFRS (Shown as adjustment to rate base on rebasing)",null,null,{"$f":"D25-D31","v":0},{"$f":"E25-E31","v":0}]
[]
["Account 1575 - IFRS-CGAAP Transitional PP&E Amounts"]
["Opening balance ",null,null,0,{"$f":"D40","v":0},{"$f":"E40","v":0},{"$f":"F40","v":0},{"$f":"G40","v":0},{"$f":"H40","v":0}]
["Amounts added in the year",null,null,{"$f":"D33","v":0},{"$f":"E33-D33","v":0}]
["Sub-total",null,null,{"$f":"D36+D37","v":0},0,0,0,0,0]
["Amount of amortization, included in  depreciation expense  - Note 2",null,null,null,null,{"$f":"IF(ISERROR(-E33/I44), 0, -E33/I44)","v":0},{"$f":"+F39","v":0},{"$f":"+F39","v":0},{"$f":"+F39","v":0}]
["          Closing balance in deferral account",null,null,{"$f":"D38+D39","v":0},0,{"$f":"IF(ISERROR(F38+F39), 0, F38+F39)","v":0},0,0,0]
[]
["Effect on Revenue Requirement"]
["Amortization of deferred balance as above - Note 2",null,null,null,null,{"$f":"IF(ISERROR(E33/I44), 0, E33/I44)","v":0},null,"WACC"]
["Return on Rate Base Associated with deferred PP&E balance at WACC  - Note 3 ",null,null,null,null,{"$f":"E33*I43","v":0},null,"Disposition Period - Note 4",4,"Years"]
["     Amount included in Revenue Requirement on rebasing",null,null,null,null,{"$f":"F43+F44","v":0}]
[]
["Notes:"]
["1  For an applicant that adopts IFRS on January 1, 2012, the PP&E values as of January 1, 2011 under both CGAAP and MIFRS should be the same. "]
["2  Amortization of the deferred balance in Account 1575 will start from the rebasing year. "]
["    Assume the utility requests for a certain disposition period, the amortization that should be included in the depreciation expense is calculated as:"]
["   the opening balance of Account 1575 / the approved disposition period"]
["3  Return on rate base associated with deferred balance is calculated as:"]
["     the deferred account opening balance as of 2013 rebasing year x WACC"]
["     * Please note that the calculation should be adjusted once WACC is updated and finalized in the rate application."]
["4  Consistent with the 4 year normal rate cycle, the model is using a 4 year amortization period as a default selection to \"clear\" the PP&E deferral account through a one-time adjustment to ratebase to capture and remove the impact of the accounting policy changes as caused by the transition from CGAAP to MIFRS."]

{"sheet":"App.2-CH_MIFRS_DepExp_2013 NA","index":40,"n_rows":71,"n_cols":10,"rows_kept":71,"cut":false,"hidden":false,"merged":[[10,0,10,9],[63,1,63,4],[70,1,71,9],[67,1,67,9],[66,1,66,9],[15,0,16,0],[15,1,16,1],[15,6,16,6],[12,0,12,9],[11,0,11,9]]}
[null,null,null,null,null,null,null,null,"File Number:",{"$f":"'LDC Info'!$E$18","v":"EB-2012-0126"}]
[null,null,null,null,null,null,null,null,"Exhibit:"]
[null,null,null,null,null,null,null,null,"Tab:"]
[null,null,null,null,null,null,null,null,"Schedule:"]
[null,null,null,null,null,null,null,null,"Page:"]
[]
[null,null,null,null,null,null,null,null,"Date:"]
[]
["Note: This appendix does not apply to GSHi as the company is not adopting MIFRS until 2014"]
[]
["Appendix 2-CH"]
["Depreciation and Amortization Expense"]
["Assumes the applicant adopted IFRS for financial reporting purposes January 1, 2014"]
[null,null,"Year",2013,"CGAAP"]
[]
["Account","Description","Additions","Years (new additions only)","Depreciation Rate on New Additions","2013 Depreciation Expense 1","2013 Depreciation Expense per Appendix 2-B Fixed Assets, Column K\n (l)","Variance 2"]
[null,null,"(d)","(f)","(g) = 1 / (f)","(h)=2012 Full Year Depreciation + ((d)*0.5)/(f) ",null,"(m) = (h) - (l)"]
[1611,"Computer Software (Formally known as Account 1925)",null,null,{"$f":"IF(D18=0,0,1/D18)","v":0},{"$f":"IF(D18=0,'App.2-CG_EUL_DepExp_2013'!R16,+'App.2-CG_EUL_DepExp_2013'!R16+((C18*0.5)/D18))","v":347265.27799999999},null,{"$f":"IF(ISERROR(+F18-G18), 0, +F18-G18)","v":347265.27799999999}]
[1612,"Land Rights (Formally known as Account 1906)",null,null,0,{"$f":"IF(D19=0,'App.2-CG_EUL_DepExp_2013'!R17,+'App.2-CG_EUL_DepExp_2013'!R17+((C19*0.5)/D19))","v":0},null,0]
[1805,"Land",null,null,0,{"$f":"IF(D20=0,'App.2-CG_EUL_DepExp_2013'!R18,+'App.2-CG_EUL_DepExp_2013'!R18+((C20*0.5)/D20))","v":0},null,0]
[1808,"Buildings",null,null,0,{"$f":"IF(D21=0,'App.2-CG_EUL_DepExp_2013'!R19,+'App.2-CG_EUL_DepExp_2013'!R19+((C21*0.5)/D21))","v":235990.15415234448},null,235990.15415234448]
[1810,"Leasehold Improvements",null,null,0,{"$f":"IF(D22=0,'App.2-CG_EUL_DepExp_2013'!R20,+'App.2-CG_EUL_DepExp_2013'!R20+((C22*0.5)/D22))","v":113329.95433760683},null,113329.95433760683]
[1815,"Transformer Station Equipment >50 kV",null,null,0,{"$f":"IF(D23=0,'App.2-CG_EUL_DepExp_2013'!R21,+'App.2-CG_EUL_DepExp_2013'!R21+((C23*0.5)/D23))","v":0},null,0]
[1820,"Distribution Station Equipment <50 kV",null,null,0,{"$f":"IF(D24=0,'App.2-CG_EUL_DepExp_2013'!R22,+'App.2-CG_EUL_DepExp_2013'!R22+((C24*0.5)/D24))","v":514371.97601925867},null,514371.97601925867]
[1820,"Distribution Station Equipment <50 kV"]
[1820,"Distribution Station Equipment <50 kV"]
[1825,"Storage Battery Equipment",null,null,0,{"$f":"IF(D27=0,'App.2-CG_EUL_DepExp_2013'!R25,+'App.2-CG_EUL_DepExp_2013'!R25+((C27*0.5)/D27))","v":0},null,0]
[1830,"Poles, Towers & Fixtures",null,null,0,{"$f":"IF(D28=0,'App.2-CG_EUL_DepExp_2013'!R26,+'App.2-CG_EUL_DepExp_2013'!R26+((C28*0.5)/D28))","v":394139.55940312665},null,394139.55940312665]
[1835,"Overhead Conductors & Devices",null,null,0,{"$f":"IF(D29=0,'App.2-CG_EUL_DepExp_2013'!R27,+'App.2-CG_EUL_DepExp_2013'!R27+((C29*0.5)/D29))","v":502728.05279283499},null,502728.05279283499]
[1840,"Underground Conduit",null,null,0,{"$f":"IF(D30=0,'App.2-CG_EUL_DepExp_2013'!R28,+'App.2-CG_EUL_DepExp_2013'!R28+((C30*0.5)/D30))","v":253117.28361355886},null,253117.28361355886]
[1845,"Underground Conductors & Devices",null,null,0,{"$f":"IF(D31=0,'App.2-CG_EUL_DepExp_2013'!R29,+'App.2-CG_EUL_DepExp_2013'!R29+((C31*0.5)/D31))","v":436895.64941813151},null,436895.64941813151]
[1850,"Line Transformers",null,null,0,{"$f":"IF(D32=0,'App.2-CG_EUL_DepExp_2013'!R30,+'App.2-CG_EUL_DepExp_2013'!R30+((C32*0.5)/D32))","v":503337.24357265164},null,503337.24357265164]
[1855,"Services (Overhead & Underground)",null,null,0,{"$f":"IF(D33=0,'App.2-CG_EUL_DepExp_2013'!R31,+'App.2-CG_EUL_DepExp_2013'!R31+((C33*0.5)/D33))","v":222044.71068052345},null,222044.71068052345]
[1860,"Meters",null,null,0,{"$f":"IF(D34=0,'App.2-CG_EUL_DepExp_2013'!R32,+'App.2-CG_EUL_DepExp_2013'!R32+((C34*0.5)/D34))","v":17430.406527735136},null,17430.406527735136]
[1860,"Stranded Meters Disposition",null,null,0,{"$f":"IF(D35=0,'App.2-CG_EUL_DepExp_2013'!R34,+'App.2-CG_EUL_DepExp_2013'!R34+((C35*0.5)/D35))","v":6666.6749406323461},null,6666.6749406323461]
[1860,"Meters (Smart Meters)"]
[1860,"Meters (Metering Equipment)"]
[1860,"Meters (Wholesale Metering)"]
[1905,"Land",null,null,0,{"$f":"IF(D39=0,'App.2-CG_EUL_DepExp_2013'!R37,+'App.2-CG_EUL_DepExp_2013'!R37+((C39*0.5)/D39))","v":0},null,0]
[1908,"Buildings & Fixtures",null,null,0,{"$f":"IF(D40=0,'App.2-CG_EUL_DepExp_2013'!R38,+'App.2-CG_EUL_DepExp_2013'!R38+((C40*0.5)/D40))","v":0},null,0]
[1910,"Leasehold Improvements",null,null,0,{"$f":"IF(D41=0,'App.2-CG_EUL_DepExp_2013'!R39,+'App.2-CG_EUL_DepExp_2013'!R39+((C41*0.5)/D41))","v":0},null,0]
[1915,"Office Furniture & Equipment (10 years)",null,null,0,{"$f":"IF(D42=0,'App.2-CG_EUL_DepExp_2013'!R40,+'App.2-CG_EUL_DepExp_2013'!R40+((C42*0.5)/D42))","v":938.51849999999945},null,938.51849999999945]
[1915,"Office Furniture & Equipment (5 years)",null,null,0,{"$f":"IF(D43=0,'App.2-CG_EUL_DepExp_2013'!R41,+'App.2-CG_EUL_DepExp_2013'!R41+((C43*0.5)/D43))","v":0},null,0]
[1920,"Computer Equipment - Hardware",null,null,0,{"$f":"IF(D44=0,'App.2-CG_EUL_DepExp_2013'!R42,+'App.2-CG_EUL_DepExp_2013'!R42+((C44*0.5)/D44))","v":105099.412},null,105099.412]
[1920,"Computer Equip.-Hardware(Post Mar. 22/04)",null,null,0,{"$f":"IF(D45=0,'App.2-CG_EUL_DepExp_2013'!R43,+'App.2-CG_EUL_DepExp_2013'!R43+((C45*0.5)/D45))","v":0},null,0]
[1920,"Computer Equip.-Hardware(Post Mar. 19/07)",null,null,0,{"$f":"IF(D46=0,'App.2-CG_EUL_DepExp_2013'!R44,+'App.2-CG_EUL_DepExp_2013'!R44+((C46*0.5)/D46))","v":0},null,0]
[1930,"Transportation Equipment",null,null,0,{"$f":"IF(D47=0,'App.2-CG_EUL_DepExp_2013'!R45,+'App.2-CG_EUL_DepExp_2013'!R45+((C47*0.5)/D47))","v":160479.56797248102},null,160479.56797248102]
[1930,"Transportation Equipment"]
[1935,"Stores Equipment",null,null,0,{"$f":"IF(D49=0,'App.2-CG_EUL_DepExp_2013'!R47,+'App.2-CG_EUL_DepExp_2013'!R47+((C49*0.5)/D49))","v":0},null,0]
[1940,"Tools, Shop & Garage Equipment",null,null,0,{"$f":"IF(D50=0,'App.2-CG_EUL_DepExp_2013'!R48,+'App.2-CG_EUL_DepExp_2013'!R48+((C50*0.5)/D50))","v":98380.353000000003},null,98380.353000000003]
[1945,"Measurement & Testing Equipment",null,null,0,{"$f":"IF(D51=0,'App.2-CG_EUL_DepExp_2013'!R49,+'App.2-CG_EUL_DepExp_2013'!R49+((C51*0.5)/D51))","v":0},null,0]
[1950,"Power Operated Equipment",null,null,0,{"$f":"IF(D52=0,'App.2-CG_EUL_DepExp_2013'!R50,+'App.2-CG_EUL_DepExp_2013'!R50+((C52*0.5)/D52))","v":0},null,0]
[1955,"Communications Equipment",null,null,0,{"$f":"IF(D53=0,'App.2-CG_EUL_DepExp_2013'!R51,+'App.2-CG_EUL_DepExp_2013'!R51+((C53*0.5)/D53))","v":89639.755699999994},null,89639.755699999994]
[1955,"Communication Equipment (Smart Meters)",null,null,0,{"$f":"IF(D54=0,'App.2-CG_EUL_DepExp_2013'!R52,+'App.2-CG_EUL_DepExp_2013'!R52+((C54*0.5)/D54))","v":0},null,0]
[1960,"Miscellaneous Equipment (Smart Meters)",null,null,0,{"$f":"IF(D55=0,'App.2-CG_EUL_DepExp_2013'!R53,+'App.2-CG_EUL_DepExp_2013'!R53+((C55*0.5)/D55))","v":0},null,0]
[1975,"Load Management Controls Utility Premises",null,null,0,{"$f":"IF(D56=0,'App.2-CG_EUL_DepExp_2013'!R54,+'App.2-CG_EUL_DepExp_2013'!R54+((C56*0.5)/D56))","v":0},null,0]
[1980,"System Supervisor Equipment",null,null,0,{"$f":"IF(D57=0,'App.2-CG_EUL_DepExp_2013'!R55,+'App.2-CG_EUL_DepExp_2013'!R55+((C57*0.5)/D57))","v":40173.580337991916},null,40173.580337991916]
[1985,"Miscellaneous Fixed Assets",null,null,0,{"$f":"IF(D58=0,'App.2-CG_EUL_DepExp_2013'!R56,+'App.2-CG_EUL_DepExp_2013'!R56+((C58*0.5)/D58))","v":0},null,0]
[1995,"Contributions & Grants",null,null,0,{"$f":"IF(D59=0,'App.2-CG_EUL_DepExp_2013'!R57,+'App.2-CG_EUL_DepExp_2013'!R57+((C59*0.5)/D59))","v":-310241.98425653751},null,-310241.98425653751]
["etc.",null,null,null,0,{"$f":"IF(D60=0,'App.2-CG_EUL_DepExp_2013'!R58,+'App.2-CG_EUL_DepExp_2013'!R58+((C60*0.5)/D60))","v":0},null,0]
[null,null,null,null,0,{"$f":"IF(D61=0,'App.2-CG_EUL_DepExp_2013'!R59,+'App.2-CG_EUL_DepExp_2013'!R59+((C61*0.5)/D61))","v":0},null,0]
[null,"Total",{"$f":"SUM(C18:C61)","v":0},null,null,{"$f":"SUM(F18:F61)","v":3731786.1467123399},{"$f":"SUM(G18:G61)","v":0},{"$f":"SUM(H18:H61)","v":3731786.1467123399}]
[null,"Depreciation expense adjustment resulting from  amortization of Account 1575",null,null,null,0]
[null,"Total Depreciation expense to be included in the test year revenue requirement",null,null,null,{"$f":"+F63+F62","v":3731786.1467123399}]
[]
["Notes:"]
[1,"Board policy of the \"half-year\" rule - the applicant must ensure that additions in the year attract a half-year depreciation expense in the first year.  Deviations from this standard practice must be supported in the application."]
[2,"The applicant must provide an explanation of material variances in evidence"]
[]
[]
["General:","Applicants must provide a breakdown of depreciation and amortization expense in the above format for all relevant accounts.  Asset Retirement Obligations (AROs), depreciation and accretion expense should be disclosed separately consistent with the Notes of historical Audited Financial Statements."]

{"sheet":"App.2-EB_PP&E Deferral Acct NA","index":41,"n_rows":55,"n_cols":10,"rows_kept":55,"cut":false,"hidden":false,"merged":[[54,0,55,8],[20,1,20,8],[8,0,8,8],[9,0,9,8],[10,0,10,8],[14,0,14,8],[12,0,12,8]]}
[null,null,null,null,null,null,null,"File Number:",{"$f":"'LDC Info'!$E$18","v":"EB-2012-0126"}]
["Note: This appendix does not apply to GSHi as the company is not adopting MIFRS until 2014",null,null,null,null,null,null,"Exhibit:"]
[null,null,null,null,null,null,null,"Tab:"]
[null,null,null,null,null,null,null,"Schedule:"]
[null,null,null,null,null,null,null,"Page:"]
[]
[null,null,null,null,null,null,null,"Date:"]
[]
["Appendix 2-EB"]
["IFRS-CGAAP Transitional PP&E Amounts"]
["2013 Adopters of IFRS for Financial Reporting Purposes"]
[]
["For applicants that adopt IFRS on January 1, 2013 for financial reporting purposes"]
[]
["Note: this sheet should be filled out if the applicant adopts IFRS for its financial reporting purpose as of January 1, 2013. "]
[]
[null,"2009 Rebasing Year",2010,2011,2012,"2013 Rebasing Year",2014,2015,2016]
["Reporting Basis","CGAAP","IRM","IRM","IRM","MIFRS","IRM","IRM","IRM"]
["Forecast vs. Actual Used in Rebasing Year","Forecast","Actual","Actual","Forecast","Forecast"]
[null,null,null,"$","$","$","$","$","$"]
["PP&E Values under CGAAP"]
["            Opening net PP&E - Note 1"]
["            Additions"]
["            Depreciation (amounts should be negative)"]
["            Closing net PP&E (1)",null,null,null,{"$f":"SUM(E22:E24)","v":0}]
[]
["PP&E Values under MIFRS (Starts from 2012, the transition year)"]
["            Opening net PP&E  - Note 1"]
["            Additions"]
["            Depreciation (amounts should be negative)"]
["            Closing net PP&E (2)",null,null,null,{"$f":"SUM(E28:E30)","v":0}]
[]
["Difference in Closing net PP&E, CGAAP vs. MIFRS (Shown as adjustment to rate base on rebasing)",null,null,null,{"$f":"E25-E31","v":0}]
[]
["Account 1575 - IFRS-CGAAP Transitional PP&E Amounts"]
["          Opening balance ",null,null,null,{"$f":"D40","v":0},{"$f":"E40","v":0},{"$f":"F40","v":0},{"$f":"G40","v":0},{"$f":"H40","v":0}]
["          Amounts added in the year",null,null,null,{"$f":"E33-D33","v":0}]
["Sub-total",null,null,null,{"$f":"E36+E37","v":0},{"$f":"F36+F37","v":0},{"$f":"G36+G37","v":0},{"$f":"H36+H37","v":0},{"$f":"I36+I37","v":0}]
["Amount of amortization, included in  depreciation expense  - Note 2",null,null,null,null,{"$f":"IF(ISERROR(-E33/I44), 0, -E33/I44)","v":0},{"$f":"+F39","v":0},{"$f":"+F39","v":0},{"$f":"+F39","v":0}]
["          Closing balance in deferral account",null,null,null,{"$f":"E38+E39","v":0},{"$f":"IF(ISERROR(F38+F39), 0, F38+F39)","v":0},{"$f":"G38+G39","v":0},{"$f":"H38+H39","v":0},{"$f":"I38+I39","v":0}]
[]
["Effect on Revenue Requirement"]
["        Amortization of deferred balance as above - Note 2",null,null,null,null,{"$f":"IF(ISERROR(E33/I44), 0, E33/I44)","v":0},null,"WACC"]
["Return on Rate Base Associated with deferred PP&E balance at WACC  - Note 3 ",null,null,null,null,{"$f":"E33*I43","v":0},null,"Disposition Period - Note 4",4,"Years"]
["     Amount included in Revenue Requirement on rebasing",null,null,null,null,{"$f":"F43+F44","v":0}]
[]
["Notes:"]
["1  For an applicant that adopts IFRS on January 1, 2013, the PP&E values as of January 1, 2012 under both CGAAP and MIFRS should be the same. "]
["2  Amortization of the deferred balance in Account 1575 will start from the rebasing year. "]
["    Assume the utility requests for a certain disposition period, the amortization that should be included in the depreciation expense is calculated as:"]
["   the opening balance of Account 1575 / the approved disposition period"]
["3  Return on rate base associated with deferred balance is calculated as:"]
["     the deferred account opening balance as of 2013 rebasing year x WACC "]
["     * Please note that the calculation should be adjusted once WACC is updated and finalized in the rate application."]
["4  Consistent with the 4 year normal rate cycle, the model is using a 4 year amortization period as a default selection to \"clear\" the PP&E deferral account through a one-time adjustment to ratebase to capture and remove the impact of the accounting policy changes as caused by the transition from CGAAP to MIFRS."]

{"sheet":"App.2-Q_Cost of Serv. Emb. Dx","index":42,"n_rows":61,"n_cols":7,"rows_kept":61,"cut":false,"hidden":false,"merged":[[59,3,60,3],[59,4,60,4],[54,4,55,4],[8,0,8,6],[9,0,9,6],[16,0,16,1],[16,2,16,3],[54,3,55,3],[9,7,9,11],[12,0,12,6],[11,0,11,6],[14,0,14,1],[14,2,14,3]]}
[null,null,null,null,null,"File Number:",{"$f":"'LDC Info'!$E$18","v":"EB-2012-0126"}]
["Note: This appendix does not apply to GSHi ",null,null,null,null,"Exhibit:"]
[null,null,null,null,null,"Tab:"]
[null,null,null,null,null,"Schedule:"]
[null,null,null,null,null,"Page:"]
[]
[null,null,null,null,null,"Date:"]
[]
["Appendix 2-Q"]
["Cost of Serving Embedded Distributor(s) "]
[]
["To be completed by Host Distributors*"]
["(Not required if Host Distributor has an Embedded Distributor rate class, i.e. a separate row in Appendix 2-P.)"]
[]
[]
[]
["Proposed Rate Class for Billing Embedded Distributor(s)"]
[]
["Host's Distribution Facilities used by Embedded Distributor(s)"]
[]
["(1)","(2)","(3)","(4)","(5)","(6) = '(3) + (4)"]
["Asset Class","Total OM&A costs asociated with asset class ","Original cost of asset class ","Accumulated amortization of asset class","Annual amortization of asset class","Net Book Value of asset class"]
["Totals for Host Distributor:","($)","($)","($)","($)"]
["Distribution Stations",null,null,null,null,{"$f":"C24+D24","v":0}]
["Low Voltage Line",null,null,null,null,0]
["LV Line category # 2 (if applcable)",null,null,null,null,0]
["TS (owned by host)",null,null,null,null,0]
["add rows if necessary... ",null,null,null,null,0]
[null,null,null,null,null,0]
[null,null,null,null,null,0]
[]
["(1)","(7)","(8)","(9)","(10)","(11)"]
[{"$f":"A22","v":"Asset Class"},"Total line length or station capacity in asset class","Line length or capacity required to provide LV service to Embedded Distributor(s)","Annual total demand on station/line providing LV services (sum of 12 monthly peaks)","Annual billed Embedded Distributor demand on station/line providing LV services","Embedded Distributor(s)' Responsibility Share "]
["Embedded Distributor's share:","kW or kVa; km","kW or kVA; km","kW or kVA","kW or kVA","percent"]
["Distribution Stations",null,null,null,null,{"$f":"IF(D35=0,0,(C35/B35)*(E35/D35))","v":0}]
["Low Voltage Line",null,null,null,null,{"$f":"IF(D36=0,0,(C36/B36)*(E36/D36))","v":0}]
["LV Line # 2 (if applicable) ",null,null,null,null,{"$f":"IF(D37=0,0,(C37/B37)*(E37/D37))","v":0}]
["TS (owned by host)",null,null,null,null,{"$f":"IF(D38=0,0,(C38/B38)*(E38/D38))","v":0}]
["add rows if necessary ",null,null,null,null,{"$f":"IF(D39=0,0,(C39/B39)*(E39/D39))","v":0}]
[]
["(1)","(12)","(12a)","(13)","(14)","(15)","(16)"]
[{"$f":"A33","v":"Asset Class"},"Return on Assets used to Provide LV services","Taxes/PILs","Annual amortization on assets used to provide LV services","OM&A costs with burden associated with assets used to provide LV services","Total annual cost associated with assets used to provide LV services","Monthly cost associated with the delivery of LV services"]
[null,"($)","($)","($)","($)","($)","$/kW or $/kVA"]
["Distribution Stations",{"$f":"E$55*(F24+B24*E$60)*F35","v":0},{"$f":"(B44-(B$55*C$55*F35*(F24+B24*E58)+B$56*C$56*F35*(F24+B24*E$58)))*E$58/(1-E$58)","v":0},{"$f":"E24*F35","v":0},{"$f":"B24*F35","v":0},{"$f":"SUM(B44:E44)","v":0},{"$f":"IF(E35=0,0,(D44/E35))","v":0}]
["Low Voltage Line",{"$f":"E$55*(F25+B25*E$60)*F36","v":0},{"$f":"(B45-(B$55*C$55*F36*(F25+B25*E59)+B$56*C$56*F36*(F25+B25*E59)))*E$58/(1-E$58)","v":0},{"$f":"E25*F36","v":0},{"$f":"B25*F36","v":0},{"$f":"SUM(B45:E45)","v":0},{"$f":"IF(E36=0,0,(D45/E36))","v":0}]
["LV Line # 2 (if applicable) ",{"$f":"E$55*(F26+B26*E$60)*F37","v":0},{"$f":"(B46-(B$55*C$55*F37*(F26+B26*E60)+B$56*C$56*F37*(F26+B26*E$60)))*E$58/(1-E$58)","v":0},{"$f":"E26*F37","v":0},{"$f":"B26*F37","v":0},{"$f":"SUM(B46:E46)","v":0},{"$f":"IF(E37=0,0,(D46/E37))","v":0}]
["TS (owned by host)",{"$f":"E$55*(F27+B27*E$60)*F38","v":0},{"$f":"(B47-(B$55*C$55*F38*(F27+B27*E61)+B$56*C$56*F38*(F27+B27*E61)))*E$58/(1-E$58)","v":0},{"$f":"E27*F38","v":0},{"$f":"B27*F38","v":0},{"$f":"SUM(B47:E47)","v":0},{"$f":"IF(E38=0,0,(D47/E38))","v":0}]
["add rows if necessary ",{"$f":"E$55*(F28+B28*E$60)*F39","v":0},{"$f":"(B48-(B$55*C$55*F39*(F28+B28*I62)+B$56*C$56*F39*(F28+B28*I62)))*E$58/(1-E$58)","v":0},{"$f":"E28*F39","v":0},{"$f":"B28*F39","v":0},{"$f":"SUM(B48:E48)","v":0},{"$f":"IF(E39=0,0,(D48/E39))","v":0}]
[]
["Total",null,null,null,null,{"$f":"SUM(F44:F48)","v":0},{"$f":"SUM(G44:G48)","v":0}]
[]
["(17)","(18)","(19)","(20)","(21)"]
[null,"Capital Structure","Cost Rate"]
[null,"(%)","(%)",null,"(%)"]
["Long-Term Debt",null,null,"Weighted Average Cost of Capital",{"$f":"IF(B61=0%,0,SUMPRODUCT(B55:B59,C55:C59)/B61)","v":0}]
["Short-term Debt"]
[]
["Common Equity",null,null,"Tax/PILs Rate"]
["Preferred Shares"]
[null,null,null,"Working Capital Allowance Factor"]
["Total",{"$f":"SUM(B55:B59)","v":0}]