{"text_format":"1","workbook":"xlsx","n_sheets":9,"sheets":["1. Utility_Info","2. ICM_Costs","3. Cost_of_Service_Parameters","4. ICM_Assets_and_Rate_Base","5. UCC_Calculation","6. ICMIRR_2021 actual","7. Rate Rider Revs","8. Opex Interest Annual","9. IRR"],"not_rendered":{"charts":0,"images":5,"macros":1,"external_links":0,"defined_names":9381,"comments":1,"pivot_tables":0},"unopened":[],"bounds":{"document_bytes":16777216,"sheet_cells":100000,"rows_first":2000,"rows_last":500,"rows_between":2000,"halvings":0,"cell_chars":16384,"cell_head_chars":4096},"cells_cut":0,"cells_raw":0,"read":"whole","date_system":"1900"}

{"sheet":"1. Utility_Info","index":0,"n_rows":85,"n_cols":28,"rows_kept":85,"cut":false,"hidden":false,"merged":[[20,3,20,5],[22,3,22,7],[1,2,1,9],[2,2,2,9],[3,2,3,9],[4,2,4,9],[14,3,14,4],[18,3,18,4]]}
[null,null,null,null,null,null,null,null,null,null,null,null,null,null,null,null,null,null,null,null,null,null,null,null,null,null,null,"Algoma Power Inc."]
[null,null,null,null,null,null,null,null,null,null,null,null,null,null,null,null,null,null,null,null,null,null,null,null,null,null,null,"Atikokan Hydro Inc."]
[null,null,null,null,null,null,null,null,null,null,null,null,null,null,null,null,null,null,null,null,null,null,null,null,null,null,null,"Attawapiskat Power Corporation"]
[null,null,null,null,null,null,null,null,null,null,null,null,null,null,null,null,null,null,null,null,null,null,null,null,null,null,null,"Bluewater Power Distribution Corp."]
[null,null,null,null,null,null,null,null,null,null,null,null,null,null,null,null,null,null,null,null,null,null,null,null,null,null,null,"Brant County Power"]
[null,null,null,null,null,null,null,null,null,null,null,null,null,null,null,null,null,null,null,null,null,null,null,null,null,null,null,"Brantford Power Inc."]
[null,null,null,null,null,null,null,null,null,null,null,null,null,null,null,null,null,null,null,null,null,null,null,null,null,null,null,"Burlington Hydro Inc."]
[null,null,null,null,null,null,null,null,null,null,null,null,null,null,null,null,null,null,null,null,null,null,null,null,null,null,null,"Cambridge and North Dumfries Hydro"]
[null,null,null,null,null,null,null,null,null,null,null,null,null,null,null,null,null,null,null,null,null,null,null,null,null,null,null,"Canadian Niagara Power Inc. – Eastern Ontario Power/Fort Erie/Port Colborne"]
[null,null,null,null,null,null,null,null,null,null,null,null,null,null,null,null,null,null,null,null,null,null,null,null,null,null,null,"Centre Wellington Hydro Ltd."]
[null,null,null,null,null,null,null,null,null,null,null,null,null,null,null,null,null,null,null,null,null,null,null,null,null,null,null,"Chapleau Public Utilities Corporation"]
[null,null,null,null,null,null,null,null,null,null,null,null,null,null,null,null,null,null,null,null,null,null,null,null,null,null,null,"COLLUS Power Corp."]
[null,null,null,null,null,null,null,"Version",4,null,null,null,null,null,null,null,null,null,null,null,null,null,null,null,null,null,null,"Cooperative Hydro Embrun Inc."]
[null,null,null,null,null,null,null,null,null,null,null,null,null,null,null,null,null,null,null,null,null,null,null,null,null,null,null,"E.L.K. Energy Inc."]
[null,null,"Utility Name   ","Alectra Utilities Corporation - Brampton Rate Zone",null,null,null,null,null,null,null,null,null,null,null,null,null,null,null,null,null,null,null,null,null,null,null,"Enersource Hydro Mississauga Inc."]
[null,null,null,null,null,null,null,null,null,null,null,null,null,null,null,null,null,null,null,null,null,null,null,null,null,null,null,"Entegrus Powerlines Inc."]
[null,null,"Assigned EB Number","EB-2025-0252",null,null,null,null,null,null,null,null,null,null,null,null,null,null,null,null,null,null,null,null,null,null,null,"ENWIN Utilities Ltd."]
[null,null,null,null,null,null,null,null,null,null,null,null,null,null,null,null,null,null,null,null,null,null,null,null,null,null,null,"Erie Thames Powerlines Corp."]
[null,null,"Name and Title","Natalie Yeates, Director, Regulatory Affairs",null,null,null,null,null,null,null,null,null,null,null,null,null,null,null,null,null,null,null,null,null,null,null,"Espanola Regional Hydro Distribution Corporation"]
[null,null,null,null,null,null,null,null,null,null,null,null,null,null,null,null,null,null,null,null,null,null,null,null,null,null,null,"Essex Powerlines Corporation"]
[null,null,"Phone Number","416-617-1959",null,null,null,null,null,null,null,null,null,null,null,null,null,null,null,null,null,null,null,null,null,null,null,"Festival Hydro Inc."]
[null,null,null,null,null,null,null,null,null,null,null,null,null,null,null,null,null,null,null,null,null,null,null,null,null,null,null,"Fort Albany Power Corporation"]
[null,null,"Email Address","natalie.yeates@alectrautilities.com",null,null,null,null,null,null,null,null,null,null,null,null,null,null,null,null,null,null,null,null,null,null,null,"Fort Frances Power Corporation"]
[null,null,null,null,null,null,null,null,null,null,null,null,null,null,null,null,null,null,null,null,null,null,null,null,null,null,null,"Greater Sudbury Hydro Inc."]
[null,null,"Date",null,null,null,null,null,null,null,null,null,null,null,null,null,null,null,null,null,null,null,null,null,null,null,null,"Grimsby Power Inc."]
[null,null,null,null,null,null,null,null,null,null,null,null,null,null,null,null,null,null,null,null,null,null,null,null,null,null,null,"Guelph Hydro Electric Systems Inc."]
[null,null,"ICM Project","2021 - Goreway Road Widening",null,null,null,null,null,null,null,null,null,null,null,null,null,null,null,null,null,null,null,null,null,null,null,"Halton Hills Hydro Inc."]
[null,null,null,null,null,null,null,null,null,null,null,null,null,null,null,null,null,null,null,null,null,null,null,null,null,null,null,"Hearst Power Distribution Co. Ltd."]
["Note:  Drop-down lists are shaded blue; Input cells are shaded green."]
[]
{"$rows_left_out":56}
{"sheet":"2. ICM_Costs","index":1,"n_rows":217,"n_cols":11,"rows_kept":217,"cut":false,"hidden":false,"merged":[[166,2,166,3],[168,2,168,3],[170,2,170,3]]}
[]
[]
[]
[]
[]
[]
[]
[]
[]
[]
[]
[]
[]
[]
[]
[]
[]
[null,null,null,null,null,null,2021,null,2015,null,"Total"]
[null,"Sheet 2: ICM Capital Cost Data",null,null,null,null,"Audited Actual",null,"Forecast"]
[]
[]
[]
[]
[]
[]
[]
[]
[]
[]
[]
{"$rows_left_out":188}
{"sheet":"3. Cost_of_Service_Parameters","index":2,"n_rows":140,"n_cols":23,"rows_kept":140,"cut":false,"hidden":false,"merged":[]}
[]
[]
[]
[]
[]
[]
[]
[]
[]
[]
[]
[]
[]
[]
[]
[]
[null,"Sheet 3: Parameters and Rates"]
[]
[null,null,null,null,null,null,2018,null,2019,null,2020,null,2021,null,2022,null,2023,null,2024,null,2025,null,2026]
[null,"Cost of Capital"]
[null,null,"Capital Structure"]
[null,null,null,"Deemed Short-term Debt Capitalization",null,null,0.04,null,0.04,null,0.04,null,0.04,null,0.04,null,0.04,null,0.04,null,0.04,null,0.04]
[null,null,null,"Deemed Long-term Debt Capitalization",null,null,{"$f":"60%-G22","v":0.55999999999999994},null,{"$f":"60%-I22","v":0.55999999999999994},null,{"$f":"60%-K22","v":0.55999999999999994},null,{"$f":"60%-M22","v":0.55999999999999994},null,{"$f":"60%-O22","v":0.55999999999999994},null,{"$f":"60%-Q22","v":0.55999999999999994},null,{"$f":"60%-S22","v":0.55999999999999994},null,{"$f":"60%-U22","v":0.55999999999999994},null,{"$f":"60%-W22","v":0.55999999999999994}]
[null,null,null,"Deemed Equity Capitalization",null,null,{"$f":"100%-G23-G25-G22","v":0.40000000000000008},null,{"$f":"100%-I23-I25-I22","v":0.40000000000000008},null,{"$f":"100%-K23-K25-K22","v":0.40000000000000008},null,{"$f":"100%-M23-M25-M22","v":0.40000000000000008},null,{"$f":"100%-O23-O25-O22","v":0.40000000000000008},null,{"$f":"100%-Q23-Q25-Q22","v":0.40000000000000008},null,{"$f":"100%-S23-S25-S22","v":0.40000000000000008},null,{"$f":"100%-U23-U25-U22","v":0.40000000000000008},null,{"$f":"100%-W23-W25-W22","v":0.40000000000000008}]
[null,null,null,"Preferred Shares"]
[null,null,"Total",null,null,null,{"$f":"SUM(G22:G25)","v":1},null,{"$f":"SUM(I22:I25)","v":1},null,{"$f":"SUM(K22:K25)","v":1},null,{"$f":"SUM(M22:M25)","v":1},null,{"$f":"SUM(O22:O25)","v":1},null,{"$f":"SUM(Q22:Q25)","v":1},null,{"$f":"SUM(S22:S25)","v":1},null,{"$f":"SUM(U22:U25)","v":1},null,{"$f":"SUM(W22:W25)","v":1}]
[]
[null,null,"Cost of Capital Parameters"]
[null,null,null,"Deemed Short-term Debt Rate",null,null,2.1600000000000001E-2,null,2.1600000000000001E-2,null,2.1600000000000001E-2,null,2.1600000000000001E-2,null,2.1600000000000001E-2,null,2.1600000000000001E-2,null,2.1600000000000001E-2,null,2.1600000000000001E-2,null,2.1600000000000001E-2]
[null,null,null,"Long-term Debt Rate (actual/embedded/deemed)1",null,null,6.0699999999999997E-2,null,6.0699999999999997E-2,null,6.0699999999999997E-2,null,6.0699999999999997E-2,null,6.0699999999999997E-2,null,6.0699999999999997E-2,null,6.0699999999999997E-2,null,6.0699999999999997E-2,null,6.0699999999999997E-2]
{"$rows_left_out":111}
{"sheet":"4. ICM_Assets_and_Rate_Base","index":3,"n_rows":277,"n_cols":19,"rows_kept":277,"cut":false,"hidden":false,"merged":[]}
[]
[]
[]
[]
[]
[]
[]
[]
[]
[]
[]
[]
[]
[]
[]
[]
[null,"Sheet 4: ICM Assets - Net Book Value"]
[null,null,null,null,null,null,null,null,2021,null,2022,null,2023,null,2024,null,2025,null,2026]
[null,"Net Fixed Assets - OH Swtch & Cpctrs"]
[]
[null,null,"Gross Book Value"]
[null,null,null,"Opening Balance",null,null,null,null,null,null,{"$f":"I23","v":214477.90560000003},null,{"$f":"K25","v":214477.90560000003},null,{"$f":"M25","v":214477.90560000003},null,{"$f":"O25","v":214477.90560000003},null,{"$f":"Q25","v":214477.90560000003}]
[null,null,null,"Capital Additions during year (from ICM Costs)",null,null,null,null,{"$f":"'2. ICM_Costs'!G182","v":214477.90560000003},null,{"$f":"'2. ICM_Costs'!I208","v":0},null,{"$f":"'2. ICM_Costs'!K208","v":0},null,{"$f":"'2. ICM_Costs'!M182","v":0},null,{"$f":"'2. ICM_Costs'!O182","v":0},null,{"$f":"'2. ICM_Costs'!Q182","v":0}]
[null,null,null,"Retirements/Removals (if applicable)"]
[null,null,null,"Closing Balance",null,null,null,null,{"$f":"I22+I23-I24","v":214477.90560000003},null,{"$f":"K22+K23-K24","v":214477.90560000003},null,{"$f":"M22+M23-M24","v":214477.90560000003},null,{"$f":"O22+O23-O24","v":214477.90560000003},null,{"$f":"Q22+Q23-Q24","v":214477.90560000003},null,{"$f":"S22+S23-S24","v":214477.90560000003}]
[]
[null,null,"Accumulated Depreciation"]
[null,null,null,"Opening Balance",null,null,null,null,null,null,{"$f":"I31","v":-5644.1554105263167},null,{"$f":"K31","v":-11288.310821052633},null,{"$f":"M31","v":-16932.46623157895},null,{"$f":"O31","v":-22576.621642105267},null,{"$f":"Q31","v":-28704.561802105269}]
[null,null,null,"Amortization expense during year",null,null,null,null,{"$f":"IF(ISERROR(-(I23/('3. Cost_of_Service_Parameters'!M45)+MIN((I22/'3. Cost_of_Service_Parameters'!M45),(I22+I28)))), 0, -(I23/('3. Cost_of_Service_Parameters'!M45)+MIN((I22/'3. Cost_of_Service_Parameters'!M45),(I22+I28))))","v":-5644.1554105263167},null,{"$f":"IF(ISERROR(-(K23/('3. Cost_of_Service_Parameters'!O45)+MIN((K22/'3. Cost_of_Service_Parameters'!O45),(K22+K28)))), 0, -(K23/('3. Cost_of_Service_Parameters'!O45)+MIN((K22/'3. Cost_of_Service_Parameters'!O45),(K22+K28))))","v":-5644.1554105263167},null,{"$f":"IF(ISERROR(-(M23/('3. Cost_of_Service_Parameters'!Q45)+MIN((M22/'3. Cost_of_Service_Parameters'!Q45),(M22+M28)))), 0, -(M23/('3. Cost_of_Service_Parameters'!Q45)+MIN((M22/'3. Cost_of_Service_Parameters'!Q45),(M22+M28))))","v":-5644.1554105263167},null,{"$f":"IF(ISERROR(-(O23/('3. Cost_of_Service_Parameters'!S45)+MIN((O22/'3. Cost_of_Service_Parameters'!S45),(O22+O28)))), 0, -(O23/('3. Cost_of_Service_Parameters'!S45)+MIN((O22/'3. Cost_of_Service_Parameters'!S45),(O22+O28))))","v":-5644.1554105263167},null,{"$f":"IF(ISERROR(-(Q23/('3. Cost_of_Service_Parameters'!U45)+MIN((Q22/'3. Cost_of_Service_Parameters'!U45),(Q22+Q28)))), 0, -(Q23/('3. Cost_of_Service_Parameters'!U45)+MIN((Q22/'3. Cost_of_Service_Parameters'!U45),(Q22+Q28))))","v":-6127.940160000001},null,{"$f":"IF(ISERROR(-(S23/('3. Cost_of_Service_Parameters'!W45)+MIN((S22/'3. Cost_of_Service_Parameters'!W45),(S22+S28)))), 0, -(S23/('3. Cost_of_Service_Parameters'!W45)+MIN((S22/'3. Cost_of_Service_Parameters'!W45),(S22+S28))))","v":-6127.940160000001}]
[null,null,null,"Retirements/Removals (if applicable)"]
{"$rows_left_out":248}
{"sheet":"5. UCC_Calculation","index":4,"n_rows":46,"n_cols":4,"rows_kept":46,"cut":false,"hidden":false,"merged":[]}
[]
[]
[]
[]
[]
[]
[]
[]
[]
[]
[]
[]
[]
[]
[]
[]
[]
["Sheet 6: CCA For PILs Calculation"]
[]
["UCC/Class 47",null,null,2021]
[null,null,null,{"$f":"'2. ICM_Costs'!G19","v":"Audited Actual"}]
[]
["Opening UCC",null,null,0]
["Capital Additions",null,null,{"$f":"'2. ICM_Costs'!G216","v":2383087.8400000003}]
["Retirements/Removals (if applicable)"]
["UCC Full Year",null,null,{"$f":"SUM(D23:D24)-D25","v":2383087.8400000003}]
[]
[]
["CCA Rate Class",null,null,{"$f":"'3. Cost_of_Service_Parameters'!G83","v":47}]
["CCA Rate ",null,null,{"$f":"'3. Cost_of_Service_Parameters'!G84","v":0.08}]
{"$rows_left_out":17}
{"sheet":"6. ICMIRR_2021 actual","index":5,"n_rows":81,"n_cols":6,"rows_kept":81,"cut":false,"hidden":false,"merged":[]}
[]
[]
[]
[]
[]
[]
[]
[]
[]
[]
[]
[]
[]
[]
[]
[null,null,"Goreway Road Widening - Brampton RZ"]
[null,null,null,null,null,"Actual"]
[]
[null,null,"Return on Rate Base"]
[null,null,"Incremental Capital",null,null,2383087.8400000003]
[null,null,"Depreciation Expense",null,null,{"$f":"-'4. ICM_Assets_and_Rate_Base'!I277","v":51770.140153892549}]
[null,null,"Incremental Capital to be included in Rate Base (avg NBV)",null,null,{"$f":"((F20)+(F20-F21))/2","v":2357202.7699230541}]
[]
[null,null,"Deemed ShortTerm Debt %",0.04,"E",{"$f":"F22*D24","v":94288.110796922163}]
[null,null,"Deemed Long Term Debt %",0.56000000000000005,"F",{"$f":"F22*D25","v":1320033.5511569104}]
[]
[null,null,"Short Term Interest",2.1600000000000001E-2,"I",{"$f":"F24*D27","v":2036.6231932135188}]
[null,null,"Long Term Interest",6.0728710462287103E-2,"J",{"$f":"F25*D28","v":80163.935328712658}]
[]
[null,null,"Return on Rate Base - Interest",null,null,{"$f":"SUM(F27:F28)","v":82200.55852192617}]
{"$rows_left_out":52}
{"sheet":"7. Rate Rider Revs","index":6,"n_rows":94,"n_cols":17,"rows_kept":94,"cut":false,"hidden":false,"merged":[[12,1,12,13],[18,5,18,15]]}
[]
[]
[]
[]
[]
[]
[]
[]
[]
[]
[]
[]
[null,"This worksheet calculates the  rate riders revenues.\n"]
[]
[]
[]
[null,"Sheet 7: ICM Rate Rider Revenues"]
[]
[]
[]
[]
[null,"Prescribed \nInterest Rates","Approved Deferral and Variance Accounts","CWIP",null,"Date","Year","Quarter",null,"Opening Balance (Principal)","Rate Rider Revenues","Interest Rate","Interest","Principal &\nInterest\n(Cumm.)",null,"Board Approved ICM Rate Rider","Board Approved ICM  Rate Rider\n(Cumm.)"]
[null,null,null,null,null,"2021-01-01",{"$f":"YEAR(F23)","v":2021},{"$f":"IF(MONTH(F23)=0,\"\",IF(MONTH(F23)<4,\"Q1\",IF(MONTH(F23)<7,\"Q2\",IF(MONTH(F23)<10,\"Q3\",\"Q4\"))))","v":"Q1"},{"$f":"CONCATENATE(G23,\" \",H23)","v":"2021 Q1"},0,5863.0881167157431,{"$f":"VLOOKUP(I23,$B$22:$D$59,2)","v":5.7000000000000002E-3},{"$f":"ROUND(J23*L23/12,2)","v":0},{"$f":"K23+M23","v":5863.0881167157431},null,{"$f":"'6. ICMIRR_2021 actual'!$F$81/12","v":16933.563662204746},{"$f":"P23","v":16933.563662204746}]
[null,"2018 Q1",1.4999999999999999E-2,2.9899999999999999E-2,null,"2021-02-01",2021,"Q1","2021 Q1",{"$f":"J23+K23","v":5863.0881167157431},21796.508636759194,5.7000000000000002E-3,2.78,{"$f":"N23+K24+M24","v":27662.376753474935},null,{"$f":"'6. ICMIRR_2021 actual'!$F$81/12","v":16933.563662204746},{"$f":"Q23+P24","v":33867.127324409492}]
[null,"2018 Q2",1.89E-2,3.3500000000000002E-2,null,"2021-03-01",2021,"Q1","2021 Q1",27659.596753474936,17026.638474084259,5.7000000000000002E-3,13.14,44702.155227559197,null,{"$f":"'6. ICMIRR_2021 actual'!$F$81/12","v":16933.563662204746},{"$f":"Q24+P25","v":50800.690986614238}]
[null,"2018 Q3",1.89E-2,3.3500000000000002E-2,null,"2021-04-01",2021,"Q2","2021 Q2",44686.235227559198,13206.037364172302,5.7000000000000002E-3,21.23,57929.422591731498,null,{"$f":"'6. ICMIRR_2021 actual'!$F$81/12","v":16933.563662204746},67734.254648818984]
[null,"2018 Q4",2.1700000000000001E-2,3.3500000000000002E-2,null,"2021-05-01",2021,"Q2","2021 Q2",57892.272591731497,15247.129633956878,5.7000000000000002E-3,27.5,73204.052225688371,null,{"$f":"'6. ICMIRR_2021 actual'!$F$81/12","v":16933.563662204746},84667.81831102373]
[null,"2019 Q1",2.4500000000000001E-2,3.8199999999999998E-2,null,"2021-06-01",2021,"Q2","2021 Q2",73139.402225688376,15170.38147010293,5.7000000000000002E-3,34.74,88409.173695791309,null,{"$f":"'6. ICMIRR_2021 actual'!$F$81/12","v":16933.563662204746},101601.38197322848]
[null,"2019 Q2",2.18E-2,3.39E-2,null,"2021-07-01",2021,"Q3","2021 Q3",88309.78369579131,14724.529700121511,5.7000000000000002E-3,41.95,103175.65339591281,null,{"$f":"'6. ICMIRR_2021 actual'!$F$81/12","v":16933.563662204746},118534.94563543322]
[null,"2019 Q3",2.18E-2,2.8799999999999999E-2,null,"2021-08-01",2021,"Q3","2021 Q3",103034.31339591282,16435.129500828461,5.7000000000000002E-3,48.94,119659.72289674128,null,{"$f":"'6. ICMIRR_2021 actual'!$F$81/12","v":16933.563662204746},135468.50929763797]
{"$rows_left_out":65}
{"sheet":"8. Opex Interest Annual","index":7,"n_rows":36,"n_cols":14,"rows_kept":36,"cut":false,"hidden":false,"merged":[]}
[]
[]
[]
[]
[]
[]
[]
[]
[]
[]
[]
[]
[null,"This worksheet calculates the interest on amortization/depreciation expense, in the absence of monthly data."]
[]
[]
[null,"Sheet 8: Interest on Amortization (Annual Data) "]
[]
[]
[]
[]
[null,"Year",null,"OM&A",null,"Amortization Expense",null,"Cumulative OM&A and Amortization Expense",null,"Average Cumulative OM&A and Amortization Expense",null,"Average Annual Prescribed Interest Rate for Deferral and Variance Accounts (from Sheet 7)",null,"Simple Interest on OM&A and Amortization Expenses"]
[null,null,null,null,null,"(from Sheet 4)"]
[null,2021,null,0,null,{"$f":"-'4. ICM_Assets_and_Rate_Base'!I277","v":51770.140153892549},null,{"$f":"D23+F23","v":51770.140153892549},null,{"$f":"(H23)/2","v":25885.070076946275},null,{"$f":"AVERAGE('7. Rate Rider Revs'!C36:C39)","v":5.7000000000000002E-3},null,{"$f":"J23*L23","v":147.54489943859377}]
[null,2022,null,0,null,{"$f":"-'4. ICM_Assets_and_Rate_Base'!K277","v":51770.140153892549},null,{"$f":"H23+D24+F24","v":103540.2803077851},null,{"$f":"(H24+H23)/2","v":77655.210230838828},null,{"$f":"AVERAGE('7. Rate Rider Revs'!C40:C43)","v":1.915E-2},null,{"$f":"J24*L24","v":1487.0972759205636}]
[null,2023,null,0,null,{"$f":"-'4. ICM_Assets_and_Rate_Base'!M277","v":51770.140153892549},null,{"$f":"H24+D25+F25","v":155310.42046167766},null,129425.35038473137,null,{"$f":"AVERAGE('7. Rate Rider Revs'!C44:C47)","v":5.0449999999999995E-2},null,{"$f":"J25*L25","v":6529.508926909697}]
[null,2024,null,0,null,{"$f":"-'4. ICM_Assets_and_Rate_Base'!O277","v":51770.140153892549},null,207080.5606155702,null,181195.49053862394,null,{"$f":"AVERAGE('7. Rate Rider Revs'!C48:C51)","v":5.1449999999999996E-2},null,9322.5079882122009]
[null,2025,null,0,null,{"$f":"-'4. ICM_Assets_and_Rate_Base'!Q277","v":46772.827208888906},null,253853.38782445912,null,230466.97422001464,null,{"$f":"AVERAGE('7. Rate Rider Revs'!C52:C55)","v":3.2800000000000003E-2},null,7559.3167544164808]
[null,2026,null,0,null,{"$f":"-'4. ICM_Assets_and_Rate_Base'!S277","v":46772.827208888906},null,300626.21503334801,null,277239.80142890359,null,{"$f":"AVERAGE('7. Rate Rider Revs'!C56:C59)","v":3.1600000000000003E-2},null,{"$f":"J28*L28","v":8760.7777251533553}]
[]
[]
{"$rows_left_out":7}
{"sheet":"9. IRR","index":8,"n_rows":31,"n_cols":20,"rows_kept":31,"cut":false,"hidden":false,"merged":[[13,1,13,21],[19,2,19,3]]}
[]
[]
[]
[]
[]
[]
[]
[]
[]
[]
[]
[]
[]
[null,"This worksheet calculates the ICM Incremental Revenue Requirement."]
[]
[]
[null,"Sheet 9: ICM Incremental Revenue Requirement"]
[null,null," "]
[]
[null,null,null,null,null,null,null,2021,null,2022,null,2023,null,2024,null,2025,null,2026,null,"Total"]
[]
[null,null,"Deferred and forecasted ICM Incremental Revenue Requirement (from Sheet 6)",null,null,null,null,{"$f":"'6. ICMIRR_2021 actual'!$F$81","v":203202.76394645695},null,{"$f":"'6. ICMIRR_2021 actual'!$F$81","v":203202.76394645695},null,{"$f":"'6. ICMIRR_2021 actual'!$F$81","v":203202.76394645695},null,{"$f":"'6. ICMIRR_2021 actual'!$F$81","v":203202.76394645695},null,{"$f":"'6. ICMIRR_2021 actual'!$F$81","v":203202.76394645695},null,{"$f":"'6. ICMIRR_2021 actual'!$F$81","v":203202.76394645695},null,{"$f":"SUM(H22:R22)","v":1219216.5836787417}]
[]
[null,null,"Interest on Deferred and forecasted Amortization Expense (Sheet 8)",null,null,null,null,{"$f":"'8. Opex Interest Annual'!$N$23","v":147.54489943859377},null,{"$f":"'8. Opex Interest Annual'!$N$24","v":1487.0972759205636},null,{"$f":"'8. Opex Interest Annual'!$N$25","v":6529.508926909697},null,{"$f":"'8. Opex Interest Annual'!$N$26","v":9322.5079882122009},null,{"$f":"'8. Opex Interest Annual'!$N$27","v":7559.3167544164808},null,{"$f":"'8. Opex Interest Annual'!$N$28","v":8760.7777251533553},null,{"$f":"SUM(G24:R24)","v":33806.753570050889}]
[]
[]
[null,null,"ICM Rate Rider Revenues (from Sheet 7)",null,null,null,null,{"$f":"SUM('7. Rate Rider Revs'!K23:K34)","v":179983.89634018613},null,{"$f":"SUM('7. Rate Rider Revs'!K35:K46)","v":181991.31925696376},null,{"$f":"SUM('7. Rate Rider Revs'!K47:K58)","v":183628.40437586312},null,{"$f":"SUM('7. Rate Rider Revs'!K59:K70)","v":183622.96841341592},null,{"$f":"SUM('7. Rate Rider Revs'!K71:K82)","v":184373.55458872477},null,{"$f":"SUM('7. Rate Rider Revs'!K83:K94)","v":186580.5148421248},null,{"$f":"SUM(G27:R27)","v":1100180.6578172785}]
[]
[null,null,"ICM Rate Rider Interest (from Sheet 7)",null,null,null,null,{"$f":"SUM('7. Rate Rider Revs'!M23:M34)","v":460.04},null,{"$f":"SUM('7. Rate Rider Revs'!M35:M46)","v":5665.54},null,{"$f":"SUM('7. Rate Rider Revs'!M47:M58)","v":22597.46},null,{"$f":"SUM('7. Rate Rider Revs'!M59:M70)","v":32182.240000000002},null,{"$f":"SUM('7. Rate Rider Revs'!M71:M82)","v":26593.42},null,{"$f":"SUM('7. Rate Rider Revs'!M83:M94)","v":31560.679999999997},null,{"$f":"SUM(G29:R29)","v":119059.37999999999}]
[]
{"$rows_left_out":1}