{"text_format":"1","workbook":"xlsx","n_sheets":9,"sheets":["1. Utility_Info_","2. ICM_Costs","3. Cost_of_Service_Parameters","4. ICM_Assets_and_Rate_Base","5. UCC_Calculation","6. ICMIRR_2018","7. Rate Rider Revs","8. Opex Interest Annual","9. IRR"],"not_rendered":{"charts":0,"images":5,"macros":1,"external_links":0,"defined_names":9063,"comments":0,"pivot_tables":0},"unopened":[],"bounds":{"document_bytes":16777216,"sheet_cells":100000,"rows_first":2000,"rows_last":500,"rows_between":2000,"halvings":0,"cell_chars":16384,"cell_head_chars":4096},"cells_cut":0,"cells_raw":0,"read":"whole","date_system":"1900"}

{"sheet":"1. Utility_Info_","index":0,"n_rows":85,"n_cols":28,"rows_kept":85,"cut":false,"hidden":false,"merged":[[20,3,20,5],[22,3,22,7],[18,3,18,4],[1,2,1,9],[2,2,2,9],[3,2,3,9],[4,2,4,9],[14,3,14,4]]}
[null,null,null,null,null,null,null,null,null,null,null,null,null,null,null,null,null,null,null,null,null,null,null,null,null,null,null,"Algoma Power Inc."]
[null,null,null,null,null,null,null,null,null,null,null,null,null,null,null,null,null,null,null,null,null,null,null,null,null,null,null,"Atikokan Hydro Inc."]
[null,null,null,null,null,null,null,null,null,null,null,null,null,null,null,null,null,null,null,null,null,null,null,null,null,null,null,"Attawapiskat Power Corporation"]
[null,null,null,null,null,null,null,null,null,null,null,null,null,null,null,null,null,null,null,null,null,null,null,null,null,null,null,"Bluewater Power Distribution Corp."]
[null,null,null,null,null,null,null,null,null,null,null,null,null,null,null,null,null,null,null,null,null,null,null,null,null,null,null,"Brant County Power"]
[null,null,null,null,null,null,null,null,null,null,null,null,null,null,null,null,null,null,null,null,null,null,null,null,null,null,null,"Brantford Power Inc."]
[null,null,null,null,null,null,null,null,null,null,null,null,null,null,null,null,null,null,null,null,null,null,null,null,null,null,null,"Burlington Hydro Inc."]
[null,null,null,null,null,null,null,null,null,null,null,null,null,null,null,null,null,null,null,null,null,null,null,null,null,null,null,"Cambridge and North Dumfries Hydro"]
[null,null,null,null,null,null,null,null,null,null,null,null,null,null,null,null,null,null,null,null,null,null,null,null,null,null,null,"Canadian Niagara Power Inc. – Eastern Ontario Power/Fort Erie/Port Colborne"]
[null,null,null,null,null,null,null,null,null,null,null,null,null,null,null,null,null,null,null,null,null,null,null,null,null,null,null,"Centre Wellington Hydro Ltd."]
[null,null,null,null,null,null,null,null,null,null,null,null,null,null,null,null,null,null,null,null,null,null,null,null,null,null,null,"Chapleau Public Utilities Corporation"]
[null,null,null,null,null,null,null,null,null,null,null,null,null,null,null,null,null,null,null,null,null,null,null,null,null,null,null,"COLLUS Power Corp."]
[null,null,null,null,null,null,null,null,null,null,null,null,null,null,null,null,null,null,null,null,null,null,null,null,null,null,null,"Cooperative Hydro Embrun Inc."]
[null,null,null,null,null,null,null,null,null,null,null,null,null,null,null,null,null,null,null,null,null,null,null,null,null,null,null,"E.L.K. Energy Inc."]
[null,null,"Utility Name   ","Alectra Utilities Corporation - PowerStream Rate Zone",null,null,null,null,null,null,null,null,null,null,null,null,null,null,null,null,null,null,null,null,null,null,null,"Enersource Hydro Mississauga Inc."]
[null,null,null,null,null,null,null,null,null,null,null,null,null,null,null,null,null,null,null,null,null,null,null,null,null,null,null,"Entegrus Powerlines Inc."]
[null,null,"Assigned EB Number","EB-2025-0252",null,null,null,null,null,null,null,null,null,null,null,null,null,null,null,null,null,null,null,null,null,null,null,"ENWIN Utilities Ltd."]
[null,null,null,null,null,null,null,null,null,null,null,null,null,null,null,null,null,null,null,null,null,null,null,null,null,null,null,"Erie Thames Powerlines Corp."]
[null,null,"Name and Title","Natalie Yeates, Director, Regulatory Affairs",null,null,null,null,null,null,null,null,null,null,null,null,null,null,null,null,null,null,null,null,null,null,null,"Espanola Regional Hydro Distribution Corporation"]
[null,null,null,null,null,null,null,null,null,null,null,null,null,null,null,null,null,null,null,null,null,null,null,null,null,null,null,"Essex Powerlines Corporation"]
[null,null,"Phone Number","416-617-1959",null,null,null,null,null,null,null,null,null,null,null,null,null,null,null,null,null,null,null,null,null,null,null,"Festival Hydro Inc."]
[null,null,null,null,null,null,null,null,null,null,null,null,null,null,null,null,null,null,null,null,null,null,null,null,null,null,null,"Fort Albany Power Corporation"]
[null,null,"Email Address","natalie.yeates@alectrautilities.com",null,null,null,null,null,null,null,null,null,null,null,null,null,null,null,null,null,null,null,null,null,null,null,"Fort Frances Power Corporation"]
[null,null,null,null,null,null,null,null,null,null,null,null,null,null,null,null,null,null,null,null,null,null,null,null,null,null,null,"Greater Sudbury Hydro Inc."]
[null,null,"Date",null,null,null,null,null,null,null,null,null,null,null,null,null,null,null,null,null,null,null,null,null,null,null,null,"Grimsby Power Inc."]
[null,null,null,null,null,null,null,null,null,null,null,null,null,null,null,null,null,null,null,null,null,null,null,null,null,null,null,"Guelph Hydro Electric Systems Inc."]
[null,null,"ICM Project","2018 - Road Authority YRRT ",null,null,null,null,null,null,null,null,null,null,null,null,null,null,null,null,null,null,null,null,null,null,null,"Haldimand County Hydro Inc."]
[null,null,null,null,null,null,null,null,null,null,null,null,null,null,null,null,null,null,null,null,null,null,null,null,null,null,null,"Halton Hills Hydro Inc."]
[null,null,null,null,null,null,null,null,null,null,null,null,null,null,null,null,null,null,null,null,null,null,null,null,null,null,null,"Hearst Power Distribution Co. Ltd."]
["Note:  Drop-down lists are shaded blue; Input cells are shaded green."]
{"$rows_left_out":56}
{"sheet":"2. ICM_Costs","index":1,"n_rows":220,"n_cols":11,"rows_kept":220,"cut":false,"hidden":false,"merged":[[166,2,166,3],[168,2,168,3],[170,2,170,3]]}
[]
[]
[]
[]
[]
[]
[]
[]
[]
[]
[]
[]
[]
[]
[]
[]
[]
[null,null,null,null,null,null,2018,null,null,null,"Total"]
[null,"Sheet 2: ICM Capital Cost Data",null,null,null,null,"Audited Actual"]
[]
[]
[]
[]
[]
[]
[]
[]
[]
[]
[]
{"$rows_left_out":191}
{"sheet":"3. Cost_of_Service_Parameters","index":2,"n_rows":140,"n_cols":23,"rows_kept":140,"cut":false,"hidden":false,"merged":[]}
[]
[]
[]
[]
[]
[]
[]
[]
[]
[]
[]
[]
[]
[]
[]
[]
[null,"Sheet 3: Parameters and Rates"]
[]
[null,null,null,null,null,null,2018,null,2019,null,2020,null,2021,null,2022,null,2023,null,2024,null,2025,null,2026]
[null,"Cost of Capital"]
[null,null,"Capital Structure"]
[null,null,null,"Deemed Short-term Debt Capitalization",null,null,0.04,null,0.04,null,0.04,null,0.04,null,0.04,null,0.04,null,0.04,null,0.04,null,0.04]
[null,null,null,"Deemed Long-term Debt Capitalization",null,null,{"$f":"60%-G22","v":0.55999999999999994},null,{"$f":"G23-(I22-G22)","v":0.55999999999999994},null,{"$f":"I23-(K22-I22)","v":0.55999999999999994},null,{"$f":"K23-(M22-K22)","v":0.55999999999999994},null,{"$f":"M23-(O22-M22)","v":0.55999999999999994},null,{"$f":"O23-(Q22-O22)","v":0.55999999999999994},null,{"$f":"Q23-(S22-Q22)","v":0.55999999999999994},null,{"$f":"S23-(U22-S22)","v":0.55999999999999994},null,{"$f":"U23-(W22-U22)","v":0.55999999999999994}]
[null,null,null,"Deemed Equity Capitalization",null,null,{"$f":"100%-G23-G25-G22","v":0.40000000000000008},null,{"$f":"100%-I23-I25-I22","v":0.40000000000000008},null,{"$f":"100%-K23-K25-K22","v":0.40000000000000008},null,{"$f":"100%-M23-M25-M22","v":0.40000000000000008},null,{"$f":"100%-O23-O25-O22","v":0.40000000000000008},null,{"$f":"100%-Q23-Q25-Q22","v":0.40000000000000008},null,{"$f":"100%-S23-S25-S22","v":0.40000000000000008},null,{"$f":"100%-U23-U25-U22","v":0.40000000000000008},null,{"$f":"100%-W23-W25-W22","v":0.40000000000000008}]
[null,null,null,"Preferred Shares"]
[null,null,"Total",null,null,null,{"$f":"SUM(G22:G25)","v":1},null,{"$f":"SUM(I22:I25)","v":1},null,{"$f":"SUM(K22:K25)","v":1},null,{"$f":"SUM(M22:M25)","v":1},null,{"$f":"SUM(O22:O25)","v":1},null,{"$f":"SUM(Q22:Q25)","v":1},null,{"$f":"SUM(S22:S25)","v":1},null,{"$f":"SUM(U22:U25)","v":1},null,{"$f":"SUM(W22:W25)","v":1}]
[]
[null,null,"Cost of Capital Parameters"]
[null,null,null,"Deemed Short-term Debt Rate",null,null,1.7600000000000001E-2,null,1.7600000000000001E-2,null,1.7600000000000001E-2,null,1.7600000000000001E-2,null,1.7600000000000001E-2,null,1.7600000000000001E-2,null,1.7600000000000001E-2,null,1.7600000000000001E-2,null,1.7600000000000001E-2]
[null,null,null,"Long-term Debt Rate (actual/embedded/deemed)1",null,null,3.8825039999999998E-2,null,3.8825039999999998E-2,null,3.8825039999999998E-2,null,3.8825039999999998E-2,null,3.8825039999999998E-2,null,3.8825039999999998E-2,null,3.8825039999999998E-2,null,3.8825039999999998E-2,null,3.8825039999999998E-2]
{"$rows_left_out":111}
{"sheet":"4. ICM_Assets_and_Rate_Base","index":3,"n_rows":357,"n_cols":26,"rows_kept":357,"cut":false,"hidden":false,"merged":[]}
[]
[]
[]
[]
[]
[]
[]
[]
[]
[]
[]
[]
[]
[]
[]
[]
[null,"Sheet 4: ICM Assets - Net Book Value"]
[null,null,null,null,null,null,null,null,{"$f":"'3. Cost_of_Service_Parameters'!G19","v":2018},null,2019,null,2020,null,2021,null,2022,null,2023,null,2024,null,2025,null,2026]
[null,"Net Fixed Assets - OH Swtch & Cpctrs"]
[]
[null,null,"Gross Book Value"]
[null,null,null,"Opening Balance",null,null,null,null,null,null,{"$f":"I25","v":1428623.6580000005},null,{"$f":"K25","v":1428623.6580000005},null,{"$f":"M25","v":1428623.6580000005},null,{"$f":"O25","v":1428623.6580000005},null,{"$f":"Q25","v":1428623.6580000005},null,{"$f":"S25","v":1428623.6580000005},null,{"$f":"U25","v":1428623.6580000005},null,{"$f":"W25","v":1428623.6580000005}]
[null,null,null,"Capital Additions during year (from ICM Costs)",null,null,null,null,{"$f":"'2. ICM_Costs'!G182","v":1428623.6580000005},null,{"$f":"'2. ICM_Costs'!I182","v":0}]
[null,null,null,"Retirements/Removals (if applicable)"]
[null,null,null,"Closing Balance",null,null,null,null,{"$f":"I22+I23-I24","v":1428623.6580000005},null,{"$f":"K22+K23-K24","v":1428623.6580000005},null,{"$f":"M22+M23-M24","v":1428623.6580000005},null,{"$f":"O22+O23-O24","v":1428623.6580000005},null,{"$f":"Q22+Q23-Q24","v":1428623.6580000005},null,{"$f":"S22+S23-S24","v":1428623.6580000005},null,{"$f":"U22+U23-U24","v":1428623.6580000005},null,{"$f":"W22+W23-W24","v":1428623.6580000005},null,{"$f":"Y22+Y23-Y24","v":1428623.6580000005}]
[]
[null,null,"Accumulated Depreciation"]
[null,null,null,"Opening Balance",null,null,null,null,null,null,{"$f":"I31","v":-37595.359421052643},null,{"$f":"K31","v":-75190.718842105285},null,{"$f":"M31","v":-112786.07826315792},null,{"$f":"O31","v":-150381.43768421057},null,{"$f":"Q31","v":-187976.79710526322},null,{"$f":"S31","v":-225572.15652631587},null,{"$f":"U31","v":-263167.51594736852},null,{"$f":"W31","v":-303985.33474736853}]
[null,null,null,"Amortization expense during year",null,null,null,null,{"$f":"IF(ISERROR(-(I23/('3. Cost_of_Service_Parameters'!G45)+MIN((I22/'3. Cost_of_Service_Parameters'!G45),(I22+I28)))), 0, -(I23/('3. Cost_of_Service_Parameters'!G45)+MIN((I22/'3. Cost_of_Service_Parameters'!G45),(I22+I28))))","v":-37595.359421052643},null,{"$f":"IF(ISERROR(-(K23/('3. Cost_of_Service_Parameters'!I45)+MIN((K22/'3. Cost_of_Service_Parameters'!I45),(K22+K28)))), 0, -(K23/('3. Cost_of_Service_Parameters'!I45)+MIN((K22/'3. Cost_of_Service_Parameters'!I45),(K22+K28))))","v":-37595.359421052643},null,{"$f":"IF(ISERROR(-(M23/('3. Cost_of_Service_Parameters'!K45)+MIN((M22/'3. Cost_of_Service_Parameters'!K45),(M22+M28)))), 0, -(M23/('3. Cost_of_Service_Parameters'!K45)+MIN((M22/'3. Cost_of_Service_Parameters'!K45),(M22+M28))))","v":-37595.359421052643},null,{"$f":"IF(ISERROR(-(O23/('3. Cost_of_Service_Parameters'!M45)+MIN((O22/'3. Cost_of_Service_Parameters'!M45),(O22+O28)))), 0, -(O23/('3. Cost_of_Service_Parameters'!M45)+MIN((O22/'3. Cost_of_Service_Parameters'!M45),(O22+O28))))","v":-37595.359421052643},null,{"$f":"IF(ISERROR(-(Q23/('3. Cost_of_Service_Parameters'!O45)+MIN((Q22/'3. Cost_of_Service_Parameters'!O45),(Q22+Q28)))), 0, -(Q23/('3. Cost_of_Service_Parameters'!O45)+MIN((Q22/'3. Cost_of_Service_Parameters'!O45),(Q22+Q28))))","v":-37595.359421052643},null,{"$f":"IF(ISERROR(-(S23/('3. Cost_of_Service_Parameters'!Q45)+MIN((S22/'3. Cost_of_Service_Parameters'!Q45),(S22+S28)))), 0, -(S23/('3. Cost_of_Service_Parameters'!Q45)+MIN((S22/'3. Cost_of_Service_Parameters'!Q45),(S22+S28))))","v":-37595.359421052643},null,{"$f":"IF(ISERROR(-(U23/('3. Cost_of_Service_Parameters'!S45)+MIN((U22/'3. Cost_of_Service_Parameters'!S45),(U22+U28)))), 0, -(U23/('3. Cost_of_Service_Parameters'!S45)+MIN((U22/'3. Cost_of_Service_Parameters'!S45),(U22+U28))))","v":-37595.359421052643},null,{"$f":"IF(ISERROR(-(W23/('3. Cost_of_Service_Parameters'!U45)+MIN((W22/'3. Cost_of_Service_Parameters'!U45),(W22+W28)))), 0, -(W23/('3. Cost_of_Service_Parameters'!U45)+MIN((W22/'3. Cost_of_Service_Parameters'!U45),(W22+W28))))","v":-40817.818800000015},null,{"$f":"IF(ISERROR(-(Y23/('3. Cost_of_Service_Parameters'!W45)+MIN((Y22/'3. Cost_of_Service_Parameters'!W45),(Y22+Y28)))), 0, -(Y23/('3. Cost_of_Service_Parameters'!W45)+MIN((Y22/'3. Cost_of_Service_Parameters'!W45),(Y22+Y28))))","v":-40817.818800000015}]
[null,null,null,"Retirements/Removals (if applicable)"]
{"$rows_left_out":328}
{"sheet":"5. UCC_Calculation","index":4,"n_rows":46,"n_cols":4,"rows_kept":46,"cut":false,"hidden":false,"merged":[]}
[]
[]
[]
[]
[]
[]
[]
[]
[]
[]
[]
[]
[]
[]
[]
[]
[]
["Sheet 6: CCA For PILs Calculation"]
[]
["UCC/Class 47",null,null,{"$f":"'3. Cost_of_Service_Parameters'!G19","v":2018}]
[null,null,null,{"$f":"'2. ICM_Costs'!G19","v":"Audited Actual"}]
[]
["Opening UCC",null,null,0]
["Capital Additions",null,null,{"$f":"'2. ICM_Costs'!G219","v":15873596.200000009}]
["Retirements/Removals (if applicable)"]
["UCC Full Year",null,null,{"$f":"SUM(D23:D24)-D25","v":15873596.200000009}]
[]
[]
["CCA Rate Class",null,null,{"$f":"'3. Cost_of_Service_Parameters'!G83","v":47}]
["CCA Rate ",null,null,{"$f":"'3. Cost_of_Service_Parameters'!G84","v":0.08}]
{"$rows_left_out":17}
{"sheet":"6. ICMIRR_2018","index":5,"n_rows":88,"n_cols":11,"rows_kept":88,"cut":false,"hidden":false,"merged":[[23,8,23,10]]}
[]
[]
[]
[]
[]
[]
[]
[]
[]
[]
["Sheet 6:",null,"Incremental Capital Adjustment"]
[]
[]
[]
[]
[]
[]
[]
[]
[]
[]
[]
[]
[null,null,null,null,null,null,null,null,"2018 OEB Approved"]
[]
[null,null,"Return on Rate Base"]
[null,null,"Incremental Capital CAPEX",null,null,{"$f":"'2. ICM_Costs'!G219","v":15873596.200000009},"B",null,null,null,11243530]
[null,null,"Depreciation Expense",null,null,{"$f":"-'4. ICM_Assets_and_Rate_Base'!I357","v":344837.60364464635},"C",null,null,null,266271.29064259888]
[null,null,"Incremental Capital CAPEX to be included in Rate Base",null,null,{"$f":"F27-F28","v":15528758.596355362},"D = B - C",null,null,null,{"$f":"K27-K28","v":10977258.709357401}]
[]
{"$rows_left_out":59}
{"sheet":"7. Rate Rider Revs","index":6,"n_rows":131,"n_cols":17,"rows_kept":131,"cut":false,"hidden":false,"merged":[[12,1,12,13],[18,5,18,15]]}
[]
[]
[]
[]
[]
[]
[]
[]
[]
[]
[]
[]
[null,"This worksheet calculates the rate riders revenues.\n"]
[]
[]
[]
[null,"Sheet 7: ICM Rate Rider Revenues"]
[]
[]
[]
[]
[null,"Prescribed \nInterest Rates","Approved Deferral and Variance Accounts","CWIP",null,"Date","Year","Quarter",null,"Opening Balance (Principal)","Rate Rider Revenues","Interest Rate","Interest","Principal &\nInterest\n(Cumm.)",null,"Board Approved ICM Rate Rider","Board Approved ICM  Rate Rider\n(Cumm.)"]
[]
[null,"2018 Q1",1.4999999999999999E-2,2.9899999999999999E-2,null,"2018-01-01",{"$f":"YEAR(F24)","v":2018},{"$f":"IF(MONTH(F24)=0,\"\",IF(MONTH(F24)<4,\"Q1\",IF(MONTH(F24)<7,\"Q2\",IF(MONTH(F24)<10,\"Q3\",\"Q4\"))))","v":"Q1"},{"$f":"CONCATENATE(G24,\" \",H24)","v":"2018 Q1"},0,null,{"$f":"VLOOKUP(I24,$B$22:$D$59,2)","v":1.4999999999999999E-2},{"$f":"ROUND(J24*L24/12,2)","v":0},{"$f":"K24+M24","v":0},null,null,{"$f":"P24","v":0}]
[null,"2018 Q2",1.89E-2,3.3500000000000002E-2,null,"2018-02-01",{"$f":"YEAR(F25)","v":2018},{"$f":"IF(MONTH(F25)=0,\"\",IF(MONTH(F25)<4,\"Q1\",IF(MONTH(F25)<7,\"Q2\",IF(MONTH(F25)<10,\"Q3\",\"Q4\"))))","v":"Q1"},{"$f":"CONCATENATE(G25,\" \",H25)","v":"2018 Q1"},{"$f":"J24+K24","v":0},null,1.4999999999999999E-2,{"$f":"ROUND(J25*L25/12,2)","v":0},{"$f":"N24+K25+M25","v":0},null,null,{"$f":"Q24+P25","v":0}]
[null,"2018 Q3",1.89E-2,3.3500000000000002E-2,null,"2018-03-01",2018,"Q1","2018 Q1",{"$f":"J25+K25","v":0},null,1.4999999999999999E-2,0,{"$f":"N25+K26+M26","v":0},null,null,{"$f":"Q25+P26","v":0}]
[null,"2018 Q4",2.1700000000000001E-2,3.3500000000000002E-2,null,"2018-04-01",2018,"Q2","2018 Q2",0,null,1.89E-2,0,0,null,null,0]
[null,"2019 Q1",2.4500000000000001E-2,3.8199999999999998E-2,null,"2018-05-01",2018,"Q2","2018 Q2",0,70994.739999999991,1.89E-2,0,70994.739999999991,null,{"$f":"'6. ICMIRR_2018'!$K$88/12","v":67407.108186467289},67407.108186467289]
[null,"2019 Q2",2.18E-2,3.39E-2,null,"2018-06-01",2018,"Q2","2018 Q2",70994.739999999991,70981,1.89E-2,111.82,142087.56,null,{"$f":"'6. ICMIRR_2018'!$K$88/12","v":67407.108186467289},134814.21637293458]
[null,"2019 Q3",2.18E-2,2.8799999999999999E-2,null,"2018-07-01",2018,"Q3","2018 Q3",141975.74,72735.350000000006,1.89E-2,223.61,215046.52,null,{"$f":"'6. ICMIRR_2018'!$K$88/12","v":67407.108186467289},202221.32455940187]
{"$rows_left_out":102}
{"sheet":"8. Opex Interest Annual","index":7,"n_rows":42,"n_cols":14,"rows_kept":42,"cut":false,"hidden":false,"merged":[]}
[]
[]
[]
[]
[]
[]
[]
[]
[]
[]
[]
[]
[null,"This worksheet calculates the interest on amortization/depreciation expense, in the absence of monthly data."]
[]
[]
[null,"Sheet 8: Interest on Amortization (Annual Data) "]
[]
[]
[]
[]
[null,"Year",null,"OM&A",null,"Amortization Expense",null,"Cumulative OM&A and Amortization Expense",null,"Average Cumulative OM&A and Amortization Expense",null,"Average Annual Prescribed Interest Rate for Deferral and Variance Accounts (from Sheet 7)",null,"Simple Interest on OM&A and Amortization Expenses"]
[null,null,null,null,null,"(from Sheet 6)"]
[null,2018,null,0,null,{"$f":"-'4. ICM_Assets_and_Rate_Base'!I357","v":344837.60364464635},null,{"$f":"D23+F23","v":344837.60364464635},null,{"$f":"H23/2","v":172418.80182232318},null,{"$f":"AVERAGE('7. Rate Rider Revs'!C24:C27)","v":1.8624999999999999E-2},null,{"$f":"J23*L23","v":3211.3001839407689}]
[null,2019,null,0,null,{"$f":"-'4. ICM_Assets_and_Rate_Base'!K357","v":344837.60364464635},null,{"$f":"H23+D24+F24","v":689675.20728929271},null,{"$f":"(H24+H23)/2","v":517256.40546696953},null,{"$f":"AVERAGE('7. Rate Rider Revs'!C28:C31)","v":2.2474999999999998E-2},null,{"$f":"J24*L24","v":11625.33771287014}]
[null,2020,null,0,null,{"$f":"-'4. ICM_Assets_and_Rate_Base'!M357","v":344837.60364464635},null,{"$f":"H24+D25+F25","v":1034512.8109339391},null,{"$f":"(H25+H24)/2","v":862094.00911161583},null,{"$f":"AVERAGE('7. Rate Rider Revs'!C32:C35)","v":1.3749999999999998E-2},null,11853.792625284716]
[null,2021,null,0,null,{"$f":"-'4. ICM_Assets_and_Rate_Base'!O357","v":344837.60364464635},null,1379350.4145785854,null,1206931.6127562623,null,{"$f":"AVERAGE('7. Rate Rider Revs'!C36:C39)","v":5.7000000000000002E-3},null,6879.5101927106953]
[null,2022,null,0,null,{"$f":"-'4. ICM_Assets_and_Rate_Base'!Q357","v":344837.60364464635},null,{"$f":"H26+D27+F27","v":1724188.0182232317},null,1551769.2164009085,null,{"$f":"AVERAGE('7. Rate Rider Revs'!C40:C43)","v":1.915E-2},null,29716.380494077399]
[null,2023,null,0,null,{"$f":"-'4. ICM_Assets_and_Rate_Base'!S357","v":344837.60364464635},null,2069025.6218678779,null,1896606.8200455548,null,{"$f":"AVERAGE('7. Rate Rider Revs'!C44:C47)","v":5.0449999999999995E-2},null,95683.814071298228]
[null,2024,null,0,null,{"$f":"-'4. ICM_Assets_and_Rate_Base'!U357","v":344837.60364464635},null,2413863.2255125241,null,2241444.4236902008,null,{"$f":"AVERAGE('7. Rate Rider Revs'!C48:C51)","v":5.1449999999999996E-2},null,115322.31559886082]
[null,2025,null,0,null,{"$f":"-'4. ICM_Assets_and_Rate_Base'!W357","v":311550.8206555557},null,2725414.0461680796,null,2569638.6358403019,null,{"$f":"AVERAGE('7. Rate Rider Revs'!C52:C55)","v":3.2800000000000003E-2},null,84284.147255561911]
{"$rows_left_out":13}
{"sheet":"9. IRR","index":8,"n_rows":31,"n_cols":25,"rows_kept":31,"cut":false,"hidden":false,"merged":[[13,1,13,26],[19,2,19,3]]}
[]
[]
[]
[]
[]
[]
[]
[]
[]
[]
[]
[]
[]
[null,"This worksheet calculates the ICM Incremental Revenue Requirement."]
[]
[]
[null,"Sheet 9: ICM Incremental Revenue Requirement"]
[null,null," "]
[]
[null,null,null,null,null,null,2018,null,2019,null,2020,null,2021,null,2022,null,2023,null,2024,null,2025,null,2026,null,"Total"]
[]
[null,null,"Deferred and forecasted ICM Incremental Revenue Requirement (from Sheet 6)",null,null,null,{"$f":"'6. ICMIRR_2018'!$F$88/12*8","v":734583.33844232699},null,{"$f":"'6. ICMIRR_2018'!$F$88","v":1101875.0076634905},null,{"$f":"'6. ICMIRR_2018'!$F$88","v":1101875.0076634905},null,{"$f":"'6. ICMIRR_2018'!$F$88","v":1101875.0076634905},null,{"$f":"'6. ICMIRR_2018'!$F$88","v":1101875.0076634905},null,{"$f":"'6. ICMIRR_2018'!$F$88","v":1101875.0076634905},null,{"$f":"'6. ICMIRR_2018'!$F$88","v":1101875.0076634905},null,{"$f":"'6. ICMIRR_2018'!$F$88","v":1101875.0076634905},null,{"$f":"'6. ICMIRR_2018'!$F$88","v":1101875.0076634905},null,{"$f":"SUM(G22:W22)","v":9549583.3997502495}]
[]
[null,null,"Interest on Deferred and forecasted Amortization Expense (Sheet 8)",null,null,null,{"$f":"'8. Opex Interest Annual'!$N$23","v":3211.3001839407689},null,{"$f":"'8. Opex Interest Annual'!$N$24","v":11625.33771287014},null,{"$f":"'8. Opex Interest Annual'!$N$25","v":11853.792625284716},null,{"$f":"'8. Opex Interest Annual'!$N$26","v":6879.5101927106953},null,{"$f":"'8. Opex Interest Annual'!$N$27","v":29716.380494077399},null,{"$f":"'8. Opex Interest Annual'!$N$28","v":95683.814071298228},null,{"$f":"'8. Opex Interest Annual'!$N$29","v":115322.31559886082},null,{"$f":"'8. Opex Interest Annual'!$N$30","v":84284.147255561911},null,{"$f":"'8. Opex Interest Annual'!$N$31","v":91045.5868252691},null,{"$f":"SUM(G24:W24)","v":449622.18495987373}]
[]
[]
[null,null,"ICM Rate Rider Revenues (from Sheet 7)",null,null,null,{"$f":"SUM('7. Rate Rider Revs'!K26:K35)","v":566484.53},null,{"$f":"SUM('7. Rate Rider Revs'!K36:K47)","v":835766.69},null,{"$f":"SUM('7. Rate Rider Revs'!K48:K59)","v":837027.68},null,{"$f":"SUM('7. Rate Rider Revs'!K60:K71)","v":836489.03},null,{"$f":"SUM('7. Rate Rider Revs'!K72:K83)","v":847138.86999999988},null,{"$f":"SUM('7. Rate Rider Revs'!K84:K95)","v":851588.46},null,{"$f":"SUM('7. Rate Rider Revs'!K96:K107)","v":859931.77999999991},null,{"$f":"SUM('7. Rate Rider Revs'!K108:K119)","v":869646.00477150676},null,{"$f":"SUM('7. Rate Rider Revs'!K120:K131)","v":872292.4555863014},null,{"$f":"SUM(G27:W27)","v":7376365.5003578076}]
[]
[null,null,"ICM Rate Rider Interest (from Sheet 7)",null,null,null,{"$f":"SUM('7. Rate Rider Revs'!M27:M35)","v":3436.9700000000003},null,{"$f":"SUM('7. Rate Rider Revs'!M36:M47)","v":21089.43},null,{"$f":"SUM('7. Rate Rider Revs'!M48:M59)","v":22808.34},null,{"$f":"SUM('7. Rate Rider Revs'!M60:M71)","v":14923.680000000002},null,{"$f":"SUM('7. Rate Rider Revs'!M72:M83)","v":69218.7},null,{"$f":"SUM('7. Rate Rider Revs'!M84:M95)","v":218100.72},null,{"$f":"SUM('7. Rate Rider Revs'!M96:M107)","v":264898.49},null,{"$f":"SUM('7. Rate Rider Revs'!M108:M119)","v":197442.77},null,{"$f":"SUM('7. Rate Rider Revs'!M120:M131)","v":218071.46999999997},null,{"$f":"SUM(G29:W29)","v":1029990.57}]
[]
{"$rows_left_out":1}