{"text_format":"1","workbook":"xlsx","n_sheets":20,"sheets":["A1.1 Distributor Information","B1.1 Current Distribution Rates","B1.2 Billing Determinants","B1.3 Current Rev From Rates","C1.1 Current Rate Riders","C1.2 - PCA","D1.1 Rate 1 Adjustment","D1.2 Rate 6 Adjustment","D1.3 Rate 11 Adjustment","D1.4 Rate 16 Adjustment","E1.1 Proposed Dist Rates ","E1.2 Billing Determinants","E1.3 Proposed Rev From Rate","F1.3 Proposed Rate Riders","G1.1 Rate 1 Bill Impact","G1.2 Rate 6 Bill Impact","G1.3 Rate 11 Bill Impact","G1.4 Rate 16 Bill Impact","G1.7 Summary of Bill Impacts","Overrun"],"not_rendered":{"charts":0,"images":0,"macros":1,"external_links":0,"defined_names":4,"comments":0,"pivot_tables":0},"unopened":[],"bounds":{"document_bytes":16777216,"sheet_cells":100000,"rows_first":2000,"rows_last":500,"rows_between":2000,"halvings":0,"cell_chars":16384,"cell_head_chars":4096},"cells_cut":0,"cells_raw":0,"read":"whole","date_system":"1900"}

{"sheet":"A1.1 Distributor Information","index":0,"n_rows":12,"n_cols":4,"rows_kept":12,"cut":false,"hidden":false,"merged":[]}
[]
[]
[null,null,{"$f":"D8","v":"EPCOR Natural Gas Limited Partnership"}]
[null,null,{"$f":" \"OEB Application Number:  \" & D9","v":"OEB Application Number:  EB-2025-0178  Exhibit A - 2026 Custom Incentive Application"}]
[]
[null,null,"Distributor Information"]
[]
[null,null,"Distributor Name","EPCOR Natural Gas Limited Partnership"]
[null,null,"OEB Application Number","EB-2025-0178  Exhibit A - 2026 Custom Incentive Application"]
[]
{"$rows_left_out":3}
{"sheet":"B1.1 Current Distribution Rates","index":1,"n_rows":18,"n_cols":16,"rows_kept":18,"cut":false,"hidden":false,"merged":[[6,6,6,8]]}
[]
[]
[]
[]
[null,null,"Current Distribution Tariff Sheet Rates"]
[]
[null,null,null,null,"Fixed ",null,"Delivery Charge",null,null,"Delivery Charge"]
[null,null,"Rate Class",null,"Monthly Base",{"$f":"OneDollar","v":"Bill 32 Rate"},"Tier 1","Tier 2","Tier 3","Contract Demand","Gas Supply","Upstream Recovery \nCharge","Transportation & \nStorage Charge","Transportation Charge \nFrom Dawn","Transportation Charge \nFrom Kirkwall","Transportation Charge From Parkway"]
[null,null,null,null," $/month","$ / month","₵ / m3","₵ / m3","₵ / m3","₵ /contracted m3","₵  / m3","(A)","₵  / m3","₵ /contracted m3","₵ /contracted m3","₵ /contracted m3"]
[null,null,"Rate 1","General Firm Service",27.997484218863598,1,29.992083057283196,29.401222312373353,28.532788598221657,null,18.8887,1.474,2.6981999999999999]
{"$rows_left_out":9}
{"sheet":"B1.2 Billing Determinants","index":2,"n_rows":13,"n_cols":10,"rows_kept":13,"cut":false,"hidden":false,"merged":[[6,5,6,7]]}
[]
[null,null,{"$f":"'A1.1 Distributor Information'!C3","v":"EPCOR Natural Gas Limited Partnership"}]
[null,null,{"$f":"'A1.1 Distributor Information'!C4","v":"OEB Application Number:  EB-2025-0178  Exhibit A - 2026 Custom Incentive Application"}]
[]
[null,null,"Billing Determinants"]
[]
[null,null,null,null,"Fixed","Delivery Charge",null,null,"Delivery Charge"]
[null,null,"Rate Class",null,"Monthly Base","Tier 1","Tier 2","Tier 3","Contract Demand","Gas Supply"]
[null,null,"Rate 1","General Firm Service",{"$f":"5381+190+1","v":5572},5233468.5223499956,3538634.7952602515,95603.557579467408,null,8270620]
[null,null,"Rate 6","Large Volume General Firm Service",72,607189.83033527818,1243388.9212600451,617622.23677315121,null,2228157]
{"$rows_left_out":4}
{"sheet":"B1.3 Current Rev From Rates","index":3,"n_rows":19,"n_cols":15,"rows_kept":19,"cut":false,"hidden":false,"merged":[[17,2,17,3],[10,6,10,8]]}
[]
[null,null,{"$f":"'A1.1 Distributor Information'!C3","v":"EPCOR Natural Gas Limited Partnership"}]
[null,null,{"$f":"'A1.1 Distributor Information'!C4","v":"OEB Application Number:  EB-2025-0178  Exhibit A - 2026 Custom Incentive Application"}]
[]
[]
[null,null,"Forecasted Revenue from Current Rates"]
[]
[null,null,"Months / Year",12]
[null,null,null,{"$f":"'A1.1 Distributor Information'!D9","v":"EB-2025-0178  Exhibit A - 2026 Custom Incentive Application"}]
[]
{"$rows_left_out":10}
{"sheet":"C1.1 Current Rate Riders","index":4,"n_rows":56,"n_cols":6,"rows_kept":56,"cut":false,"hidden":false,"merged":[]}
[]
[null,null,{"$f":"'A1.1 Distributor Information'!C3","v":"EPCOR Natural Gas Limited Partnership"}]
[null,null,{"$f":"'A1.1 Distributor Information'!C4","v":"OEB Application Number:  EB-2025-0178  Exhibit A - 2026 Custom Incentive Application"}]
[]
[null,null,"Current Rate Riders"]
[]
[null,null,"Delay in Revenue Recovery Rate Rider"]
[null,null,"Effective Until:"]
[]
[null,null,"Rate 1 | General Firm Service","cents / m3 volume",1.633,"Cents/m3"]
{"$rows_left_out":47}
{"sheet":"C1.2 - PCA","index":5,"n_rows":12,"n_cols":8,"rows_kept":12,"cut":false,"hidden":false,"merged":[]}
[{"$f":"'C1.1 Current Rate Riders'!C2","v":"EPCOR Natural Gas Limited Partnership"}]
[{"$f":"'C1.1 Current Rate Riders'!C3","v":"OEB Application Number:  EB-2025-0178  Exhibit A - 2026 Custom Incentive Application"}]
[]
["2026 OEB Inflation Factor",null,null,null,null,null,null,3.6999999999999998E-2]
[]
["Incentive Rate Adjustment (IR) = [(1.0 – 0.314) x 0.0127] + [0.314 x Inflation (I)]"]
[]
[null,null,null,1,-0.314,1.2699999999999999E-2,"+",0.314]
[null,null,null,null,{"$f":"D8+E8","v":0.68599999999999994},{"$f":"F8","v":1.2699999999999999E-2},null,{"$f":"H8*H4","v":1.1618E-2}]
[null,null,null,null,null,{"$f":"E9*F9","v":8.7121999999999981E-3},null,{"$f":"H9","v":1.1618E-2}]
{"$rows_left_out":3}
{"sheet":"D1.1 Rate 1 Adjustment","index":6,"n_rows":27,"n_cols":9,"rows_kept":27,"cut":false,"hidden":false,"merged":[]}
[]
[null,null,{"$f":"'A1.1 Distributor Information'!C3","v":"EPCOR Natural Gas Limited Partnership"}]
[null,null,{"$f":"'A1.1 Distributor Information'!C4","v":"OEB Application Number:  EB-2025-0178  Exhibit A - 2026 Custom Incentive Application"}]
[]
[null,null,"Rate 1 Incentive Rate Adjustment"]
[null,null,{"$f":"MID(CELL(\"filename\",A1),FIND(\"]\",CELL(\"filename\",A1))+1,255)","v":"D1.1 Rate 1 Adjustment"}]
[]
[null,null,"Rate 1"]
[]
[null,null,"GDP-IPI"]
{"$rows_left_out":18}
{"sheet":"D1.2 Rate 6 Adjustment","index":7,"n_rows":27,"n_cols":9,"rows_kept":27,"cut":false,"hidden":false,"merged":[]}
[]
[null,null,{"$f":"'A1.1 Distributor Information'!C3","v":"EPCOR Natural Gas Limited Partnership"}]
[null,null,{"$f":"'A1.1 Distributor Information'!C4","v":"OEB Application Number:  EB-2025-0178  Exhibit A - 2026 Custom Incentive Application"}]
[]
[null,null,"Rate 6 Incentive Rate Adjustment"]
[null,null,{"$f":"MID(CELL(\"filename\",A1),FIND(\"]\",CELL(\"filename\",A1))+1,255)","v":"D1.2 Rate 6 Adjustment"}]
[]
[null,null,"Rate 6"]
[]
[null,null,"GDP-IPI"]
{"$rows_left_out":18}
{"sheet":"D1.3 Rate 11 Adjustment","index":8,"n_rows":27,"n_cols":9,"rows_kept":27,"cut":false,"hidden":false,"merged":[]}
[]
[null,null,{"$f":"'A1.1 Distributor Information'!C3","v":"EPCOR Natural Gas Limited Partnership"}]
[null,null,{"$f":"'A1.1 Distributor Information'!C4","v":"OEB Application Number:  EB-2025-0178  Exhibit A - 2026 Custom Incentive Application"}]
[]
[null,null,"Rate 11 Incentive Rate Adjustment"]
[null,null,{"$f":"MID(CELL(\"filename\",A1),FIND(\"]\",CELL(\"filename\",A1))+1,255)","v":"D1.3 Rate 11 Adjustment"}]
[]
[null,null,"Rate 11"]
[]
[null,null,"GDP-IPI"]
{"$rows_left_out":18}
{"sheet":"D1.4 Rate 16 Adjustment","index":9,"n_rows":29,"n_cols":9,"rows_kept":29,"cut":false,"hidden":false,"merged":[]}
[]
[null,null,{"$f":"'A1.1 Distributor Information'!C3","v":"EPCOR Natural Gas Limited Partnership"}]
[null,null,{"$f":"'A1.1 Distributor Information'!C4","v":"OEB Application Number:  EB-2025-0178  Exhibit A - 2026 Custom Incentive Application"}]
[]
[null,null,"Rate 16 Incentive Rate Adjustment"]
[null,null,{"$f":"MID(CELL(\"filename\",A1),FIND(\"]\",CELL(\"filename\",A1))+1,255)","v":"D1.4 Rate 16 Adjustment"}]
[]
[null,null,"Rate 16"]
[]
[null,null,"GDP-IPI"]
{"$rows_left_out":20}
{"sheet":"E1.1 Proposed Dist Rates ","index":10,"n_rows":14,"n_cols":18,"rows_kept":14,"cut":false,"hidden":false,"merged":[]}
[]
[null,null,{"$f":"'A1.1 Distributor Information'!C3","v":"EPCOR Natural Gas Limited Partnership"}]
[null,null,{"$f":"'A1.1 Distributor Information'!C4","v":"OEB Application Number:  EB-2025-0178  Exhibit A - 2026 Custom Incentive Application"}]
[]
[null,null,"Proposed Distribution Tariff Sheet Rates"]
[null,null,{"$f":"MID(CELL(\"filename\",A1),FIND(\"]\",CELL(\"filename\",A1))+1,255)","v":"E1.1 Proposed Dist Rates "}]
[]
[null,null,"Rate Class",null,"Monthly Base",{"$f":"OneDollar","v":"Bill 32 Rate"},"Tier 1","Tier 2","Tier 3","Contract Demand","Gas Supply","Upstream Recovery \nCharge","Transportation & \nStorage Charge","Transportation Charge \nFrom Dawn","Transportation Charge \nFrom Kirkwall","Transportation Charge From Parkway","Federal Carbon Charge","Facililty Carbon Charge"]
[null,null,null,null,"$/month","$/month","₵ / m3","₵ / m3","₵ / m3","₵/contracted m3","₵/m3","(A)","₵  / m3","₵ /contracted m3","₵ /contracted m3","₵ /contracted m3","₵ / m3","₵ / m3"]
[null,null,"Rate 1","General Firm Service",{"$f":"INDEX('D1.1 Rate 1 Adjustment'!$G$17:$G$26,MATCH(E$8,'D1.1 Rate 1 Adjustment'!$C$17:$C$26,0))","v":28.566678672529939},{"$f":"INDEX('D1.1 Rate 1 Adjustment'!$G$17:$G$26,MATCH(F$8,'D1.1 Rate 1 Adjustment'!$C$17:$C$26,0))","v":1},{"$f":"INDEX('D1.1 Rate 1 Adjustment'!$G$17:$G$26,MATCH(G$8,'D1.1 Rate 1 Adjustment'!$C$17:$C$26,0))","v":30.601828104254377},{"$f":"INDEX('D1.1 Rate 1 Adjustment'!$G$17:$G$26,MATCH(H$8,'D1.1 Rate 1 Adjustment'!$C$17:$C$26,0))","v":29.998955042228367},{"$f":"INDEX('D1.1 Rate 1 Adjustment'!$G$17:$G$26,MATCH(I$8,'D1.1 Rate 1 Adjustment'!$C$17:$C$26,0))","v":29.112865896981226},null,{"$f":"INDEX('D1.1 Rate 1 Adjustment'!$G$17:$G$26,MATCH(K$8,'D1.1 Rate 1 Adjustment'!$C$17:$C$26,0))","v":18.8887},{"$f":"INDEX('D1.1 Rate 1 Adjustment'!$G$17:$G$26,MATCH(L$8,'D1.1 Rate 1 Adjustment'!$C$17:$C$26,0))","v":1.474},{"$f":"INDEX('D1.1 Rate 1 Adjustment'!$G$17:$G$26,MATCH(M$8,'D1.1 Rate 1 Adjustment'!$C$17:$C$26,0))","v":2.6981999999999999},null,null,null,{"$f":"INDEX('D1.1 Rate 1 Adjustment'!$G$17:$G$26,MATCH(Q$8,'D1.1 Rate 1 Adjustment'!$C$17:$C$26,0))","v":0}]
{"$rows_left_out":5}
{"sheet":"E1.2 Billing Determinants","index":11,"n_rows":14,"n_cols":10,"rows_kept":14,"cut":false,"hidden":false,"merged":[]}
[]
[null,null,{"$f":"'A1.1 Distributor Information'!C3","v":"EPCOR Natural Gas Limited Partnership"}]
[null,null,{"$f":"'A1.1 Distributor Information'!C4","v":"OEB Application Number:  EB-2025-0178  Exhibit A - 2026 Custom Incentive Application"}]
[]
[null,null,"Billing Determinants"]
[null,null,{"$f":"MID(CELL(\"filename\",A1),FIND(\"]\",CELL(\"filename\",A1))+1,255)","v":"E1.2 Billing Determinants"}]
[]
[]
[null,null,"Rate Class","Description","Base","Tier 1","Tier 2","Tier 3","Firm Demand","Gas Supply"]
[null,null,null,null,"cx's","m3","m3","m3","Contracted m3","m3"]
{"$rows_left_out":5}
{"sheet":"E1.3 Proposed Rev From Rate","index":12,"n_rows":18,"n_cols":15,"rows_kept":18,"cut":false,"hidden":false,"merged":[]}
[]
[null,null,{"$f":"'A1.1 Distributor Information'!C3","v":"EPCOR Natural Gas Limited Partnership"}]
[null,null,{"$f":"'A1.1 Distributor Information'!C4","v":"OEB Application Number:  EB-2025-0178  Exhibit A - 2026 Custom Incentive Application"}]
[]
[null,null,"Proposed Revenue from Rates"]
[]
[null,null,"Months / Year",12]
[]
[null,null,"Rate Class",null,"Monthly Base",{"$f":"OneDollar","v":"Bill 32 Rate"},"Tier 1","Tier 2","Tier 3","Contracted\nDemand","Gas Supply","Upstream Recovery \nCharge","Transportation & \nStorage Charge","Federal Carbon \nCharge","Total"]
[null,null,null,null,null,null,null,null,null,null,null,null,"(A)"]
{"$rows_left_out":9}
{"sheet":"F1.3 Proposed Rate Riders","index":13,"n_rows":84,"n_cols":6,"rows_kept":84,"cut":false,"hidden":false,"merged":[]}
[]
[null,null,{"$f":"'A1.1 Distributor Information'!C3","v":"EPCOR Natural Gas Limited Partnership"}]
[null,null,{"$f":"'A1.1 Distributor Information'!C4","v":"OEB Application Number:  EB-2025-0178  Exhibit A - 2026 Custom Incentive Application"}]
[null,null,"F1.3 Rate Riders"]
[]
[null,null,"Delay in Revenue Recovery Rate Rider"]
[null,null,null,null,"Delay in Revenue Recovery Rate Rider"]
[]
[null,null,"Rate 1 | General Firm Service",null,1.633,"Cents/m3"]
[null,null,"Rate 6 | Large Volume General Firm Service",null,0.90900000000000003,"Cents/m3"]
{"$rows_left_out":75}
{"sheet":"G1.1 Rate 1 Bill Impact","index":14,"n_rows":214,"n_cols":12,"rows_kept":214,"cut":false,"hidden":false,"merged":[]}
[]
[null,null,{"$f":"'A1.1 Distributor Information'!C3","v":"EPCOR Natural Gas Limited Partnership"}]
[null,null,{"$f":"'A1.1 Distributor Information'!C4","v":"OEB Application Number:  EB-2025-0178  Exhibit A - 2026 Custom Incentive Application"}]
[]
[null,null,"Rate 1 Delivery Bill Impact"]
[null,null,"G1.1 Rate 1 Bill Impact"]
[]
[null,null,"Rate 1"]
[]
[null,null,"Rate 1 - Residential",null,"Units","Current Rate",null,"Proposed Rate"]
{"$rows_left_out":205}
{"sheet":"G1.2 Rate 6 Bill Impact","index":15,"n_rows":109,"n_cols":12,"rows_kept":109,"cut":false,"hidden":false,"merged":[]}
[]
[null,null,{"$f":"'A1.1 Distributor Information'!C3","v":"EPCOR Natural Gas Limited Partnership"}]
[null,null,{"$f":"'A1.1 Distributor Information'!C4","v":"OEB Application Number:  EB-2025-0178  Exhibit A - 2026 Custom Incentive Application"}]
[]
[null,null,"Rate 6 Delivery Bill Impact"]
[null,null,"G1.2 Rate 6 Bill Impact"]
[]
[null,null,"Rate 6 - Medium Commercial",null,"Units","Current Rate",null,"Proposed Rate"]
[]
[null,null,"Customer",null,"$/month",{"$f":"INDEX('B1.1 Current Distribution Rates'!$E$10:$Q$13,2,COUNTA($C$10:C10))","v":114.1725083792748},null,{"$f":"INDEX('E1.1 Proposed Dist Rates '!$E$10:$Q$13,2,COUNTA($C$10:C10))","v":116.49365830912714}]
{"$rows_left_out":100}
{"sheet":"G1.3 Rate 11 Bill Impact","index":16,"n_rows":108,"n_cols":12,"rows_kept":108,"cut":false,"hidden":false,"merged":[]}
[]
[null,null,{"$f":"'A1.1 Distributor Information'!C3","v":"EPCOR Natural Gas Limited Partnership"}]
[null,null,{"$f":"'A1.1 Distributor Information'!C4","v":"OEB Application Number:  EB-2025-0178  Exhibit A - 2026 Custom Incentive Application"}]
[]
[null,null,"Rate 11 Delivery Bill Impact"]
[null,null,{"$f":"MID(CELL(\"filename\",A1),FIND(\"]\",CELL(\"filename\",A1))+1,255)","v":"G1.3 Rate 11 Bill Impact"}]
[]
[null,null,"Rate 11 - Large Seasonal Service Sample Dryer 1",null,"Units","Current Rate",null,"Proposed Rate"]
[]
[null,null,"Customer",null,"$/month",{"$f":"INDEX('B1.1 Current Distribution Rates'!$E$10:$Q$13,3,COUNTA($C10:C$10))","v":228.3450167585496},null,{"$f":"INDEX('E1.1 Proposed Dist Rates '!$E$10:$Q$13,3,COUNTA($C10:C$10))","v":232.98731661825428}]
{"$rows_left_out":99}
{"sheet":"G1.4 Rate 16 Bill Impact","index":17,"n_rows":61,"n_cols":12,"rows_kept":61,"cut":false,"hidden":false,"merged":[]}
[]
[null,null,{"$f":"'A1.1 Distributor Information'!C3","v":"EPCOR Natural Gas Limited Partnership"}]
[null,null,{"$f":"'A1.1 Distributor Information'!C4","v":"OEB Application Number:  EB-2025-0178  Exhibit A - 2026 Custom Incentive Application"}]
[]
[null,null,"Rate 16 Delivery Bill Impact"]
[null,null,{"$f":"MID(CELL(\"filename\",A1),FIND(\"]\",CELL(\"filename\",A1))+1,255)","v":"G1.4 Rate 16 Bill Impact"}]
[]
[null,null,"Rate 16 - Contracted Demand",null,"Units","Current Rate",null,"Proposed Rate"]
[]
[null,null,"Customer",null,"$/month",{"$f":"INDEX('B1.1 Current Distribution Rates'!$E$10:$Q$13,4,COUNTA($C$10:C10))","v":1678.9822902858011},null,{"$f":"INDEX('E1.1 Proposed Dist Rates '!$E$10:$Q$13,4,COUNTA($C$10:C10))","v":1713.1163360437697}]
{"$rows_left_out":52}
{"sheet":"G1.7 Summary of Bill Impacts","index":18,"n_rows":18,"n_cols":19,"rows_kept":18,"cut":false,"hidden":false,"merged":[]}
[]
[null,null,{"$f":"'A1.1 Distributor Information'!C3","v":"EPCOR Natural Gas Limited Partnership"}]
[null,null,{"$f":"'A1.1 Distributor Information'!C4","v":"OEB Application Number:  EB-2025-0178  Exhibit A - 2026 Custom Incentive Application"}]
[]
[null,null,"Summary of Bill Impacts"]
[]
[null,null,{"$f":"MID(CELL(\"filename\",A1),FIND(\"]\",CELL(\"filename\",A1))+1,255)","v":"G1.7 Summary of Bill Impacts"}]
[null,null,"Rate Class",null,"Fixed Charge",{"$f":"E8","v":"Fixed Charge"},{"$f":"OneDollar","v":"Bill 32 Rate"},"Volumetric Charge",{"$f":"H8","v":"Volumetric Charge"},"Rate Riders",{"$f":"J8","v":"Rate Riders"},"Upstream Recovery \nCharge","Transportation & \nStorage Charge","Federal Carbon Charge Change","Total",{"$f":"O8","v":"Total"},null,null,"Check"]
[null,null,null,null,"($/year)","(%)","($/year)","($/year)","(%)","($/year)","(%)","($/year)","($/year)","($/year)","($/year)","(%)"]
[null,null,"Rate 1","Residential",{"$f":"'G1.1 Rate 1 Bill Impact'!J35","v":6.8303334439960963},{"$f":"'G1.1 Rate 1 Bill Impact'!L35","v":2.0330200000000024E-2},{"$f":"'G1.1 Rate 1 Bill Impact'!J36","v":0},{"$f":"SUM('G1.1 Rate 1 Bill Impact'!J37:J40)","v":8.6116474223507566},{"$f":"F10","v":2.0330200000000024E-2},{"$f":"'G1.1 Rate 1 Bill Impact'!J57","v":33.906063020373892},{"$f":"'G1.1 Rate 1 Bill Impact'!L57","v":0.26615050590138017},{"$f":"'G1.1 Rate 1 Bill Impact'!J42","v":0},{"$f":"'G1.1 Rate 1 Bill Impact'!J43","v":0},{"$f":"'G1.1 Rate 1 Bill Impact'!J44","v":0},{"$f":"E10+H10+J10","v":49.348043886720745},{"$f":"'G1.1 Rate 1 Bill Impact'!L59","v":4.0208060058015714E-2},null,null,{"$f":"'G1.1 Rate 1 Bill Impact'!J59-O10","v":0}]
{"$rows_left_out":9}
{"sheet":"Overrun","index":19,"n_rows":10,"n_cols":3,"rows_kept":10,"cut":false,"hidden":false,"merged":[]}
["Overrun Charges"]
[]
["Rate 11","Current","Updated"]
["Authorized Overrun Charge",17.5581,{"$f":"B4*(1+'C1.2 - PCA'!$H$12)","v":17.915059684620001}]
["Unauthorized Overrun Charge",420.45589999999999,{"$f":"B5*(1+'C1.2 - PCA'!$H$12)","v":429.00385253818001}]
[]
[]
["Rate 16","Current","Updated"]
["Authorized Overrun Charge",5.4866999999999999,{"$f":"B9*(1+'C1.2 - PCA'!$H$12)","v":5.5982457083400003}]
["Unauthorized Overrun Charge",420.56400000000002,{"$f":"B10*(1+'C1.2 - PCA'!$H$12)","v":429.11415023280006}]