{"text_format":"1","workbook":"xlsx","n_sheets":9,"sheets":["1. Utility_Info","2. ICM_Costs","3. Cost_of_Service_Parameters","4. ICM_Assets_and_Rate_Base","5. UCC_Calculation","7. Rate Rider Revs","6. ICMIRR_2018","8. Opex Interest Annual","9. IRR"],"not_rendered":{"charts":0,"images":5,"macros":1,"external_links":0,"defined_names":9381,"comments":1,"pivot_tables":0},"unopened":[],"bounds":{"document_bytes":16777216,"sheet_cells":100000,"rows_first":2000,"rows_last":500,"rows_between":2000,"halvings":0,"cell_chars":16384,"cell_head_chars":4096},"cells_cut":0,"cells_raw":0,"read":"whole","date_system":"1900"}

{"sheet":"1. Utility_Info","index":0,"n_rows":85,"n_cols":28,"rows_kept":85,"cut":false,"hidden":false,"merged":[[20,3,20,5],[22,3,22,7],[1,2,1,9],[2,2,2,9],[3,2,3,9],[4,2,4,9],[14,3,14,4],[18,3,18,4],[16,3,16,7]]}
[null,null,null,null,null,null,null,null,null,null,null,null,null,null,null,null,null,null,null,null,null,null,null,null,null,null,null,"Algoma Power Inc."]
[null,null,null,null,null,null,null,null,null,null,null,null,null,null,null,null,null,null,null,null,null,null,null,null,null,null,null,"Atikokan Hydro Inc."]
[null,null,null,null,null,null,null,null,null,null,null,null,null,null,null,null,null,null,null,null,null,null,null,null,null,null,null,"Attawapiskat Power Corporation"]
[null,null,null,null,null,null,null,null,null,null,null,null,null,null,null,null,null,null,null,null,null,null,null,null,null,null,null,"Bluewater Power Distribution Corp."]
[null,null,null,null,null,null,null,null,null,null,null,null,null,null,null,null,null,null,null,null,null,null,null,null,null,null,null,"Brant County Power"]
[null,null,null,null,null,null,null,null,null,null,null,null,null,null,null,null,null,null,null,null,null,null,null,null,null,null,null,"Brantford Power Inc."]
[null,null,null,null,null,null,null,null,null,null,null,null,null,null,null,null,null,null,null,null,null,null,null,null,null,null,null,"Burlington Hydro Inc."]
[null,null,null,null,null,null,null,null,null,null,null,null,null,null,null,null,null,null,null,null,null,null,null,null,null,null,null,"Cambridge and North Dumfries Hydro"]
[null,null,null,null,null,null,null,null,null,null,null,null,null,null,null,null,null,null,null,null,null,null,null,null,null,null,null,"Canadian Niagara Power Inc. – Eastern Ontario Power/Fort Erie/Port Colborne"]
[null,null,null,null,null,null,null,null,null,null,null,null,null,null,null,null,null,null,null,null,null,null,null,null,null,null,null,"Centre Wellington Hydro Ltd."]
[null,null,null,null,null,null,null,null,null,null,null,null,null,null,null,null,null,null,null,null,null,null,null,null,null,null,null,"Chapleau Public Utilities Corporation"]
[null,null,null,null,null,null,null,null,null,null,null,null,null,null,null,null,null,null,null,null,null,null,null,null,null,null,null,"COLLUS Power Corp."]
[null,null,null,null,null,null,null,"Version",4,null,null,null,null,null,null,null,null,null,null,null,null,null,null,null,null,null,null,"Cooperative Hydro Embrun Inc."]
[null,null,null,null,null,null,null,null,null,null,null,null,null,null,null,null,null,null,null,null,null,null,null,null,null,null,null,"E.L.K. Energy Inc."]
[null,null,"Utility Name   ","Alectra Utilities Corporation - Brampton Rate Zone",null,null,null,null,null,null,null,null,null,null,null,null,null,null,null,null,null,null,null,null,null,null,null,"Enersource Hydro Mississauga Inc."]
[null,null,null,null,null,null,null,null,null,null,null,null,null,null,null,null,null,null,null,null,null,null,null,null,null,null,null,"Entegrus Powerlines Inc."]
[null,null,"Assigned EB Number","EB-2025-0252",null,null,null,null,null,null,null,null,null,null,null,null,null,null,null,null,null,null,null,null,null,null,null,"ENWIN Utilities Ltd."]
[null,null,null,null,null,null,null,null,null,null,null,null,null,null,null,null,null,null,null,null,null,null,null,null,null,null,null,"Erie Thames Powerlines Corp."]
[null,null,"Name and Title","Natalie Yeates, Director, Regulatory Affairs",null,null,null,null,null,null,null,null,null,null,null,null,null,null,null,null,null,null,null,null,null,null,null,"Espanola Regional Hydro Distribution Corporation"]
[null,null,null,null,null,null,null,null,null,null,null,null,null,null,null,null,null,null,null,null,null,null,null,null,null,null,null,"Essex Powerlines Corporation"]
[null,null,"Phone Number","416-617-1959",null,null,null,null,null,null,null,null,null,null,null,null,null,null,null,null,null,null,null,null,null,null,null,"Festival Hydro Inc."]
[null,null,null,null,null,null,null,null,null,null,null,null,null,null,null,null,null,null,null,null,null,null,null,null,null,null,null,"Fort Albany Power Corporation"]
[null,null,"Email Address","natalie.yeates@alectrautilities.com",null,null,null,null,null,null,null,null,null,null,null,null,null,null,null,null,null,null,null,null,null,null,null,"Fort Frances Power Corporation"]
[null,null,null,null,null,null,null,null,null,null,null,null,null,null,null,null,null,null,null,null,null,null,null,null,null,null,null,"Greater Sudbury Hydro Inc."]
[null,null,"Date",null,null,null,null,null,null,null,null,null,null,null,null,null,null,null,null,null,null,null,null,null,null,null,null,"Grimsby Power Inc."]
[null,null,null,null,null,null,null,null,null,null,null,null,null,null,null,null,null,null,null,null,null,null,null,null,null,null,null,"Guelph Hydro Electric Systems Inc."]
[null,null,"ICM Project","2018 CCRA",null,null,null,null,null,null,null,null,null,null,null,null,null,null,null,null,null,null,null,null,null,null,null,"Halton Hills Hydro Inc."]
[null,null,null,null,null,null,null,null,null,null,null,null,null,null,null,null,null,null,null,null,null,null,null,null,null,null,null,"Hearst Power Distribution Co. Ltd."]
["Note:  Drop-down lists are shaded blue; Input cells are shaded green."]
[]
{"$rows_left_out":56}
{"sheet":"2. ICM_Costs","index":1,"n_rows":212,"n_cols":11,"rows_kept":212,"cut":false,"hidden":false,"merged":[[166,2,166,3],[168,2,168,3],[170,2,170,3]]}
[]
[]
[]
[]
[]
[]
[]
[]
[]
[]
[]
[]
[]
[]
[]
[]
[]
[null,null,null,null,null,null,2018,null,null,null,"Total"]
[null,"Sheet 2: ICM Capital Cost Data",null,null,null,null,"Audited Actual",null,"Forecast"]
[]
[]
[]
[]
[]
[]
[]
[]
[]
[]
[]
{"$rows_left_out":183}
{"sheet":"3. Cost_of_Service_Parameters","index":2,"n_rows":140,"n_cols":23,"rows_kept":140,"cut":false,"hidden":false,"merged":[]}
[]
[]
[]
[]
[]
[]
[]
[]
[]
[]
[]
[]
[]
[]
[]
[]
[null,"Sheet 3: Parameters and Rates"]
[]
[null,null,null,null,null,null,2018,null,2019,null,2020,null,2021,null,2022,null,2023,null,2024,null,2025,null,2026]
[null,"Cost of Capital"]
[null,null,"Capital Structure"]
[null,null,null,"Deemed Short-term Debt Capitalization",null,null,0.04,null,0.04,null,0.04,null,0.04,null,0.04,null,0.04,null,0.04,null,0.04,null,0.04]
[null,null,null,"Deemed Long-term Debt Capitalization",null,null,{"$f":"60%-G22","v":0.55999999999999994},null,{"$f":"60%-I22","v":0.55999999999999994},null,{"$f":"60%-K22","v":0.55999999999999994},null,{"$f":"60%-M22","v":0.55999999999999994},null,{"$f":"60%-O22","v":0.55999999999999994},null,{"$f":"60%-Q22","v":0.55999999999999994},null,{"$f":"60%-S22","v":0.55999999999999994},null,{"$f":"60%-U22","v":0.55999999999999994},null,{"$f":"60%-W22","v":0.55999999999999994}]
[null,null,null,"Deemed Equity Capitalization",null,null,{"$f":"100%-G23-G25-G22","v":0.40000000000000008},null,{"$f":"100%-I23-I25-I22","v":0.40000000000000008},null,{"$f":"100%-K23-K25-K22","v":0.40000000000000008},null,{"$f":"100%-M23-M25-M22","v":0.40000000000000008},null,{"$f":"100%-O23-O25-O22","v":0.40000000000000008},null,{"$f":"100%-Q23-Q25-Q22","v":0.40000000000000008},null,{"$f":"100%-S23-S25-S22","v":0.40000000000000008},null,{"$f":"100%-U23-U25-U22","v":0.40000000000000008},null,{"$f":"100%-W23-W25-W22","v":0.40000000000000008}]
[null,null,null,"Preferred Shares"]
[null,null,"Total",null,null,null,{"$f":"SUM(G22:G25)","v":1},null,{"$f":"SUM(I22:I25)","v":1},null,{"$f":"SUM(K22:K25)","v":1},null,{"$f":"SUM(M22:M25)","v":1},null,{"$f":"SUM(O22:O25)","v":1},null,{"$f":"SUM(Q22:Q25)","v":1},null,{"$f":"SUM(S22:S25)","v":1},null,{"$f":"SUM(U22:U25)","v":1},null,{"$f":"SUM(W22:W25)","v":1}]
[]
[null,null,"Cost of Capital Parameters"]
[null,null,null,"Deemed Short-term Debt Rate",null,null,2.1600000000000001E-2,null,2.1600000000000001E-2,null,2.1600000000000001E-2,null,2.1600000000000001E-2,null,2.1600000000000001E-2,null,2.1600000000000001E-2,null,2.1600000000000001E-2,null,2.1600000000000001E-2,null,2.1600000000000001E-2]
[null,null,null,"Long-term Debt Rate (actual/embedded/deemed)1",null,null,6.0699999999999997E-2,null,6.0699999999999997E-2,null,6.0699999999999997E-2,null,6.0699999999999997E-2,null,6.0699999999999997E-2,null,6.0699999999999997E-2,null,6.0699999999999997E-2,null,6.0699999999999997E-2,null,6.0699999999999997E-2]
{"$rows_left_out":111}
{"sheet":"4. ICM_Assets_and_Rate_Base","index":3,"n_rows":295,"n_cols":25,"rows_kept":295,"cut":false,"hidden":false,"merged":[]}
[]
[]
[]
[]
[]
[]
[]
[]
[]
[]
[]
[]
[]
[]
[]
[]
[null,"Sheet 4: ICM Assets - Net Book Value"]
[null,null,null,null,null,null,null,null,{"$f":"'3. Cost_of_Service_Parameters'!G19","v":2018},null,2019,null,2020,null,2021,null,2022,null,2023,null,2024,null,2025,null,2026]
[null,"Net Fixed Assets - CCR&A contributions"]
[]
[null,null,"Gross Book Value"]
[null,null,null,"Opening Balance",null,null,null,null,null,null,{"$f":"I25","v":6804600},null,{"$f":"K25","v":6804600},null,{"$f":"M25","v":6804600},null,{"$f":"O25","v":6804600},null,{"$f":"Q25","v":6804600},null,{"$f":"S25","v":6804600},null,{"$f":"U25","v":6804600},null,{"$f":"W25","v":6804600}]
[null,null,null,"Capital Additions during year (from ICM Costs)",null,null,null,null,{"$f":"'2. ICM_Costs'!G208","v":6804600},null,{"$f":"'2. ICM_Costs'!I182","v":0},null,{"$f":"'2. ICM_Costs'!K182","v":0},null,{"$f":"'2. ICM_Costs'!M182","v":0},null,{"$f":"'2. ICM_Costs'!O182","v":0},null,{"$f":"'2. ICM_Costs'!Q182","v":0},null,{"$f":"'2. ICM_Costs'!S182","v":0},null,{"$f":"'2. ICM_Costs'!U182","v":0},null,{"$f":"'2. ICM_Costs'!W182","v":0}]
[null,null,null,"Retirements/Removals (if applicable)"]
[null,null,null,"Closing Balance",null,null,null,null,{"$f":"I22+I23-I24","v":6804600},null,{"$f":"K22+K23-K24","v":6804600},null,{"$f":"M22+M23-M24","v":6804600},null,{"$f":"O22+O23-O24","v":6804600},null,{"$f":"Q22+Q23-Q24","v":6804600},null,{"$f":"S22+S23-S24","v":6804600},null,{"$f":"U22+U23-U24","v":6804600},null,{"$f":"W22+W23-W24","v":6804600},null,{"$f":"Y22+Y23-Y24","v":6804600}]
[]
[null,null,"Accumulated Depreciation"]
[null,null,null,"Opening Balance",null,null,null,null,null,null,{"$f":"I31","v":-170115},null,{"$f":"K31","v":-340230},null,{"$f":"M31","v":-510345},null,{"$f":"O31","v":-680460},null,{"$f":"Q31","v":-850575},null,{"$f":"S31","v":-1020690},null,{"$f":"U31","v":-1190805},null,{"$f":"W31","v":-1360920}]
[null,null,null,"Amortization expense during year",null,null,null,null,{"$f":"IF(ISERROR(-(I23/('3. Cost_of_Service_Parameters'!G77)+MIN((I22/'3. Cost_of_Service_Parameters'!G77),(I22+I28)))), 0, -(I23/('3. Cost_of_Service_Parameters'!G77)+MIN((I22/'3. Cost_of_Service_Parameters'!G77),(I22+I28))))","v":-170115},null,{"$f":"IF(ISERROR(-(K23/('3. Cost_of_Service_Parameters'!I77)+MIN((K22/'3. Cost_of_Service_Parameters'!I77),(K22+K28)))), 0, -(K23/('3. Cost_of_Service_Parameters'!I77)+MIN((K22/'3. Cost_of_Service_Parameters'!I77),(K22+K28))))","v":-170115},null,{"$f":"IF(ISERROR(-(M23/('3. Cost_of_Service_Parameters'!K77)+MIN((M22/'3. Cost_of_Service_Parameters'!K77),(M22+M28)))), 0, -(M23/('3. Cost_of_Service_Parameters'!K77)+MIN((M22/'3. Cost_of_Service_Parameters'!K77),(M22+M28))))","v":-170115},null,{"$f":"IF(ISERROR(-(O23/('3. Cost_of_Service_Parameters'!M77)+MIN((O22/'3. Cost_of_Service_Parameters'!M77),(O22+O28)))), 0, -(O23/('3. Cost_of_Service_Parameters'!M77)+MIN((O22/'3. Cost_of_Service_Parameters'!M77),(O22+O28))))","v":-170115},null,{"$f":"IF(ISERROR(-(Q23/('3. Cost_of_Service_Parameters'!O77)+MIN((Q22/'3. Cost_of_Service_Parameters'!O77),(Q22+Q28)))), 0, -(Q23/('3. Cost_of_Service_Parameters'!O77)+MIN((Q22/'3. Cost_of_Service_Parameters'!O77),(Q22+Q28))))","v":-170115},null,{"$f":"IF(ISERROR(-(S23/('3. Cost_of_Service_Parameters'!Q77)+MIN((S22/'3. Cost_of_Service_Parameters'!Q77),(S22+S28)))), 0, -(S23/('3. Cost_of_Service_Parameters'!Q77)+MIN((S22/'3. Cost_of_Service_Parameters'!Q77),(S22+S28))))","v":-170115},null,{"$f":"IF(ISERROR(-(U23/('3. Cost_of_Service_Parameters'!S77)+MIN((U22/'3. Cost_of_Service_Parameters'!S77),(U22+U28)))), 0, -(U23/('3. Cost_of_Service_Parameters'!S77)+MIN((U22/'3. Cost_of_Service_Parameters'!S77),(U22+U28))))","v":-170115},null,{"$f":"IF(ISERROR(-(W23/('3. Cost_of_Service_Parameters'!U77)+MIN((W22/'3. Cost_of_Service_Parameters'!U77),(W22+W28)))), 0, -(W23/('3. Cost_of_Service_Parameters'!U77)+MIN((W22/'3. Cost_of_Service_Parameters'!U77),(W22+W28))))","v":-170115},null,{"$f":"IF(ISERROR(-(Y23/('3. Cost_of_Service_Parameters'!W77)+MIN((Y22/'3. Cost_of_Service_Parameters'!W77),(Y22+Y28)))), 0, -(Y23/('3. Cost_of_Service_Parameters'!W77)+MIN((Y22/'3. Cost_of_Service_Parameters'!W77),(Y22+Y28))))","v":-170115}]
[null,null,null,"Retirements/Removals (if applicable)"]
{"$rows_left_out":266}
{"sheet":"5. UCC_Calculation","index":4,"n_rows":46,"n_cols":4,"rows_kept":46,"cut":false,"hidden":false,"merged":[]}
[]
[]
[]
[]
[]
[]
[]
[]
[]
[]
[]
[]
[]
[]
[]
[]
[]
["Sheet 6: CCA For PILs Calculation"]
[]
["UCC/Class 47",null,null,{"$f":"'3. Cost_of_Service_Parameters'!G19","v":2018}]
[null,null,null,{"$f":"'2. ICM_Costs'!G19","v":"Audited Actual"}]
[]
["Opening UCC",null,null,0]
["Capital Additions",null,null,{"$f":"'2. ICM_Costs'!K211","v":6804600}]
["Retirements/Removals (if applicable)"]
["UCC Full Year",null,null,{"$f":"SUM(D23:D24)-D25","v":6804600}]
[]
[]
["CCA Rate Class",null,null,{"$f":"'3. Cost_of_Service_Parameters'!G134","v":47}]
["CCA Rate ",null,null,{"$f":"'3. Cost_of_Service_Parameters'!G135","v":0.08}]
{"$rows_left_out":17}
{"sheet":"7. Rate Rider Revs","index":5,"n_rows":131,"n_cols":17,"rows_kept":131,"cut":false,"hidden":false,"merged":[[12,1,12,13],[18,5,18,15]]}
[]
[]
[]
[]
[]
[]
[]
[]
[]
[]
[]
[]
[null,"This worksheet calculates the rate riders revenues.\n"]
[]
[]
[]
[null,"Sheet 7: ICM Rate Rider Revenues"]
[]
[]
[]
[]
[null,"Prescribed \nInterest Rates","Approved Deferral and Variance Accounts","CWIP",null,"Date","Year","Quarter",null,"Opening Balance (Principal)","Rate Rider Revenues","Interest Rate","Interest","Principal &\nInterest\n(Cumm.)",null,"Board Approved ICM Rate Rider","Board Approved ICM  Rate Rider\n(Cumm.)"]
[]
[null,"2018 Q1",1.4999999999999999E-2,2.9899999999999999E-2,null,"2018-01-01",{"$f":"YEAR(F24)","v":2018},{"$f":"IF(MONTH(F24)=0,\"\",IF(MONTH(F24)<4,\"Q1\",IF(MONTH(F24)<7,\"Q2\",IF(MONTH(F24)<10,\"Q3\",\"Q4\"))))","v":"Q1"},{"$f":"CONCATENATE(G24,\" \",H24)","v":"2018 Q1"},0,null,1.4999999999999999E-2,{"$f":"ROUND(J24*L24/12,2)","v":0},{"$f":"K24+M24","v":0},null,null,{"$f":"P24","v":0}]
[null,"2018 Q2",1.89E-2,3.3500000000000002E-2,null,"2018-02-01",{"$f":"YEAR(F25)","v":2018},{"$f":"IF(MONTH(F25)=0,\"\",IF(MONTH(F25)<4,\"Q1\",IF(MONTH(F25)<7,\"Q2\",IF(MONTH(F25)<10,\"Q3\",\"Q4\"))))","v":"Q1"},{"$f":"CONCATENATE(G25,\" \",H25)","v":"2018 Q1"},{"$f":"J24+K24","v":0},null,1.4999999999999999E-2,{"$f":"ROUND(J25*L25/12,2)","v":0},{"$f":"N24+K25+M25","v":0},null,null,{"$f":"Q24+P25","v":0}]
[null,"2018 Q3",1.89E-2,3.3500000000000002E-2,null,"2018-03-01",2018,"Q1","2018 Q1",{"$f":"J25+K25","v":0},null,1.4999999999999999E-2,0,{"$f":"N25+K26+M26","v":0},null,null,{"$f":"Q25+P26","v":0}]
[null,"2018 Q4",2.1700000000000001E-2,3.3500000000000002E-2,null,"2018-04-01",2018,"Q2","2018 Q2",0,null,1.89E-2,0,0,null,null,0]
[null,"2019 Q1",2.4500000000000001E-2,3.8199999999999998E-2,null,"2018-05-01",2018,"Q2","2018 Q2",0,64808.479999999989,1.89E-2,0,64808.479999999989,null,58899.468985677988,{"$f":"Q27+P28","v":58899.468985677988}]
[null,"2019 Q2",2.18E-2,3.39E-2,null,"2018-06-01",2018,"Q2","2018 Q2",64808.479999999989,57571.520000000011,1.89E-2,{"$f":"ROUND(J29*L29/12,2)","v":102.07},122482.07,null,58899.468985677988,117798.93797135598]
[null,"2019 Q3",2.18E-2,2.8799999999999999E-2,null,"2018-07-01",2018,"Q3","2018 Q3",122380,62441.650000000052,1.89E-2,192.75,185116.47000000006,null,58899.468985677988,176698.40695703396]
{"$rows_left_out":102}
{"sheet":"6. ICMIRR_2018","index":6,"n_rows":88,"n_cols":14,"rows_kept":88,"cut":false,"hidden":false,"merged":[[23,8,23,10]]}
[]
[]
[]
[]
[]
[]
[]
[]
[]
[]
["Sheet 6:",null,"Incremental Capital Adjustment"]
[]
[]
[]
[]
[]
[]
[]
[]
[]
[]
[]
[null,null,null,null,null,"Actual"]
[null,null,null,null,null,null,null,null,"2018 OEB Approved"]
[]
[null,null,"Return on Rate Base"]
[null,null,"Incremental Capital CAPEX",null,null,{"$f":"'2. ICM_Costs'!G42","v":6804600},"B",null,null,null,6800377]
[null,null,"Depreciation Expense",null,null,{"$f":"-'4. ICM_Assets_and_Rate_Base'!I29","v":170115},"C",null,null,null,226679]
[null,null,"Incremental Capital CAPEX to be included in Rate Base",null,null,{"$f":"F27-F28","v":6634485},"D = B - C",null,null,null,{"$f":"K27-K28","v":6573698}]
[]
{"$rows_left_out":59}
{"sheet":"8. Opex Interest Annual","index":7,"n_rows":42,"n_cols":14,"rows_kept":42,"cut":false,"hidden":false,"merged":[]}
[]
[]
[]
[]
[]
[]
[]
[]
[]
[]
[]
[]
[null,"This worksheet calculates the interest on amortization/depreciation expense, in the absence of monthly data."]
[]
[]
[null,"Sheet 8: Interest on Amortization (Annual Data) "]
[]
[]
[]
[]
[null,"Year",null,"OM&A",null,"Amortization Expense",null,"Cumulative OM&A and Amortization Expense",null,"Average Cumulative OM&A and Amortization Expense",null,"Average Annual Prescribed Interest Rate for Deferral and Variance Accounts (from Sheet 7)",null,"Simple Interest on OM&A and Amortization Expenses"]
[null,null,null,null,null,"(from Sheet 4)"]
[null,2018,null,0,null,{"$f":"-'4. ICM_Assets_and_Rate_Base'!I295","v":170115},null,{"$f":"D23+F23","v":170115},null,{"$f":"H23/2","v":85057.5},null,{"$f":"AVERAGE('7. Rate Rider Revs'!C24:C27)","v":1.8624999999999999E-2},null,{"$f":"J23*L23","v":1584.1959374999999}]
[null,2019,null,0,null,{"$f":"-'4. ICM_Assets_and_Rate_Base'!K295","v":170115},null,{"$f":"H23+D24+F24","v":340230},null,{"$f":"(H24+H23)/2","v":255172.5},null,{"$f":"AVERAGE('7. Rate Rider Revs'!C28:C31)","v":2.2474999999999998E-2},null,{"$f":"J24*L24","v":5735.0019374999993}]
[null,2020,null,0,null,{"$f":"-'4. ICM_Assets_and_Rate_Base'!M295","v":170115},null,{"$f":"H24+D25+F25","v":510345},null,{"$f":"(H25+H24)/2","v":425287.5},null,{"$f":"AVERAGE('7. Rate Rider Revs'!C32:C35)","v":1.3749999999999998E-2},null,{"$f":"J25*L25","v":5847.7031249999991}]
[null,2021,null,0,null,{"$f":"-'4. ICM_Assets_and_Rate_Base'!O295","v":170115},null,680460,null,595402.5,null,{"$f":"AVERAGE('7. Rate Rider Revs'!C36:C39)","v":5.7000000000000002E-3},null,{"$f":"J26*L26","v":3393.7942499999999}]
[null,2022,null,0,null,{"$f":"-'4. ICM_Assets_and_Rate_Base'!Q295","v":170115},null,{"$f":"H26+D27+F27","v":850575},null,765517.5,null,{"$f":"AVERAGE('7. Rate Rider Revs'!C40:C43)","v":1.915E-2},null,{"$f":"J27*L27","v":14659.660125}]
[null,2023,null,0,null,{"$f":"-'4. ICM_Assets_and_Rate_Base'!S295","v":170115},null,1020690,null,935632.5,null,{"$f":"AVERAGE('7. Rate Rider Revs'!C44:C47)","v":5.0449999999999995E-2},null,47202.659624999993]
[null,2024,null,0,null,{"$f":"-'4. ICM_Assets_and_Rate_Base'!U295","v":170115},null,1190805,null,1105747.5,null,{"$f":"AVERAGE('7. Rate Rider Revs'!C48:C51)","v":5.1449999999999996E-2},null,56890.708874999997]
[null,2025,null,0,null,{"$f":"-'4. ICM_Assets_and_Rate_Base'!W295","v":170115},null,1360920,null,1275862.5,null,{"$f":"AVERAGE('7. Rate Rider Revs'!C52:C55)","v":3.1550000000000002E-2},null,40253.461875000001]
{"$rows_left_out":13}
{"sheet":"9. IRR","index":8,"n_rows":31,"n_cols":37,"rows_kept":31,"cut":false,"hidden":false,"merged":[[13,1,13,26],[19,2,19,3]]}
[]
[]
[]
[]
[]
[]
[]
[]
[]
[]
[]
[]
[]
[null,"This worksheet calculates the ICM Incremental Revenue Requirement."]
[]
[]
[null,"Sheet 9: ICM Incremental Revenue Requirement"]
[null,null," "]
[]
[null,null,null,null,null,null,2018,null,2019,null,2020,null,2021,null,2022,null,2023,null,2024,null,2025,null,2026,null,"Total",null,null,null,2018,{"$f":"AC20+1","v":2019},{"$f":"AD20+1","v":2020},2021,2022,2023,2024,2025,2026]
[]
[null,null,"Deferred and forecasted ICM Incremental Revenue Requirement (from Sheet 6)",null,null,null,{"$f":"'6. ICMIRR_2018'!F88*8/12","v":423286.43852704129},null,{"$f":"'6. ICMIRR_2018'!$F$88","v":634929.65779056191},null,{"$f":"'6. ICMIRR_2018'!$F$88","v":634929.65779056191},null,{"$f":"'6. ICMIRR_2018'!$F$88","v":634929.65779056191},null,{"$f":"'6. ICMIRR_2018'!$F$88","v":634929.65779056191},null,{"$f":"'6. ICMIRR_2018'!$F$88","v":634929.65779056191},null,{"$f":"'6. ICMIRR_2018'!$F$88","v":634929.65779056191},null,{"$f":"'6. ICMIRR_2018'!$F$88","v":634929.65779056191},null,{"$f":"'6. ICMIRR_2018'!$F$88","v":634929.65779056191},null,{"$f":"SUM(G22:W22)","v":5502723.7008515373},null,null,"Revenue Requirement ",{"$f":"G22","v":423286.43852704129},{"$f":"I22","v":634929.65779056191},{"$f":"K22","v":634929.65779056191},{"$f":"M22","v":634929.65779056191},{"$f":"O22","v":634929.65779056191},{"$f":"Q22","v":634929.65779056191},{"$f":"S22","v":634929.65779056191},{"$f":"U22","v":634929.65779056191},{"$f":"W22","v":634929.65779056191}]
[null,null,null,null,null,null,null,null,null,null,null,null,null,null,null,null,null,null,null,null,null,null,null,null,null,null,null,"Interest on Deferred  Amortization Expense ",{"$f":"G24","v":1584.1959374999999},{"$f":"I24","v":5735.0019374999993},{"$f":"K24","v":5847.7031249999991},{"$f":"M24","v":3393.7942499999999},{"$f":"O24","v":14659.660125},{"$f":"Q27","v":754748.08000000007},{"$f":"S27","v":755012.11},{"$f":"U24","v":40253.461875000001},{"$f":"W24","v":36872.426249999997}]
[null,null,"Interest on Deferred and forecasted Amortization Expense (Sheet 8)",null,null,null,{"$f":"'8. Opex Interest Annual'!$N$23","v":1584.1959374999999},null,{"$f":"'8. Opex Interest Annual'!$N$24","v":5735.0019374999993},null,{"$f":"'8. Opex Interest Annual'!$N$25","v":5847.7031249999991},null,{"$f":"'8. Opex Interest Annual'!$N$26","v":3393.7942499999999},null,{"$f":"'8. Opex Interest Annual'!$N$27","v":14659.660125},null,{"$f":"'8. Opex Interest Annual'!$N$28","v":47202.659624999993},null,{"$f":"'8. Opex Interest Annual'!$N$29","v":56890.708874999997},null,{"$f":"'8. Opex Interest Annual'!$N$30","v":40253.461875000001},null,{"$f":"'8. Opex Interest Annual'!$N$31","v":36872.426249999997},null,{"$f":"SUM(G24:W24)","v":212439.61199999996},null,null,"Subtotal A",{"$f":"AC22+AC23","v":424870.63446454128},{"$f":"AD22+AD23","v":640664.65972806187},640777.36091556191,638323.45204056194,649589.31791556196,1389677.737790562,1389941.767790562,675183.11966556194,671802.08404056192]
[null,null,null,null,null,null,null,null,null,null,null,null,null,null,null,null,null,null,null,null,null,null,null,null,null,null,null,"Less:"]
[null,null,null,null,null,null,null,null,null,null,null,null,null,null,null,null,null,null,null,null,null,null,null,null,null,null,null,"ICM Funding adders",{"$f":"G27","v":494014.69999999995},{"$f":"I27","v":740117.43999999983}]
[null,null,"ICM Rate Rider Revenues (from Sheet 7)",null,null,null,{"$f":"SUM('7. Rate Rider Revs'!K26:K35)","v":494014.69999999995},null,{"$f":"SUM('7. Rate Rider Revs'!K36:K47)","v":740117.43999999983},null,{"$f":"SUM('7. Rate Rider Revs'!K48:K59)","v":731320.63},null,{"$f":"SUM('7. Rate Rider Revs'!K60:K71)","v":740564.34},null,{"$f":"SUM('7. Rate Rider Revs'!K72:K83)","v":748366.98},null,{"$f":"SUM('7. Rate Rider Revs'!K84:K95)","v":754748.08000000007},null,{"$f":"SUM('7. Rate Rider Revs'!K96:K107)","v":755012.11},null,{"$f":"SUM('7. Rate Rider Revs'!K108:K119)","v":761973.07000000007},null,{"$f":"SUM('7. Rate Rider Revs'!K120:K131)","v":767596.38792383578},null,{"$f":"SUM(G27:W27)","v":6493713.7379238363},null,null,"ICM Funding Adder Interest",{"$f":"G29","v":2991.21}]
[null,null,null,null,null,null,null,null,null,null,null,null,null,null,null,null,null,null,null,null,null,null,null,null,null,null,null,"Subtotal B"]
[null,null,"ICM Rate Rider Interest (from Sheet 7)",null,null,null,{"$f":"SUM('7. Rate Rider Revs'!M27:M35)","v":2991.21},null,{"$f":"SUM('7. Rate Rider Revs'!M36:M47)","v":18519.04},null,{"$f":"SUM('7. Rate Rider Revs'!M48:M59)","v":20081.53},null,{"$f":"SUM('7. Rate Rider Revs'!M60:M71)","v":13114.92},null,{"$f":"SUM('7. Rate Rider Revs'!M72:M83)","v":60942.619999999995},null,{"$f":"SUM('7. Rate Rider Revs'!M84:M95)","v":192075.58},null,{"$f":"SUM('7. Rate Rider Revs'!M96:M107)","v":233458.88},null,{"$f":"SUM('7. Rate Rider Revs'!M108:M119)","v":166966.98000000001},null,{"$f":"SUM('7. Rate Rider Revs'!M120:M131)","v":154948.92000000001},null,{"$f":"SUM(G29:W29)","v":863099.68},null,null,"ICM True-up Amount (A-B)"]
[]
{"$rows_left_out":1}