{"text_format":"1","workbook":"xlsx","n_sheets":9,"sheets":["1. Utility_Info_","2. ICM_Costs","3. Cost_of_Service_Parameters","4. ICM_Assets_and_Rate_Base","5. UCC_Calculation","6. ICMIRR ","7. Rate Rider Revs","8. Opex Interest Annual","9. IRR"],"not_rendered":{"charts":0,"images":5,"macros":1,"external_links":0,"defined_names":9063,"comments":0,"pivot_tables":0},"unopened":[],"bounds":{"document_bytes":16777216,"sheet_cells":100000,"rows_first":2000,"rows_last":500,"rows_between":2000,"halvings":0,"cell_chars":16384,"cell_head_chars":4096},"cells_cut":0,"cells_raw":0,"read":"whole","date_system":"1900"}

{"sheet":"1. Utility_Info_","index":0,"n_rows":85,"n_cols":28,"rows_kept":85,"cut":false,"hidden":false,"merged":[[18,3,18,4],[1,2,1,9],[2,2,2,9],[3,2,3,9],[4,2,4,9],[14,3,14,4]]}
[null,null,null,null,null,null,null,null,null,null,null,null,null,null,null,null,null,null,null,null,null,null,null,null,null,null,null,"Algoma Power Inc."]
[null,null,null,null,null,null,null,null,null,null,null,null,null,null,null,null,null,null,null,null,null,null,null,null,null,null,null,"Atikokan Hydro Inc."]
[null,null,null,null,null,null,null,null,null,null,null,null,null,null,null,null,null,null,null,null,null,null,null,null,null,null,null,"Attawapiskat Power Corporation"]
[null,null,null,null,null,null,null,null,null,null,null,null,null,null,null,null,null,null,null,null,null,null,null,null,null,null,null,"Bluewater Power Distribution Corp."]
[null,null,null,null,null,null,null,null,null,null,null,null,null,null,null,null,null,null,null,null,null,null,null,null,null,null,null,"Brant County Power"]
[null,null,null,null,null,null,null,null,null,null,null,null,null,null,null,null,null,null,null,null,null,null,null,null,null,null,null,"Brantford Power Inc."]
[null,null,null,null,null,null,null,null,null,null,null,null,null,null,null,null,null,null,null,null,null,null,null,null,null,null,null,"Burlington Hydro Inc."]
[null,null,null,null,null,null,null,null,null,null,null,null,null,null,null,null,null,null,null,null,null,null,null,null,null,null,null,"Cambridge and North Dumfries Hydro"]
[null,null,null,null,null,null,null,null,null,null,null,null,null,null,null,null,null,null,null,null,null,null,null,null,null,null,null,"Canadian Niagara Power Inc. – Eastern Ontario Power/Fort Erie/Port Colborne"]
[null,null,null,null,null,null,null,null,null,null,null,null,null,null,null,null,null,null,null,null,null,null,null,null,null,null,null,"Centre Wellington Hydro Ltd."]
[null,null,null,null,null,null,null,null,null,null,null,null,null,null,null,null,null,null,null,null,null,null,null,null,null,null,null,"Chapleau Public Utilities Corporation"]
[null,null,null,null,null,null,null,null,null,null,null,null,null,null,null,null,null,null,null,null,null,null,null,null,null,null,null,"COLLUS Power Corp."]
[null,null,null,null,null,null,null,null,null,null,null,null,null,null,null,null,null,null,null,null,null,null,null,null,null,null,null,"Cooperative Hydro Embrun Inc."]
[null,null,null,null,null,null,null,null,null,null,null,null,null,null,null,null,null,null,null,null,null,null,null,null,null,null,null,"E.L.K. Energy Inc."]
[null,null,"Utility Name   ","Alectra Utilities Corporation - Enersource Rate Zone",null,null,null,null,null,null,null,null,null,null,null,null,null,null,null,null,null,null,null,null,null,null,null,"Enersource Hydro Mississauga Inc."]
[null,null,null,null,null,null,null,null,null,null,null,null,null,null,null,null,null,null,null,null,null,null,null,null,null,null,null,"Entegrus Powerlines Inc."]
[null,null,"Assigned EB Number","EB-2025-0252",null,null,null,null,null,null,null,null,null,null,null,null,null,null,null,null,null,null,null,null,null,null,null,"ENWIN Utilities Ltd."]
[null,null,null,null,null,null,null,null,null,null,null,null,null,null,null,null,null,null,null,null,null,null,null,null,null,null,null,"Erie Thames Powerlines Corp."]
[null,null,"Name and Title","Natalie Yeates,Director, Regulatory Affairs",null,null,null,null,null,null,null,null,null,null,null,null,null,null,null,null,null,null,null,null,null,null,null,"Espanola Regional Hydro Distribution Corporation"]
[null,null,null,null,null,null,null,null,null,null,null,null,null,null,null,null,null,null,null,null,null,null,null,null,null,null,null,"Essex Powerlines Corporation"]
[null,null,"Phone Number","416-617-1959",null,null,null,null,null,null,null,null,null,null,null,null,null,null,null,null,null,null,null,null,null,null,null,"Festival Hydro Inc."]
[null,null,null,null,null,null,null,null,null,null,null,null,null,null,null,null,null,null,null,null,null,null,null,null,null,null,null,"Fort Albany Power Corporation"]
[null,null,"Email Address","natalie.yeates@alectrautilities.com",null,null,null,null,null,null,null,null,null,null,null,null,null,null,null,null,null,null,null,null,null,null,null,"Fort Frances Power Corporation"]
[null,null,null,null,null,null,null,null,null,null,null,null,null,null,null,null,null,null,null,null,null,null,null,null,null,null,null,"Greater Sudbury Hydro Inc."]
[null,null,"Date",null,null,null,null,null,null,null,null,null,null,null,null,null,null,null,null,null,null,null,null,null,null,null,null,"Grimsby Power Inc."]
[null,null,null,null,null,null,null,null,null,null,null,null,null,null,null,null,null,null,null,null,null,null,null,null,null,null,null,"Guelph Hydro Electric Systems Inc."]
[null,null,"ICM Project","2019-Leaking Transformer Replacement Project - Overhead/Padmount/Vault",null,null,null,null,null,null,null,null,null,null,null,null,null,null,null,null,null,null,null,null,null,null,null,"Haldimand County Hydro Inc."]
[null,null,null,null,null,null,null,null,null,null,null,null,null,null,null,null,null,null,null,null,null,null,null,null,null,null,null,"Halton Hills Hydro Inc."]
[null,null,null,null,null,null,null,null,null,null,null,null,null,null,null,null,null,null,null,null,null,null,null,null,null,null,null,"Hearst Power Distribution Co. Ltd."]
["Note:  Drop-down lists are shaded blue; Input cells are shaded green."]
{"$rows_left_out":56}
{"sheet":"2. ICM_Costs","index":1,"n_rows":220,"n_cols":11,"rows_kept":220,"cut":false,"hidden":false,"merged":[[166,2,166,3],[168,2,168,3],[170,2,170,3]]}
[]
[]
[]
[]
[]
[]
[]
[]
[]
[]
[]
[]
[]
[]
[]
[]
[]
[null,null,null,null,null,null,2019,null,2015,null,"Total"]
[null,"Sheet 2: ICM Capital Cost Data",null,null,null,null,"Audited Actual",null,"Forecast"]
[]
[]
[]
[]
[]
[]
[]
[]
[]
[]
[]
{"$rows_left_out":191}
{"sheet":"3. Cost_of_Service_Parameters","index":2,"n_rows":140,"n_cols":21,"rows_kept":140,"cut":false,"hidden":false,"merged":[]}
[]
[]
[]
[]
[]
[]
[]
[]
[]
[]
[]
[]
[]
[]
[]
[]
[null,"Sheet 3: Parameters and Rates"]
[]
[null,null,null,null,null,null,2019,null,2020,null,2021,null,2022,null,2023,null,2024,null,2025,null,2026]
[null,"Cost of Capital"]
[null,null,"Capital Structure"]
[null,null,null,"Deemed Short-term Debt Capitalization",null,null,0.04,null,0.04,null,0.04,null,0.04,null,0.04,null,0.04,null,0.04,null,0.04]
[null,null,null,"Deemed Long-term Debt Capitalization",null,null,{"$f":"60%-G22","v":0.55999999999999994},null,{"$f":"G23-(I22-G22)","v":0.55999999999999994},null,{"$f":"I23-(K22-I22)","v":0.55999999999999994},null,{"$f":"K23-(M22-K22)","v":0.55999999999999994},null,{"$f":"M23-(O22-M22)","v":0.55999999999999994},null,{"$f":"O23-(Q22-O22)","v":0.55999999999999994},null,{"$f":"Q23-(S22-Q22)","v":0.55999999999999994},null,{"$f":"S23-(U22-S22)","v":0.55999999999999994}]
[null,null,null,"Deemed Equity Capitalization",null,null,{"$f":"100%-G23-G25-G22","v":0.40000000000000008},null,{"$f":"100%-I23-I25-I22","v":0.40000000000000008},null,{"$f":"100%-K23-K25-K22","v":0.40000000000000008},null,{"$f":"100%-M23-M25-M22","v":0.40000000000000008},null,{"$f":"100%-O23-O25-O22","v":0.40000000000000008},null,{"$f":"100%-Q23-Q25-Q22","v":0.40000000000000008},null,{"$f":"100%-S23-S25-S22","v":0.40000000000000008},null,{"$f":"100%-U23-U25-U22","v":0.40000000000000008}]
[null,null,null,"Preferred Shares"]
[null,null,"Total",null,null,null,{"$f":"SUM(G22:G25)","v":1},null,{"$f":"SUM(I22:I25)","v":1},null,{"$f":"SUM(K22:K25)","v":1},null,{"$f":"SUM(M22:M25)","v":1},null,{"$f":"SUM(O22:O25)","v":1},null,{"$f":"SUM(Q22:Q25)","v":1},null,{"$f":"SUM(S22:S25)","v":1},null,{"$f":"SUM(U22:U25)","v":1}]
[]
[null,null,"Cost of Capital Parameters"]
[null,null,null,"Deemed Short-term Debt Rate",null,null,2.0799999999999999E-2,null,2.1600000000000001E-2,null,2.0799999999999999E-2,null,2.0799999999999999E-2,null,2.0799999999999999E-2,null,2.0799999999999999E-2,null,2.0799999999999999E-2,null,2.0799999999999999E-2]
[null,null,null,"Long-term Debt Rate (actual/embedded/deemed)1",null,null,5.0914000000000001E-2,null,3.9100000000000003E-2,null,5.0914000000000001E-2,null,5.0914000000000001E-2,null,5.0914000000000001E-2,null,5.0914000000000001E-2,null,5.0914000000000001E-2,null,5.0914000000000001E-2]
{"$rows_left_out":111}
{"sheet":"4. ICM_Assets_and_Rate_Base","index":3,"n_rows":357,"n_cols":23,"rows_kept":357,"cut":false,"hidden":false,"merged":[]}
[]
[]
[]
[]
[]
[]
[]
[]
[]
[]
[]
[]
[]
[]
[]
[]
[null,"Sheet 4: ICM Assets - Net Book Value"]
[null,null,null,null,null,null,null,null,2019,null,2020,null,2021,null,2022,null,2023,null,2024,null,2025,null,2026]
[null,"Net Fixed Assets - OH Swtch & Cpctrs"]
[]
[null,null,"Gross Book Value"]
[null,null,null,"Opening Balance",null,null,null,null,null,null,{"$f":"I25","v":91095.4476},null,{"$f":"K25","v":91095.4476},null,{"$f":"M25","v":91095.4476},null,{"$f":"O25","v":91095.4476},null,{"$f":"Q25","v":91095.4476},null,{"$f":"S25","v":91095.4476},null,{"$f":"U25","v":91095.4476}]
[null,null,null,"Capital Additions during year (from ICM Costs)",null,null,null,null,{"$f":"'2. ICM_Costs'!G182","v":91095.4476},null,{"$f":"'2. ICM_Costs'!I182","v":0}]
[null,null,null,"Retirements/Removals (if applicable)"]
[null,null,null,"Closing Balance",null,null,null,null,{"$f":"I22+I23-I24","v":91095.4476},null,{"$f":"K22+K23-K24","v":91095.4476},null,{"$f":"M22+M23-M24","v":91095.4476},null,{"$f":"O22+O23-O24","v":91095.4476},null,{"$f":"Q22+Q23-Q24","v":91095.4476},null,{"$f":"S22+S23-S24","v":91095.4476},null,{"$f":"U22+U23-U24","v":91095.4476},null,{"$f":"W22+W23-W24","v":91095.4476}]
[]
[null,null,"Accumulated Depreciation"]
[null,null,null,"Opening Balance",null,null,null,null,null,null,{"$f":"I31","v":-2397.2486210526317},null,{"$f":"K31","v":-4794.4972421052635},null,{"$f":"M31","v":-7191.7458631578957},null,{"$f":"O31","v":-9588.9944842105269},null,{"$f":"Q31","v":-11986.243105263158},null,{"$f":"S31","v":-14383.491726315789},null,{"$f":"U31","v":-16986.218800601506}]
[null,null,null,"Amortization expense during year",null,null,null,null,{"$f":"IF(ISERROR(-(I23/('3. Cost_of_Service_Parameters'!G45)+MIN((I22/'3. Cost_of_Service_Parameters'!G45),(I22+I28)))), 0, -(I23/('3. Cost_of_Service_Parameters'!G45)+MIN((I22/'3. Cost_of_Service_Parameters'!G45),(I22+I28))))","v":-2397.2486210526317},null,{"$f":"IF(ISERROR(-(K23/('3. Cost_of_Service_Parameters'!I45)+MIN((K22/'3. Cost_of_Service_Parameters'!I45),(K22+K28)))), 0, -(K23/('3. Cost_of_Service_Parameters'!I45)+MIN((K22/'3. Cost_of_Service_Parameters'!I45),(K22+K28))))","v":-2397.2486210526317},null,{"$f":"IF(ISERROR(-(M23/('3. Cost_of_Service_Parameters'!K45)+MIN((M22/'3. Cost_of_Service_Parameters'!K45),(M22+M28)))), 0, -(M23/('3. Cost_of_Service_Parameters'!K45)+MIN((M22/'3. Cost_of_Service_Parameters'!K45),(M22+M28))))","v":-2397.2486210526317},null,{"$f":"IF(ISERROR(-(O23/('3. Cost_of_Service_Parameters'!M45)+MIN((O22/'3. Cost_of_Service_Parameters'!M45),(O22+O28)))), 0, -(O23/('3. Cost_of_Service_Parameters'!M45)+MIN((O22/'3. Cost_of_Service_Parameters'!M45),(O22+O28))))","v":-2397.2486210526317},null,{"$f":"IF(ISERROR(-(Q23/('3. Cost_of_Service_Parameters'!O45)+MIN((Q22/'3. Cost_of_Service_Parameters'!O45),(Q22+Q28)))), 0, -(Q23/('3. Cost_of_Service_Parameters'!O45)+MIN((Q22/'3. Cost_of_Service_Parameters'!O45),(Q22+Q28))))","v":-2397.2486210526317},null,{"$f":"IF(ISERROR(-(S23/('3. Cost_of_Service_Parameters'!Q45)+MIN((S22/'3. Cost_of_Service_Parameters'!Q45),(S22+S28)))), 0, -(S23/('3. Cost_of_Service_Parameters'!Q45)+MIN((S22/'3. Cost_of_Service_Parameters'!Q45),(S22+S28))))","v":-2397.2486210526317},null,{"$f":"IF(ISERROR(-(U23/('3. Cost_of_Service_Parameters'!S45)+MIN((U22/'3. Cost_of_Service_Parameters'!S45),(U22+U28)))), 0, -(U23/('3. Cost_of_Service_Parameters'!S45)+MIN((U22/'3. Cost_of_Service_Parameters'!S45),(U22+U28))))","v":-2602.7270742857145},null,{"$f":"IF(ISERROR(-(W23/('3. Cost_of_Service_Parameters'!U45)+MIN((W22/'3. Cost_of_Service_Parameters'!U45),(W22+W28)))), 0, -(W23/('3. Cost_of_Service_Parameters'!U45)+MIN((W22/'3. Cost_of_Service_Parameters'!U45),(W22+W28))))","v":-2602.7270742857145}]
[null,null,null,"Retirements/Removals (if applicable)"]
{"$rows_left_out":328}
{"sheet":"5. UCC_Calculation","index":4,"n_rows":46,"n_cols":4,"rows_kept":46,"cut":false,"hidden":false,"merged":[]}
[]
[]
[]
[]
[]
[]
[]
[]
[]
[]
[]
[]
[]
[]
[]
[]
[]
["Sheet 6: CCA For PILs Calculation"]
[]
["UCC/Class 47",null,null,{"$f":"'2. ICM_Costs'!G18","v":2019}]
[null,null,null,{"$f":"'2. ICM_Costs'!G19","v":"Audited Actual"}]
[]
["Opening UCC",null,null,0]
["Capital Additions",null,null,4505770.2699999996]
["Retirements/Removals (if applicable)"]
["UCC Full Year",null,null,{"$f":"SUM(D23:D24)-D25","v":4505770.2699999996}]
[]
[]
["CCA Rate Class",null,null,{"$f":"'3. Cost_of_Service_Parameters'!G83","v":47}]
["CCA Rate ",null,null,{"$f":"'3. Cost_of_Service_Parameters'!G84","v":0.08}]
{"$rows_left_out":17}
{"sheet":"6. ICMIRR ","index":5,"n_rows":88,"n_cols":11,"rows_kept":88,"cut":false,"hidden":false,"merged":[[23,8,23,10]]}
[]
[]
[]
[]
[]
[]
[]
[]
[]
[]
["Sheet 6:",null,"Incremental Capital Adjustment"]
[]
[]
[]
[]
[]
[]
[]
[]
[]
[]
[]
[]
[null,null,null,null,null,null,null,null,"2019 ICM EB-2018-0016"]
[]
[null,null,"Return on Rate Base"]
[null,null,"Incremental Capital CAPEX",null,null,4505770.2699999996,"B",null,null,null,7500000]
[null,null,"Depreciation Expense",null,null,{"$f":"-'4. ICM_Assets_and_Rate_Base'!I357","v":130614.52226373838},"C",null,null,null,198490]
[null,null,"Incremental Capital CAPEX to be included in Rate Base",null,null,{"$f":"F27-F28/2","v":4440463.0088681299},"D = B - C/2",null,null,null,{"$f":"K27-K28/2","v":7400755}]
[]
{"$rows_left_out":59}
{"sheet":"7. Rate Rider Revs","index":6,"n_rows":131,"n_cols":17,"rows_kept":131,"cut":false,"hidden":false,"merged":[[12,1,12,13],[18,5,18,15]]}
[]
[]
[]
[]
[]
[]
[]
[]
[]
[]
[]
[]
[null,"This worksheet calculates the rate rider revenues.\n"]
[]
[]
[]
[null,"Sheet 7: ICM Rate Rider Revenues"]
[]
[]
[]
[]
[null,"Prescribed \nInterest Rates","Approved Deferral and Variance Accounts","CWIP",null,"Date","Year","Quarter",null,"Opening Balance (Principal)","Rate Rider Revenues","Interest Rate","Interest","Principal &\nInterest\n(Cumm.)",null,"Board Approved ICM Rate Rider","Board Approved ICM  Rate Rider\n(Cumm.)"]
[]
[null,"2018 Q1",1.4999999999999999E-2,2.9899999999999999E-2,null,"2018-01-01",{"$f":"YEAR(F24)","v":2018},{"$f":"IF(MONTH(F24)=0,\"\",IF(MONTH(F24)<4,\"Q1\",IF(MONTH(F24)<7,\"Q2\",IF(MONTH(F24)<10,\"Q3\",\"Q4\"))))","v":"Q1"},{"$f":"CONCATENATE(G24,\" \",H24)","v":"2018 Q1"},0,null,null,{"$f":"ROUND(J24*L24/12,2)","v":0},{"$f":"K24+M24","v":0},null,null,{"$f":"P24","v":0}]
[null,"2018 Q2",1.89E-2,3.3500000000000002E-2,null,"2018-02-01",{"$f":"YEAR(F25)","v":2018},{"$f":"IF(MONTH(F25)=0,\"\",IF(MONTH(F25)<4,\"Q1\",IF(MONTH(F25)<7,\"Q2\",IF(MONTH(F25)<10,\"Q3\",\"Q4\"))))","v":"Q1"},{"$f":"CONCATENATE(G25,\" \",H25)","v":"2018 Q1"},{"$f":"J24+K24","v":0},null,null,{"$f":"ROUND(J25*L25/12,2)","v":0},{"$f":"N24+K25+M25","v":0},null,null,{"$f":"Q24+P25","v":0}]
[null,"2018 Q3",1.89E-2,3.3500000000000002E-2,null,"2018-03-01",2018,"Q1","2018 Q1",{"$f":"J25+K25","v":0},null,null,0,{"$f":"N25+K26+M26","v":0},null,null,{"$f":"Q25+P26","v":0}]
[null,"2018 Q4",2.1700000000000001E-2,3.3500000000000002E-2,null,"2018-04-01",2018,"Q2","2018 Q2",0,null,null,0,0,null,null,0]
[null,"2019 Q1",2.4500000000000001E-2,3.8199999999999998E-2,null,"2018-05-01",2018,"Q2","2018 Q2",0,null,null,0,0,null,null,0]
[null,"2019 Q2",2.18E-2,3.39E-2,null,"2018-06-01",2018,"Q2","2018 Q2",0,null,null,0,0,null,null,0]
[null,"2019 Q3",2.18E-2,2.8799999999999999E-2,null,"2018-07-01",2018,"Q3","2018 Q3",0,null,null,0,0,null,null,0]
{"$rows_left_out":102}
{"sheet":"8. Opex Interest Annual","index":7,"n_rows":42,"n_cols":14,"rows_kept":42,"cut":false,"hidden":false,"merged":[]}
[]
[]
[]
[]
[]
[]
[]
[]
[]
[]
[]
[]
[null,"This worksheet calculates the interest on amortization/depreciation expense, in the absence of monthly data."]
[]
[]
[null,"Sheet 8: Interest on Amortization (Annual Data) "]
[]
[]
[]
[]
[null,"Year",null,"OM&A",null,"Amortization Expense",null,"Cumulative OM&A and Amortization Expense",null,"Average Cumulative OM&A and Amortization Expense",null,"Average Annual Prescribed Interest Rate for Deferral and Variance Accounts (from Sheet 7)",null,"Simple Interest on OM&A and Amortization Expenses"]
[null,null,null,null,null,"(from Sheet 6)"]
[]
[null,2019,null,0,null,{"$f":"-'4. ICM_Assets_and_Rate_Base'!I357","v":130614.52226373838},null,{"$f":"H23+D24+F24","v":130614.52226373838},null,{"$f":"(H24+H23)/2","v":65307.261131869192},null,{"$f":"AVERAGE('7. Rate Rider Revs'!C28:C31)","v":2.2474999999999998E-2},null,{"$f":"J24*L24","v":1467.7806939387599}]
[null,2020,null,0,null,{"$f":"-'4. ICM_Assets_and_Rate_Base'!K357","v":130614.52226373838},null,{"$f":"H24+D25+F25","v":261229.04452747677},null,{"$f":"(H25+H24)/2","v":195921.78339560758},null,{"$f":"AVERAGE('7. Rate Rider Revs'!C32:C35)","v":1.3749999999999998E-2},null,{"$f":"J25*L25","v":2693.9245216896038}]
[null,2021,null,0,null,{"$f":"-'4. ICM_Assets_and_Rate_Base'!M357","v":130614.52226373838},null,391843.56679121515,null,326536.30565934593,null,{"$f":"AVERAGE('7. Rate Rider Revs'!C36:C39)","v":5.7000000000000002E-3},null,1861.2569422582719]
[null,2022,null,0,null,{"$f":"-'4. ICM_Assets_and_Rate_Base'!O357","v":130614.52226373838},null,522458.08905495354,null,457150.82792308438,null,{"$f":"AVERAGE('7. Rate Rider Revs'!C40:C43)","v":1.915E-2},null,8754.4383547270663]
[null,2023,null,0,null,{"$f":"-'4. ICM_Assets_and_Rate_Base'!Q357","v":130614.52226373838},null,653072.61131869187,null,587765.3501868227,null,{"$f":"AVERAGE('7. Rate Rider Revs'!C44:C47)","v":5.0449999999999995E-2},null,29652.761916925203]
[null,2024,null,0,null,{"$f":"-'4. ICM_Assets_and_Rate_Base'!S357","v":130614.52226373838},null,783687.13358243019,null,718379.87245056103,null,{"$f":"AVERAGE('7. Rate Rider Revs'!C48:C51)","v":5.1449999999999996E-2},null,36960.644437581359]
[null,2025,null,0,null,{"$f":"-'4. ICM_Assets_and_Rate_Base'!U357","v":134074.46870511907},null,917761.60228754929,null,850724.36793498974,null,{"$f":"AVERAGE('7. Rate Rider Revs'!C52:C55)","v":3.1550000000000002E-2},null,26840.353808348929]
{"$rows_left_out":13}
{"sheet":"9. IRR","index":8,"n_rows":31,"n_cols":26,"rows_kept":31,"cut":false,"hidden":false,"merged":[[13,1,13,27],[19,2,19,3]]}
[]
[]
[]
[]
[]
[]
[]
[]
[]
[]
[]
[]
[]
[null,"This worksheet calculates the ICM Incremental Revenue Requirement."]
[]
[]
[null,"Sheet 9: ICM Incremental Revenue Requirement"]
[null,null," "]
[]
[null,null,null,null,null,null,2018,null,2019,null,2020,null,2021,null,2022,null,2023,null,2024,null,2025,null,2026,null,null,"Total"]
[]
[null,null,"Deferred and forecasted ICM Incremental Revenue Requirement (from Sheet 6)",null,null,null,null,null,{"$f":"'6. ICMIRR '!$F$88/12*10","v":328204.31374064012},null,{"$f":"'6. ICMIRR '!$F$88","v":393845.17648876813},null,{"$f":"'6. ICMIRR '!$F$88","v":393845.17648876813},null,{"$f":"'6. ICMIRR '!$F$88","v":393845.17648876813},null,{"$f":"'6. ICMIRR '!$F$88","v":393845.17648876813},null,{"$f":"'6. ICMIRR '!$F$88","v":393845.17648876813},null,{"$f":"'6. ICMIRR '!$F$88","v":393845.17648876813},null,{"$f":"'6. ICMIRR '!$F$88","v":393845.17648876813},null,null,{"$f":"SUM(G22:W22)","v":3085120.5491620172}]
[]
[null,null,"Interest on Deferred and forecasted Amortization Expense (Sheet 8)",null,null,null,{"$f":"'8. Opex Interest Annual'!$N$23","v":0},null,{"$f":"'8. Opex Interest Annual'!$N$24","v":1467.7806939387599},null,{"$f":"'8. Opex Interest Annual'!$N$25","v":2693.9245216896038},null,{"$f":"'8. Opex Interest Annual'!$N$26","v":1861.2569422582719},null,{"$f":"'8. Opex Interest Annual'!$N$27","v":8754.4383547270663},null,{"$f":"'8. Opex Interest Annual'!$N$28","v":29652.761916925203},null,{"$f":"'8. Opex Interest Annual'!$N$29","v":36960.644437581359},null,{"$f":"'8. Opex Interest Annual'!$N$30","v":26840.353808348929},null,{"$f":"'8. Opex Interest Annual'!$N$31","v":25112.370334322775},null,null,{"$f":"SUM(G24:W24)","v":133343.53100979197}]
[]
[]
[null,null,"ICM Rate Rider Revenues (from Sheet 7)",null,null,null,{"$f":"SUM('7. Rate Rider Revs'!K24:K35)","v":0},null,{"$f":"SUM('7. Rate Rider Revs'!K36:K47)","v":556136.03999999992},null,{"$f":"SUM('7. Rate Rider Revs'!K48:K59)","v":655766.07999999996},null,{"$f":"SUM('7. Rate Rider Revs'!K60:K71)","v":652988.93000000017},null,{"$f":"SUM('7. Rate Rider Revs'!K72:K83)","v":654803.2699999999},null,{"$f":"SUM('7. Rate Rider Revs'!K84:K95)","v":650905.29999999993},null,{"$f":"SUM('7. Rate Rider Revs'!K96:K107)","v":655011.46000000008},null,{"$f":"SUM('7. Rate Rider Revs'!K108:K119)","v":662204.81000000006},null,{"$f":"SUM('7. Rate Rider Revs'!K120:K131)","v":658111.15753479442},null,null,{"$f":"SUM(G27:W27)","v":5145927.0475347936}]
[]
[null,null,"ICM Rate Rider Interest (from Sheet 7)",null,null,null,{"$f":"SUM('7. Rate Rider Revs'!M27:M35)","v":0},null,{"$f":"SUM('7. Rate Rider Revs'!M36:M47)","v":4504.6600000000008},null,{"$f":"SUM('7. Rate Rider Revs'!M48:M59)","v":10442.5},null,{"$f":"SUM('7. Rate Rider Revs'!M60:M71)","v":8592.7199999999993},null,{"$f":"SUM('7. Rate Rider Revs'!M72:M83)","v":43768.56},null,{"$f":"SUM('7. Rate Rider Revs'!M84:M95)","v":142579.61000000002},null,{"$f":"SUM('7. Rate Rider Revs'!M96:M107)","v":177795.59000000005},null,{"$f":"SUM('7. Rate Rider Revs'!M108:M119)","v":129706.73000000001},null,{"$f":"SUM('7. Rate Rider Revs'!M120:M131)","v":122094.76999999999},null,null,{"$f":"SUM(G29:W29)","v":639485.14000000013}]
[]
{"$rows_left_out":1}