{"text_format":"1","workbook":"xlsx","n_sheets":20,"sheets":["1. Info","2. Table of Contents","3. Data_Input_Sheet","Hidden_Data Input","4. Rate_Base","5. Utility Income","6. Taxes_PILs","7. Cost_of_Capital","8. Rev_Def_Suff","9. Rev_Reqt","Hidden Data_Rev Reqt","10. Load Forecast","11. Cost_Allocation","12. Res_Rate_Design","13. Rate Design","14. Tracking_Sheet","11. Cost_Allocation RSL","13. Rate Design RSL","15. Variance Tracking Sheet RSL","Sheet4"],"not_rendered":{"charts":0,"images":4,"macros":1,"external_links":2,"defined_names":79,"comments":4,"pivot_tables":0},"unopened":[],"bounds":{"document_bytes":16777216,"sheet_cells":100000,"rows_first":2000,"rows_last":500,"rows_between":2000,"halvings":0,"cell_chars":16384,"cell_head_chars":4096},"cells_cut":0,"cells_raw":0,"read":"whole","date_system":"1900"}

{"sheet":"1. Info","index":0,"n_rows":92,"n_cols":29,"rows_kept":92,"cut":false,"hidden":false,"merged":[[27,4,27,5],[29,4,29,5],[31,4,31,5],[27,6,27,10],[29,6,29,10],[31,6,31,10],[38,0,38,16],[35,1,35,3],[43,1,49,11],[0,2,1,12],[2,2,3,12],[35,4,35,9],[25,6,25,10],[21,1,21,2],[15,6,15,12],[17,6,17,10],[19,6,19,10],[21,6,21,10],[23,6,23,10],[23,1,23,2],[25,1,25,3],[36,0,36,16]]}
[null,null,null,null,null,null,null,null,null,null,null,null,null,null,null,null,null,null,null,null,null,null,null,null,null,null,"Revenue Requirement Workform\n(RRWF) for 2027 Filers\n",null,{"$f":"IF('3. Data_Input_Sheet'!M12=0, \"\", '3. Data_Input_Sheet'!M12)","v":"Interrogatory Responses"}]
[null,null,null,null,null,null,null,null,null,null,null,null,null,null,null,null,null,null,null,null,null,null,null,null,null,null,1.1000000000000001,null,{"$f":"IF('3. Data_Input_Sheet'!U12=0, \"\", '3. Data_Input_Sheet'!U12)","v":"Settlement Agreement"}]
[]
[]
[]
[]
[]
[]
[]
[]
[null,null,null,null,null,null,null,null,null,null,null,null,null,null,null,"Version",{"$f":"$AA$2","v":1.1000000000000001}]
[]
[]
[]
[]
[null,null,null,null,null,"Utility Name   ","Rideau St. Lawrence Distribution Inc."]
[]
[null,null,null,null,null,"Service Territory","Prescott Russel "]
[]
[null,null,null,null,null,"Assigned EB Number","EB-2026-0069",null,null,null,null,null,null,null,null,null,null,null,null,null,null,null,null,null,null,null,"Company Name"]
[null,null,null,null,null,null,null,null,null,null,null,null,null,null,null,null,null,null,null,null,null,null,null,null,null,1,"Alectra Utilities Corporation-Brampton Rate Zone"]
[null,null,null,null,null,"Name and Title","Simon Wu President CEO",null,null,null,null,null,null,null,null,null,null,null,null,null,null,null,null,null,null,2,"Alectra Utilities Corporation-Enersource Rate Zone"]
[null,null,null,null,null,null,null,null,null,null,null,null,null,null,null,null,null,null,null,null,null,null,null,null,null,3,"Alectra Utilities Corporation-Horizon Utilities Rate Zone"]
[null,null,null,null,null,"Phone Number   ","613-925-3851 phone ext. 5001",null,null,null,null,null,null,null,null,null,null,null,null,null,null,null,null,null,null,4,"Alectra Utilities Corporation-PowerStream Rate Zone"]
[null,null,null,null,null,null,null,null,null,null,null,null,null,null,null,null,null,null,null,null,null,null,null,null,null,5,"Alectra Utilities Corporation-Guelph Rate Zone"]
[null,null,null,null,null,"Email Address   ","swu@rslu.ca",null,null,null,null,null,null,null,null,null,null,null,null,null,null,null,null,null,null,6,"Algoma Power Inc."]
[null,null,null,null,null,null,null,null,null,null,null,null,null,null,null,null,null,null,null,null,null,null,null,null,null,7,"Atikokan Hydro Inc."]
[null,null,null,null,"Test Year",null,2027,null,null,null,null,null,null,null,null,null,null,null,null,null,null,null,null,null,null,8,"Bluewater Power Distribution Corporation"]
[null,null,null,null,null,null,null,null,null,null,null,null,null,null,null,null,null,null,null,null,null,null,null,null,null,9,"Burlington Hydro Inc."]
[null,null,null,null,"Bridge Year",null,2026,null,null,null,null,null,null,null,null,null,null,null,null,null,null,null,null,null,null,10,"Canadian Niagara Power Inc."]
[null,null,null,null,null,null,null,null,null,null,null,null,null,null,null,null,null,null,null,null,null,null,null,null,null,11,"Centre Wellington Hydro Ltd."]
[null,null,null,null,"Last Rebasing Year",null,2022,null,null,null,null,null,null,null,null,null,null,null,null,null,null,null,null,null,null,12,"Chapleau Public Utilities Corporation"]
[null,null,null,null,null,null,null,null,null,null,null,null,null,null,null,null,null,null,null,null,null,null,null,null,null,13,"Cooperative Hydro Embrun Inc."]
[null,null,null,null,null,null,null,null,null,null,null,null,null,null,null,null,null,null,null,null,null,null,null,null,null,14,"E.L.K. Energy Inc."]
[null,null,null,null,null,null,null,null,null,null,null,null,null,null,null,null,null,null,null,null,null,null,null,null,null,15,"Elexicon Energy Inc.-Whitby Rate Zone"]
[null,null,null,null,null,null,null,null,null,null,null,null,null,null,null,null,null,null,null,null,null,null,null,null,null,16,"Elexicon Energy Inc.-Veridian Rate Zone"]
["The RRWF has been enhanced commencing with 2017 rate applications to provide estimated base distribution rates.  The enhanced RRWF is not intended to replace a utility’s formal rate generator model which should continue to be the source of the proposed rates as well as the final ones at the conclusion of the proceeding. The load forecasting addition made to this model is intended to be demonstrative only and does not replace the information filed in the utility’s application. In an effort to minimize the incremental work required from utilities, the cost allocation and rate design additions to this model do in fact replace former appendices that were required to be filed as part of the cost of service (Chapter 2) filing requirements.",null,null,null,null,null,null,null,null,null,null,null,null,null,null,null,null,null,null,null,null,null,null,null,null,17,"Enova Power Corp.-Kitchener-Wilmot Hydro Rate Zone"]
[null,null,null,null,null,null,null,null,null,null,null,null,null,null,null,null,null,null,null,null,null,null,null,null,null,null,"Enova Power Corp.-Waterloo North Rate Zone"]
["Commencing with 2023 rate applications, the RRWF has been enhanced with an additional column, so that two stages of processing of an application (e.g. interrogatory responses and settlement agreement) between the initial application filing and the OEB decision and draft rate order (\"Per Board Decision\") can be used. Functionality of the RRWF is the same as in previous versions of the RRWF. (May 2022)",null,null,null,null,null,null,null,null,null,null,null,null,null,null,null,null,null,null,null,null,null,null,null,null,18,"Entegrus Powerlines Inc.-For Entegrus-Main Rate Zone"]
[null,null,null,null,null,null,null,null,null,null,null,null,null,null,null,null,null,null,null,null,null,null,null,null,null,19,"Entegrus Powerlines Inc.-For Former St. Thomas Energy Rate Zone"]
[null,null,null,null,null,null,null,null,null,null,null,null,null,null,null,null,null,null,null,null,null,null,null,null,null,20,"ENWIN Utilities Ltd."]
[null,null,null,null,null,null,null,null,null,null,null,null,null,null,null,null,null,null,null,null,null,null,null,null,null,21,"EPCOR Electricity Distribution Ontario Inc."]
[null,null,null,null,null,null,null,null,null,null,null,null,null,null,null,null,null,null,null,null,null,null,null,null,null,22,"ERTH Power Corporation - ERTH Power Main Rate Zone"]
[null,null,null,null,null,null,null,null,null,null,null,null,null,null,null,null,null,null,null,null,null,null,null,null,null,23,"ERTH POWER CORPORATION – GODERICH RATE ZONE"]
[null,null,null,null,null,null,null,null,null,null,null,null,null,null,null,null,null,null,null,null,null,null,null,null,null,24,"Espanola Regional Hydro Distribution Corporation"]
[null,null,null,null,null,null,null,null,null,null,null,null,null,null,null,null,null,null,null,null,null,null,null,null,null,25,"Essex Powerlines Corporation"]
[null,null,null,null,null,null,null,null,null,null,null,null,null,null,null,null,null,null,null,null,null,null,null,null,null,26,"Festival Hydro Inc."]
[null,null,null,null,null,null,null,null,null,null,null,null,null,null,null,null,null,null,null,null,null,null,null,null,null,27,"Fort Frances Power Corporation"]
[null,null,null,null,null,null,null,null,null,null,null,null,null,null,null,null,null,null,null,null,null,null,null,null,null,28,"GrandBridge Energy Inc.-Brantford Power Rate Zone "]
[null,null,null,null,null,null,null,null,null,null,null,null,null,null,null,null,null,null,null,null,null,null,null,null,null,29,"GrandBridge Energy Inc.-Energy+ Rate Zone "]
[null,null,null,null,null,null,null,null,null,null,null,null,null,null,null,null,null,null,null,null,null,null,null,null,null,30,"Greater Sudbury Hydro Inc."]
[null,null,null,null,null,null,null,null,null,null,null,null,null,null,null,null,null,null,null,null,null,null,null,null,null,31,"Grimsby Power Incorporated"]
[null,null,null,null,null,null,null,null,null,null,null,null,null,null,null,null,null,null,null,null,null,null,null,null,null,32,"Halton Hills Hydro Inc."]
[null,null,null,null,null,null,null,null,null,null,null,null,null,null,null,null,null,null,null,null,null,null,null,null,null,33,"Hearst Power Distribution Co. Ltd."]
[null,null,null,null,null,null,null,null,null,null,null,null,null,null,null,null,null,null,null,null,null,null,null,null,null,34,"Hydro 2000 Inc."]
[null,null,null,null,null,null,null,null,null,null,null,null,null,null,null,null,null,null,null,null,null,null,null,null,null,35,"Hydro Hawkesbury Inc."]
[null,null,null,null,null,null,null,null,null,null,null,null,null,null,null,null,null,null,null,null,null,null,null,null,null,36,"Hydro One Networks Inc."]
[null,null,null,null,null,null,null,null,null,null,null,null,null,null,null,null,null,null,null,null,null,null,null,null,null,37,"Hydro One Networks Inc.-Former Orillia Power Distribution Corporation Service Area"]
[null,null,null,null,null,null,null,null,null,null,null,null,null,null,null,null,null,null,null,null,null,null,null,null,null,38,"Hydro One Networks Inc.-Former Peterborough Distribution Inc. Service Area"]
[null,null,null,null,null,null,null,null,null,null,null,null,null,null,null,null,null,null,null,null,null,null,null,null,null,39,"Hydro One Networks Inc.-Former Haldimand County Hydro Inc. Service Area"]
[null,null,null,null,null,null,null,null,null,null,null,null,null,null,null,null,null,null,null,null,null,null,null,null,null,40,"Hydro One Networks Inc.-Former Norfolk Power Distribution Inc. Service Area"]
[null,null,null,null,null,null,null,null,null,null,null,null,null,null,null,null,null,null,null,null,null,null,null,null,null,41,"Hydro One Networks Inc.-Former Woodstock Hydro Services Inc. Service Area"]
[null,null,null,null,null,null,null,null,null,null,null,null,null,null,null,null,null,null,null,null,null,null,null,null,null,42,"Hydro One Remote Communites Inc."]
[null,null,null,null,null,null,null,null,null,null,null,null,null,null,null,null,null,null,null,null,null,null,null,null,null,43,"Hydro Ottawa Limited"]
[null,null,null,null,null,null,null,null,null,null,null,null,null,null,null,null,null,null,null,null,null,null,null,null,null,44,"InnPower Corporation"]
[null,null,null,null,null,null,null,null,null,null,null,null,null,null,null,null,null,null,null,null,null,null,null,null,null,45,"Kingston Hydro Corporation"]
[null,null,null,null,null,null,null,null,null,null,null,null,null,null,null,null,null,null,null,null,null,null,null,null,null,46,"Lakefront Utilities Inc."]
[null,null,null,null,null,null,null,null,null,null,null,null,null,null,null,null,null,null,null,null,null,null,null,null,null,47,"Lakeland Power Distribution Ltd."]
[null,null,null,null,null,null,null,null,null,null,null,null,null,null,null,null,null,null,null,null,null,null,null,null,null,48,"London Hydro Inc."]
[null,null,null,null,null,null,null,null,null,null,null,null,null,null,null,null,null,null,null,null,null,null,null,null,null,49,"Milton Hydro Distribution Inc."]
[null,null,null,null,null,null,null,null,null,null,null,null,null,null,null,null,null,null,null,null,null,null,null,null,null,50,"Newmarket-Tay Power Distribution Ltd.-For Former Midland Power Utility Rate Zone"]
[null,null,null,null,null,null,null,null,null,null,null,null,null,null,null,null,null,null,null,null,null,null,null,null,null,51,"Newmarket-Tay Power Distribution Ltd.-For Newmarket-Tay Power Main Rate Zone"]
[null,null,null,null,null,null,null,null,null,null,null,null,null,null,null,null,null,null,null,null,null,null,null,null,null,52,"Niagara Peninsula Energy Inc."]
[null,null,null,null,null,null,null,null,null,null,null,null,null,null,null,null,null,null,null,null,null,null,null,null,null,53,"Niagara-on-the-Lake Hydro Inc."]
[null,null,null,null,null,null,null,null,null,null,null,null,null,null,null,null,null,null,null,null,null,null,null,null,null,54,"North Bay Hydro Distribution Limited"]
[null,null,null,null,null,null,null,null,null,null,null,null,null,null,null,null,null,null,null,null,null,null,null,null,null,55,"Northern Ontario Wires Inc."]
[null,null,null,null,null,null,null,null,null,null,null,null,null,null,null,null,null,null,null,null,null,null,null,null,null,56,"Oakville Hydro Electricity Distribution Inc."]
[null,null,null,null,null,null,null,null,null,null,null,null,null,null,null,null,null,null,null,null,null,null,null,null,null,57,"Orangeville Hydro Limited"]
[null,null,null,null,null,null,null,null,null,null,null,null,null,null,null,null,null,null,null,null,null,null,null,null,null,58,"Oshawa PUC Networks Inc."]
[null,null,null,null,null,null,null,null,null,null,null,null,null,null,null,null,null,null,null,null,null,null,null,null,null,59,"Ottawa River Power Corporation"]
[null,null,null,null,null,null,null,null,null,null,null,null,null,null,null,null,null,null,null,null,null,null,null,null,null,60,"PUC Distribution Inc."]
[null,null,null,null,null,null,null,null,null,null,null,null,null,null,null,null,null,null,null,null,null,null,null,null,null,61,"Renfrew Hydro Inc."]
[null,null,null,null,null,null,null,null,null,null,null,null,null,null,null,null,null,null,null,null,null,null,null,null,null,62,"Rideau St. Lawrence Distribution Inc."]
[null,null,null,null,null,null,null,null,null,null,null,null,null,null,null,null,null,null,null,null,null,null,null,null,null,63,"Sioux Lookout Hydro Inc."]
[null,null,null,null,null,null,null,null,null,null,null,null,null,null,null,null,null,null,null,null,null,null,null,null,null,64,"Synergy North Corporation-Kenora Rate Zone"]
[null,null,null,null,null,null,null,null,null,null,null,null,null,null,null,null,null,null,null,null,null,null,null,null,null,65,"Synergy North Corporation-Thunder Bay Rate Zone "]
[null,null,null,null,null,null,null,null,null,null,null,null,null,null,null,null,null,null,null,null,null,null,null,null,null,66,"Tillsonburg Hydro Inc."]
[null,null,null,null,null,null,null,null,null,null,null,null,null,null,null,null,null,null,null,null,null,null,null,null,null,67,"Toronto Hydro-Electric System Limited"]
[null,null,null,null,null,null,null,null,null,null,null,null,null,null,null,null,null,null,null,null,null,null,null,null,null,68,"Wasaga Distribution Inc."]
[null,null,null,null,null,null,null,null,null,null,null,null,null,null,null,null,null,null,null,null,null,null,null,null,null,69,"Welland Hydro-Electric System Corp."]
[null,null,null,null,null,null,null,null,null,null,null,null,null,null,null,null,null,null,null,null,null,null,null,null,null,70,"Wellington North Power Inc."]
[null,null,null,null,null,null,null,null,null,null,null,null,null,null,null,null,null,null,null,null,null,null,null,null,null,71,"Westario Power Inc."]

{"sheet":"2. Table of Contents","index":1,"n_rows":29,"n_cols":9,"rows_kept":29,"cut":false,"hidden":false,"merged":[[28,1,28,7],[0,2,0,4],[1,3,1,6],[3,3,3,4],[26,1,26,7],[27,1,27,7]]}
[]
[]
[]
[]
[]
[]
[]
[]
[]
["Table of Contents"]
[]
[null,null,null,"1. Info",null,null,null,null,"8. Rev_Def_Suff"]
[]
[null,null,null,"2. Table of Contents",null,null,null,null,"9. Rev_Reqt"]
[]
[null,null,null,"3. Data_Input_Sheet",null,null,null,null,"10. Load Forecast"]
[]
[null,null,null,"4. Rate_Base",null,null,null,null,"11. Cost Allocation"]
[]
[null,null,null,"5. Utility Income",null,null,null,null,"12. Residential Rate Design - hidden. Contact OEB staff if needed."]
[]
[null,null,null,"6. Taxes_PILs",null,null,null,null,"13. Rate Design and Revenue Reconciliation"]
[]
[null,null,null,"7. Cost_of_Capital",null,null,null,null,"14. Tracking Sheet"]
[]
["Notes:"]
["(1)","Pale green cells represent inputs"]
["(2)","Pale green boxes at the bottom of each page are for additional notes"]
["(3)","Pale blue cells represent drop-down lists"]

{"sheet":"3. Data_Input_Sheet","index":2,"n_rows":79,"n_cols":31,"rows_kept":79,"cut":false,"hidden":false,"merged":[[80,2,80,30],[70,2,70,30],[71,2,71,30],[72,2,72,30],[73,2,73,30],[74,2,74,30],[75,2,75,30],[76,2,76,30],[77,2,77,30],[78,2,79,30],[0,2,0,12],[7,4,7,20],[3,2,3,10],[1,2,1,10],[2,2,2,10],[88,2,89,20],[86,2,86,30],[87,2,87,30],[81,2,81,30],[82,2,82,30],[83,2,83,30],[84,2,84,30],[85,2,85,30]]}
[null,null,null,null,null,null,null,null,null,null,null,null,null,null,null,null,null,null,null,null,{"$f":"CONCATENATE('2. Table of Contents'!$F$6,\" \",'2. Table of Contents'!$G$6)","v":" "}]
[]
[]
[]
[]
[]
[]
[]
[null,"Data Input Sheet"]
[]
[]
[null,null,null,null,"Initial Application",null,"(1)",null,{"$f":"IF(ISBLANK(M12),\"\",\"Adjustments\")","v":"Adjustments"},null,null,null,"Interrogatory Responses",null,"(5)",null,{"$f":"IF(ISBLANK(M12),\"\",\"Adjustments\")","v":"Adjustments"},null,null,null,"Settlement Agreement",null,"(5)",null,{"$f":"IF(ISBLANK(U12),\"\",\"Adjustments\")","v":"Adjustments"},null,null,null,"Per Board Decision"]
[]
[]
[null,1,"Rate Base"]
[null,null,"Gross Fixed Assets (average)",null,18899363.297337506,null,null,"(3)",{"$f":"IF(ISBLANK(M16),\"\",IF(ISBLANK(E16),\"\",M16-E16))","v":""},null,null,null,null,null,null,null,{"$f":"IF(ISBLANK(U16),\"\",IF(ISBLANK(M16),\"\",U16-M16))","v":""},null,null,null,null,null,null,null,{"$f":"IF(ISBLANK(AC16),\"\",IF(ISBLANK(U16),\"\",AC16-U16))","v":""}]
[null,null,"Accumulated Depreciation (average)",null,-4826714.3137500016,null,"(4)",null,{"$f":"IF(ISBLANK(M17),\"\",IF(ISBLANK(E17),\"\",M17-E17))","v":""},null,null,null,null,null,null,null,{"$f":"IF(ISBLANK(U17),\"\",IF(ISBLANK(M17),\"\",U17-M17))","v":""},null,null,null,null,null,null,null,{"$f":"IF(ISBLANK(AC17),\"\",IF(ISBLANK(U17),\"\",AC17-U17))","v":""}]
[null,null,"Allowance for Working Capital:"]
[null,null,"Controllable Expenses",null,3753312.9155929578,null,null,null,{"$f":"IF(ISBLANK(M19),\"\",IF(ISBLANK(E19),\"\",M19-E19))","v":""},null,null,null,null,null,null,null,{"$f":"IF(ISBLANK(U19),\"\",IF(ISBLANK(M19),\"\",U19-M19))","v":""},null,null,null,null,null,null,null,{"$f":"IF(ISBLANK(AC19),\"\",IF(ISBLANK(U19),\"\",AC19-U19))","v":""}]
[null,null,"Cost of Power",null,15887077.360779226,null,null,null,{"$f":"IF(ISBLANK(M20),\"\",IF(ISBLANK(E20),\"\",M20-E20))","v":""},null,null,null,null,null,null,null,{"$f":"IF(ISBLANK(U20),\"\",IF(ISBLANK(M20),\"\",U20-M20))","v":""},null,null,null,null,null,null,null,{"$f":"IF(ISBLANK(AC20),\"\",IF(ISBLANK(U20),\"\",AC20-U20))","v":""}]
[null,null,"Working Capital Rate (%)",null,7.4999999999999997E-2,null,"(8)",null,{"$f":"IF(ISBLANK(M21),\"\",IF(ISBLANK(E21),\"\",M21-E21))","v":""},null,null,null,null,null,"(8)",null,{"$f":"IF(ISBLANK(U21),\"\",IF(ISBLANK(M21),\"\",U21-M21))","v":""},null,null,null,null,null,"(8)",null,{"$f":"IF(ISBLANK(AC21),\"\",IF(ISBLANK(U21),\"\",AC21-U21))","v":""},null,null,null,null,null,"(8)"]
[]
[null,2,"Utility Income"]
[null,null,"Operating Revenues:"]
[null,null,"Distribution Revenue at Current Rates",null,4026602.8760559652,null,null,null,{"$f":"IF(ISBLANK(M25),\"\",IF(ISBLANK(E25),\"\",M25-E25))","v":""},null,null,null,null,null,null,null,{"$f":"IF(ISBLANK(U25),\"\",IF(ISBLANK(M25),\"\",U25-M25))","v":""},null,null,null,null,null,null,null,{"$f":"IF(ISBLANK(AC25),\"\",IF(ISBLANK(U25),\"\",AC25-U25))","v":""}]
[null,null,"Distribution Revenue at Proposed Rates",null,4959191.3521111663,null,null,null,{"$f":"IF(ISBLANK(M26),\"\",IF(ISBLANK(E26),\"\",M26-E26))","v":""},null,null,null,null,null,null,null,{"$f":"IF(ISBLANK(U26),\"\",IF(ISBLANK(M26),\"\",U26-M26))","v":""},null,null,null,null,null,null,null,{"$f":"IF(ISBLANK(AC26),\"\",IF(ISBLANK(U26),\"\",AC26-U26))","v":""}]
[null,null,"Other Revenue:"]
[null,null,"Miscellaneous Service Revenues",null,92845.201881000001,null,null,null,{"$f":"IF(ISBLANK(M28),\"\",IF(ISBLANK(E28),\"\",M28-E28))","v":""},null,null,null,null,null,null,null,{"$f":"IF(ISBLANK(U28),\"\",IF(ISBLANK(M28),\"\",U28-M28))","v":""},null,null,null,null,null,null,null,{"$f":"IF(ISBLANK(AC28),\"\",IF(ISBLANK(U28),\"\",AC28-U28))","v":""}]
[null,null,"Late Payment Charges",null,77582.036258999986,null,null,null,{"$f":"IF(ISBLANK(M29),\"\",IF(ISBLANK(E29),\"\",M29-E29))","v":""},null,null,null,null,null,null,null,{"$f":"IF(ISBLANK(U29),\"\",IF(ISBLANK(M29),\"\",U29-M29))","v":""},null,null,null,null,null,null,null,{"$f":"IF(ISBLANK(AC29),\"\",IF(ISBLANK(U29),\"\",AC29-U29))","v":""}]
[null,null,"Other Operating Revenues",null,196225.91315800001,null,null,null,{"$f":"IF(ISBLANK(M30),\"\",IF(ISBLANK(E30),\"\",M30-E30))","v":""},null,null,null,null,null,null,null,{"$f":"IF(ISBLANK(U30),\"\",IF(ISBLANK(M30),\"\",U30-M30))","v":""},null,null,null,null,null,null,null,{"$f":"IF(ISBLANK(AC30),\"\",IF(ISBLANK(U30),\"\",AC30-U30))","v":""}]
[null,null,"Other Income and Deductions",null,33652.893772000003,null,null,null,{"$f":"IF(ISBLANK(M31),\"\",IF(ISBLANK(E31),\"\",M31-E31))","v":""},null,null,null,null,null,null,null,{"$f":"IF(ISBLANK(U31),\"\",IF(ISBLANK(M31),\"\",U31-M31))","v":""},null,null,null,null,null,null,null,{"$f":"IF(ISBLANK(AC31),\"\",IF(ISBLANK(U31),\"\",AC31-U31))","v":""}]
[]
[null,null,null,"Total Revenue Offsets",400306.04506999999,null,"(6)",null,{"$f":"IF(ISBLANK(M33),\"\",IF(ISBLANK(E33),\"\",M33-E33))","v":""},null,null,null,null,null,null,null,{"$f":"IF(ISBLANK(U33),\"\",IF(ISBLANK(M33),\"\",U33-M33))","v":""},null,null,null,null,null,null,null,{"$f":"IF(ISBLANK(AC33),\"\",IF(ISBLANK(U33),\"\",AC33-U33))","v":""}]
[]
[null,null,"Operating Expenses:"]
[null,null,"OM+A Expenses",null,3718936.3182769576,null,null,null,{"$f":"IF(ISBLANK(M36),\"\",IF(ISBLANK(E36),\"\",M36-E36))","v":""},null,null,null,null,null,null,null,{"$f":"IF(ISBLANK(U36),\"\",IF(ISBLANK(M36),\"\",U36-M36))","v":""},null,null,null,null,null,null,null,{"$f":"IF(ISBLANK(AC36),\"\",IF(ISBLANK(U36),\"\",AC36-U36))","v":""}]
[null,null,"Depreciation/Amortization",null,685011.58,null,null,null,{"$f":"IF(ISBLANK(M37),\"\",IF(ISBLANK(E37),\"\",M37-E37))","v":""},null,null,null,null,null,null,null,"",null,null,null,null,null,null,null,""]
[null,null,"Property taxes",null,34376.597315999999,null,null,null,{"$f":"IF(ISBLANK(M38),\"\",IF(ISBLANK(E38),\"\",M38-E38))","v":""},null,null,null,null,null,null,null,"",null,null,null,null,null,null,null,""]
[null,null,"Capital taxes",null,null,null,null,null,null,null,null,null,null,null,null,null,"",null,null,null,null,null,null,null,""]
[null,null,"Other expenses",null,null,null,null,null,{"$f":"IF(ISBLANK(M40),\"\",IF(ISBLANK(E40),\"\",M40-E40))","v":""},null,null,null,null,null,null,null,"",null,null,null,null,null,null,null,""]
[]
[null,3,"Taxes/PILs"]
[null,null,"Taxable Income:"]
[null,null,null,"Adjustments required to arrive at taxable income",-619053.18719999993,null,"(2)",null,{"$f":"IF(ISBLANK(M44),\"\",IF(ISBLANK(E44),\"\",M44-E44))","v":""},null,null,null,null,null,null,null,{"$f":"IF(ISBLANK(U44),\"\",IF(ISBLANK(M44),\"\",U44-M44))","v":""},null,null,null,null,null,null,null,{"$f":"IF(ISBLANK(AC44),\"\",IF(ISBLANK(U44),\"\",AC44-U44))","v":""}]
[null,null,"Utility Income Taxes and Rates:"]
[null,null,"Income taxes (not grossed up)",null,0,null,null,null,{"$f":"IF(ISBLANK(M46),\"\",IF(ISBLANK(E46),\"\",M46-E46))","v":""},null,null,null,null,null,null,null,{"$f":"IF(ISBLANK(U46),\"\",IF(ISBLANK(M46),\"\",U46-M46))","v":""},null,null,null,null,null,null,null,{"$f":"IF(ISBLANK(AC46),\"\",IF(ISBLANK(U46),\"\",AC46-U46))","v":""}]
[null,null,"Income taxes (grossed up)",null,{"$f":"IF(ISBLANK(E46),\"\",E46/(1-SUM(E49:E50)))","v":0},null,null,null,null,null,null,null,{"$f":"IF(ISBLANK(M46),\"\",M46/(1-SUM(M49:M50)))","v":""},null,null,null,null,null,null,null,{"$f":"IF(ISBLANK(U46),\"\",U46/(1-SUM(U49:U50)))","v":""},null,null,null,null,null,null,null,{"$f":"IF(ISBLANK(AC46),\"\",AC46/(1-SUM(AC49:AC50)))","v":""}]
[null,null,"   Capital Taxes"]
[null,null,"Federal tax (%)",null,0.15000000000000002,null,null,null,{"$f":"IF(ISBLANK(M49),\"\",IF(ISBLANK(E49),\"\",M49-E49))","v":""},null,null,null,null,null,null,null,{"$f":"IF(ISBLANK(U49),\"\",IF(ISBLANK(M49),\"\",U49-M49))","v":""},null,null,null,null,null,null,null,{"$f":"IF(ISBLANK(AC49),\"\",IF(ISBLANK(U49),\"\",AC49-U49))","v":""}]
[null,null,"Provincial tax (%)",null,0.115,null,null,null,{"$f":"IF(ISBLANK(M50),\"\",IF(ISBLANK(E50),\"\",M50-E50))","v":""},null,null,null,null,null,null,null,{"$f":"IF(ISBLANK(U50),\"\",IF(ISBLANK(M50),\"\",U50-M50))","v":""},null,null,null,null,null,null,null,{"$f":"IF(ISBLANK(AC50),\"\",IF(ISBLANK(U50),\"\",AC50-U50))","v":""}]
[null,null,"Income Tax Credits",null,null,null,null,null,{"$f":"IF(ISBLANK(M51),\"\",IF(ISBLANK(E51),\"\",M51-E51))","v":""},null,null,null,null,null,null,null,{"$f":"IF(ISBLANK(U51),\"\",IF(ISBLANK(M51),\"\",U51-M51))","v":""},null,null,null,null,null,null,null,{"$f":"IF(ISBLANK(AC51),\"\",IF(ISBLANK(U51),\"\",AC51-U51))","v":""}]
[null,null,"   "]
[null,4,"Capitalization/Cost of Capital"]
[null,null,"Capital Structure:"]
[null,null,"Long-term debt (Notional) Capitalization Ratio (%)",null,0.15033514679669099,null,null,null,{"$f":"IF(ISBLANK(M55),\"\",IF(ISBLANK(E55),\"\",M55-E55))","v":""},null,null,null,null,null,null,null,{"$f":"IF(ISBLANK(U55),\"\",IF(ISBLANK(M55),\"\",U55-M55))","v":""},null,null,null,null,null,null,null,{"$f":"IF(ISBLANK(AC55),\"\",IF(ISBLANK(U55),\"\",AC55-U55))","v":""}]
[null,null,"Long-term debt (Actual) Capitalization Ratio (%)",null,0.40966485320330909,null,null,null,{"$f":"IF(ISBLANK(M56),\"\",IF(ISBLANK(E56),\"\",M56-E56))","v":""},null,null,null,null,null,null,null,{"$f":"IF(ISBLANK(U56),\"\",IF(ISBLANK(M56),\"\",U56-M56))","v":""},null,null,null,null,null,null,null,{"$f":"IF(ISBLANK(AC56),\"\",IF(ISBLANK(U56),\"\",AC56-U56))","v":""}]
[null,null,"Short-term debt Capitalization Ratio (%)",null,0.04,null,"(7)",null,{"$f":"IF(ISBLANK(M57),\"\",IF(ISBLANK(E57),\"\",M57-E57))","v":""},null,null,null,null,null,"(7)",null,{"$f":"IF(ISBLANK(U57),\"\",IF(ISBLANK(M57),\"\",U57-M57))","v":""},null,null,null,null,null,"(7)",null,{"$f":"IF(ISBLANK(AC57),\"\",IF(ISBLANK(U57),\"\",AC57-U57))","v":""},null,null,null,null,null,"(7)"]
[null,null,"Common Equity Capitalization Ratio (%)",null,0.4,null,null,null,{"$f":"IF(ISBLANK(M58),\"\",IF(ISBLANK(E58),\"\",M58-E58))","v":""},null,null,null,null,null,null,null,{"$f":"IF(ISBLANK(U58),\"\",IF(ISBLANK(M58),\"\",U58-M58))","v":""},null,null,null,null,null,null,null,{"$f":"IF(ISBLANK(AC58),\"\",IF(ISBLANK(U58),\"\",AC58-U58))","v":""}]
[null,null,"Prefered Shares Capitalization Ratio (%)",null,null,null,null,null,{"$f":"IF(ISBLANK(M59),\"\",IF(ISBLANK(E59),\"\",M59-E59))","v":""},null,null,null,null,null,null,null,{"$f":"IF(ISBLANK(U59),\"\",IF(ISBLANK(M59),\"\",U59-M59))","v":""},null,null,null,null,null,null,null,{"$f":"IF(ISBLANK(AC59),\"\",IF(ISBLANK(U59),\"\",AC59-U59))","v":""}]
[null,null,null,null,{"$f":"SUM(E55:E59)","v":1},null,null,null,null,null,null,null,{"$f":"SUM(M55:M59)","v":0},null,null,null,null,null,null,null,{"$f":"SUM(U55:U59)","v":0},null,null,null,null,null,null,null,{"$f":"SUM(AC55:AC59)","v":0}]
[null,null,null,null,{"$f":"IF(ISBLANK(E58),\"\",IF(SUM(E55:E59)=100%,\"\",\"Capital Structure must total 100%\"))","v":""},null,null,null,null,null,null,null,{"$f":"IF(ISBLANK(M58),\"\",IF(SUM(M55:M59)=100%,\"\",\"Capital Structure must total 100%\"))","v":""},null,null,null,null,null,null,null,{"$f":"IF(ISBLANK(U58),\"\",IF(SUM(U55:U59)=100%,\"\",\"Capital Structure must total 100%\"))","v":""},null,null,null,null,null,null,null,{"$f":"IF(ISBLANK(AC58),\"\",IF(SUM(AC55:AC59)=100%,\"\",\"Capital Structure must total 100%\"))","v":""}]
[null,null,"Cost of Capital"]
[null,null,"Long-term debt (Notional) Cost Rate (%)",null,3.8799792196551851E-2,null,null,null,{"$f":"IF(ISBLANK(M63),\"\",IF(ISBLANK(E63),\"\",M63-E63))","v":""},null,null,null,null,null,null,null,{"$f":"IF(ISBLANK(U63),\"\",IF(ISBLANK(M63),\"\",U63-M63))","v":""},null,null,null,null,null,null,null,{"$f":"IF(ISBLANK(AC63),\"\",IF(ISBLANK(U63),\"\",AC63-U63))","v":""}]
[null,null,"Long-term debt (Actual) Cost Rate (%)",null,3.8799792196551851E-2,null,null,null,{"$f":"IF(ISBLANK(M64),\"\",IF(ISBLANK(E64),\"\",M64-E64))","v":""},null,null,null,null,null,null,null,{"$f":"IF(ISBLANK(U64),\"\",IF(ISBLANK(M64),\"\",U64-M64))","v":""},null,null,null,null,null,null,null,{"$f":"IF(ISBLANK(AC64),\"\",IF(ISBLANK(U64),\"\",AC64-U64))","v":""}]
[null,null,"Short-term debt Cost Rate (%)",null,2.7199999999999998E-2,null,null,null,{"$f":"IF(ISBLANK(M65),\"\",IF(ISBLANK(E65),\"\",M65-E65))","v":""},null,null,null,null,null,null,null,{"$f":"IF(ISBLANK(U65),\"\",IF(ISBLANK(M65),\"\",U65-M65))","v":""},null,null,null,null,null,null,null,{"$f":"IF(ISBLANK(AC65),\"\",IF(ISBLANK(U65),\"\",AC65-U65))","v":""}]
[null,null,"Common Equity Cost Rate (%)",null,9.11E-2,null,null,null,{"$f":"IF(ISBLANK(M66),\"\",IF(ISBLANK(E66),\"\",M66-E66))","v":""},null,null,null,null,null,null,null,{"$f":"IF(ISBLANK(U66),\"\",IF(ISBLANK(M66),\"\",U66-M66))","v":""},null,null,null,null,null,null,null,{"$f":"IF(ISBLANK(AC66),\"\",IF(ISBLANK(U66),\"\",AC66-U66))","v":""}]
[null,null,"Prefered Shares Cost Rate (%)",null,null,null,null,null,{"$f":"IF(ISBLANK(M67),\"\",IF(ISBLANK(E67),\"\",M67-E67))","v":""},null,null,null,null,null,null,null,{"$f":"IF(ISBLANK(U67),\"\",IF(ISBLANK(M67),\"\",U67-M67))","v":""},null,null,null,null,null,null,null,{"$f":"IF(ISBLANK(AC67),\"\",IF(ISBLANK(U67),\"\",AC67-U67))","v":""}]
[]
[]
["Notes:"]
[null,"General","Data inputs are required on Sheets 3. Data from Sheet 3 will automatically complete calculations on sheets 4 through 9 (Rate Base through Revenue Requirement).  Sheets 4 through 9 do not require any inputs except for notes that the Applicant may wish to enter to support the results.  Pale green cells are available on sheets 4 through 9 to enter both footnotes beside key cells and the related text for the notes at the bottom of each sheet."]
[null,"(1)","Data in column E is for Application as originally filed.  For updated revenue requirement as a result of interrogatory responses, technical or settlement conferences, etc., use column M and Adjustments in column I"]
[null,"(2)","Net of addbacks and deductions to arrive at taxable income."]
[null,"(3)","Average of Gross Fixed Assets at beginning and end of the Test Year"]
[null,"(4)","Average of Accumulated Depreciation at the beginning and end of the Test Year.  Enter as a negative amount."]
[null,"(5)","Select option from drop-down list by clicking on cell M12 or U12.  This column allows for the application update reflecting the end of discovery or Argument-in-Chief.  Also, the outcome of any Settlement Process can be reflected. Beginning for 2023,two intermediate stages can be shown (e.g., Interrogatory Responses and Settlement Agreement)."]
[null,"(6)","Input total revenue offsets for deriving the base revenue requirement from the service revenue requirement. Enter a positive amount."]
[null,"(7)","4.0% unless an Applicant has proposed or been approved another amount."]
[null,"(8)","The default Working Capital Allowance factor is 7.5% (of Cost of Power plus controllable expenses), per the letter issued by the Board on June 3, 2015.  Alternatively, a WCA factor based on lead-lag study with supporting rationale could be provided. Some Applicants may have a unique rate as a result of a lead-lag study.  The default rate for cost of service applications is 7.5%, per the letter issued by the Board on June 3, 2015."]

{"sheet":"Hidden_Data Input","index":3,"n_rows":30,"n_cols":9,"rows_kept":30,"cut":false,"hidden":true,"merged":[]}
["Utility Name","EB Number","Test Year","Bridge Year","Last Rebasing Year","Data Elements","Heading","Intital Application","Per Board Decision"]
[{"$f":"'1. Info'!$G$16","v":"Rideau St. Lawrence Distribution Inc."},{"$f":"'1. Info'!$G$20","v":"EB-2026-0069"},{"$f":"'1. Info'!$G$28","v":2027},{"$f":"'1. Info'!$G$30","v":2026},{"$f":"'1. Info'!$G$32","v":2022},"Gross Fixed Assets (average)","Rate Base",{"$f":"'3. Data_Input_Sheet'!E16","v":18899363.297337506},{"$f":"'3. Data_Input_Sheet'!U16","v":0}]
[{"$f":"'1. Info'!$G$16","v":"Rideau St. Lawrence Distribution Inc."},{"$f":"'1. Info'!$G$20","v":"EB-2026-0069"},{"$f":"'1. Info'!$G$28","v":2027},{"$f":"'1. Info'!$G$30","v":2026},{"$f":"'1. Info'!$G$32","v":2022},"Accumulated Depreciation (average)","Rate Base",{"$f":"'3. Data_Input_Sheet'!E17","v":-4826714.3137500016},{"$f":"'3. Data_Input_Sheet'!U17","v":0}]
[{"$f":"'1. Info'!$G$16","v":"Rideau St. Lawrence Distribution Inc."},{"$f":"'1. Info'!$G$20","v":"EB-2026-0069"},{"$f":"'1. Info'!$G$28","v":2027},{"$f":"'1. Info'!$G$30","v":2026},{"$f":"'1. Info'!$G$32","v":2022},"Controllable Expenses","Allowance for Working Capital",{"$f":"'3. Data_Input_Sheet'!E19","v":3753312.9155929578},{"$f":"'3. Data_Input_Sheet'!U19","v":0}]
[{"$f":"'1. Info'!$G$16","v":"Rideau St. Lawrence Distribution Inc."},{"$f":"'1. Info'!$G$20","v":"EB-2026-0069"},{"$f":"'1. Info'!$G$28","v":2027},{"$f":"'1. Info'!$G$30","v":2026},{"$f":"'1. Info'!$G$32","v":2022},"Cost of Power","Allowance for Working Capital",{"$f":"'3. Data_Input_Sheet'!E20","v":15887077.360779226},{"$f":"'3. Data_Input_Sheet'!U20","v":0}]
[{"$f":"'1. Info'!$G$16","v":"Rideau St. Lawrence Distribution Inc."},{"$f":"'1. Info'!$G$20","v":"EB-2026-0069"},{"$f":"'1. Info'!$G$28","v":2027},{"$f":"'1. Info'!$G$30","v":2026},{"$f":"'1. Info'!$G$32","v":2022},"Working Capital Rate (%)","Allowance for Working Capital",{"$f":"'3. Data_Input_Sheet'!E21","v":7.4999999999999997E-2},{"$f":"'3. Data_Input_Sheet'!U21","v":0}]
[{"$f":"'1. Info'!$G$16","v":"Rideau St. Lawrence Distribution Inc."},{"$f":"'1. Info'!$G$20","v":"EB-2026-0069"},{"$f":"'1. Info'!$G$28","v":2027},{"$f":"'1. Info'!$G$30","v":2026},{"$f":"'1. Info'!$G$32","v":2022},"Distribution Revenue at Current Rates","Utility Income",{"$f":"'3. Data_Input_Sheet'!E25","v":4026602.8760559652},{"$f":"'3. Data_Input_Sheet'!U25","v":0}]
[{"$f":"'1. Info'!$G$16","v":"Rideau St. Lawrence Distribution Inc."},{"$f":"'1. Info'!$G$20","v":"EB-2026-0069"},{"$f":"'1. Info'!$G$28","v":2027},{"$f":"'1. Info'!$G$30","v":2026},{"$f":"'1. Info'!$G$32","v":2022},"Distribution Revenue at Proposed Rates","Utility Income",{"$f":"'3. Data_Input_Sheet'!E26","v":4959191.3521111663},{"$f":"'3. Data_Input_Sheet'!U26","v":0}]
[{"$f":"'1. Info'!$G$16","v":"Rideau St. Lawrence Distribution Inc."},{"$f":"'1. Info'!$G$20","v":"EB-2026-0069"},{"$f":"'1. Info'!$G$28","v":2027},{"$f":"'1. Info'!$G$30","v":2026},{"$f":"'1. Info'!$G$32","v":2022},"Specific Service Charges","Other Revenue",{"$f":"'3. Data_Input_Sheet'!E28","v":92845.201881000001},{"$f":"'3. Data_Input_Sheet'!U28","v":0}]
[{"$f":"'1. Info'!$G$16","v":"Rideau St. Lawrence Distribution Inc."},{"$f":"'1. Info'!$G$20","v":"EB-2026-0069"},{"$f":"'1. Info'!$G$28","v":2027},{"$f":"'1. Info'!$G$30","v":2026},{"$f":"'1. Info'!$G$32","v":2022},"Late Payment Charges","Other Revenue",{"$f":"'3. Data_Input_Sheet'!E29","v":77582.036258999986},{"$f":"'3. Data_Input_Sheet'!U29","v":0}]
[{"$f":"'1. Info'!$G$16","v":"Rideau St. Lawrence Distribution Inc."},{"$f":"'1. Info'!$G$20","v":"EB-2026-0069"},{"$f":"'1. Info'!$G$28","v":2027},{"$f":"'1. Info'!$G$30","v":2026},{"$f":"'1. Info'!$G$32","v":2022},"Other Distribution Revenue","Other Revenue",{"$f":"'3. Data_Input_Sheet'!E30","v":196225.91315800001},{"$f":"'3. Data_Input_Sheet'!U30","v":0}]
[{"$f":"'1. Info'!$G$16","v":"Rideau St. Lawrence Distribution Inc."},{"$f":"'1. Info'!$G$16","v":"Rideau St. Lawrence Distribution Inc."},{"$f":"'1. Info'!$G$16","v":"Rideau St. Lawrence Distribution Inc."},{"$f":"'1. Info'!$G$16","v":"Rideau St. Lawrence Distribution Inc."},{"$f":"'1. Info'!$G$16","v":"Rideau St. Lawrence Distribution Inc."},"Other Income and Deductions","Other Revenue",{"$f":"'3. Data_Input_Sheet'!E31","v":33652.893772000003},{"$f":"'3. Data_Input_Sheet'!U31","v":0}]
[{"$f":"'1. Info'!$G$16","v":"Rideau St. Lawrence Distribution Inc."},{"$f":"'1. Info'!$G$16","v":"Rideau St. Lawrence Distribution Inc."},{"$f":"'1. Info'!$G$16","v":"Rideau St. Lawrence Distribution Inc."},{"$f":"'1. Info'!$G$16","v":"Rideau St. Lawrence Distribution Inc."},{"$f":"'1. Info'!$G$16","v":"Rideau St. Lawrence Distribution Inc."},"Total Revenue Offsets","Other Revenue",{"$f":"'3. Data_Input_Sheet'!E33","v":400306.04506999999},{"$f":"'3. Data_Input_Sheet'!U33","v":0}]
[{"$f":"'1. Info'!$G$16","v":"Rideau St. Lawrence Distribution Inc."},{"$f":"'1. Info'!$G$20","v":"EB-2026-0069"},{"$f":"'1. Info'!$G$28","v":2027},{"$f":"'1. Info'!$G$30","v":2026},{"$f":"'1. Info'!$G$32","v":2022},"OM+A Expenses","Operating Expenses",{"$f":"'3. Data_Input_Sheet'!E36","v":3718936.3182769576},{"$f":"'3. Data_Input_Sheet'!U36","v":0}]
[{"$f":"'1. Info'!$G$16","v":"Rideau St. Lawrence Distribution Inc."},{"$f":"'1. Info'!$G$20","v":"EB-2026-0069"},{"$f":"'1. Info'!$G$28","v":2027},{"$f":"'1. Info'!$G$30","v":2026},{"$f":"'1. Info'!$G$32","v":2022},"Depreciation/Amortization","Operating Expenses",{"$f":"'3. Data_Input_Sheet'!E37","v":685011.58},{"$f":"'3. Data_Input_Sheet'!U37","v":0}]
[{"$f":"'1. Info'!$G$16","v":"Rideau St. Lawrence Distribution Inc."},{"$f":"'1. Info'!$G$20","v":"EB-2026-0069"},{"$f":"'1. Info'!$G$28","v":2027},{"$f":"'1. Info'!$G$30","v":2026},{"$f":"'1. Info'!$G$32","v":2022},"Property taxes","Operating Expenses",{"$f":"'3. Data_Input_Sheet'!E38","v":34376.597315999999},{"$f":"'3. Data_Input_Sheet'!U38","v":0}]
[{"$f":"'1. Info'!$G$16","v":"Rideau St. Lawrence Distribution Inc."},{"$f":"'1. Info'!$G$20","v":"EB-2026-0069"},{"$f":"'1. Info'!$G$28","v":2027},{"$f":"'1. Info'!$G$30","v":2026},{"$f":"'1. Info'!$G$32","v":2022},"Other expenses","Operating Expenses",{"$f":"'3. Data_Input_Sheet'!E40","v":0},{"$f":"'3. Data_Input_Sheet'!U40","v":0}]
[{"$f":"'1. Info'!$G$16","v":"Rideau St. Lawrence Distribution Inc."},{"$f":"'1. Info'!$G$20","v":"EB-2026-0069"},{"$f":"'1. Info'!$G$28","v":2027},{"$f":"'1. Info'!$G$30","v":2026},{"$f":"'1. Info'!$G$32","v":2022},"Adjustments required to arrive at taxable income","Taxable Income",{"$f":"'3. Data_Input_Sheet'!E44","v":-619053.18719999993},{"$f":"'3. Data_Input_Sheet'!U44","v":0}]
[{"$f":"'1. Info'!$G$16","v":"Rideau St. Lawrence Distribution Inc."},{"$f":"'1. Info'!$G$20","v":"EB-2026-0069"},{"$f":"'1. Info'!$G$28","v":2027},{"$f":"'1. Info'!$G$30","v":2026},{"$f":"'1. Info'!$G$32","v":2022},"Income taxes (not grossed up)","Utility Income Taxes",{"$f":"'3. Data_Input_Sheet'!E46","v":0},{"$f":"'3. Data_Input_Sheet'!U46","v":0}]
[{"$f":"'1. Info'!$G$16","v":"Rideau St. Lawrence Distribution Inc."},{"$f":"'1. Info'!$G$20","v":"EB-2026-0069"},{"$f":"'1. Info'!$G$28","v":2027},{"$f":"'1. Info'!$G$30","v":2026},{"$f":"'1. Info'!$G$32","v":2022},"Federal tax (%)","Income taxes (grossed up)",{"$f":"'3. Data_Input_Sheet'!E49","v":0.15000000000000002},{"$f":"'3. Data_Input_Sheet'!U49","v":0}]
[{"$f":"'1. Info'!$G$16","v":"Rideau St. Lawrence Distribution Inc."},{"$f":"'1. Info'!$G$20","v":"EB-2026-0069"},{"$f":"'1. Info'!$G$28","v":2027},{"$f":"'1. Info'!$G$30","v":2026},{"$f":"'1. Info'!$G$32","v":2022},"Provincial tax (%)","Income taxes (grossed up)",{"$f":"'3. Data_Input_Sheet'!E50","v":0.115},{"$f":"'3. Data_Input_Sheet'!U50","v":0}]
[{"$f":"'1. Info'!$G$16","v":"Rideau St. Lawrence Distribution Inc."},{"$f":"'1. Info'!$G$20","v":"EB-2026-0069"},{"$f":"'1. Info'!$G$28","v":2027},{"$f":"'1. Info'!$G$30","v":2026},{"$f":"'1. Info'!$G$32","v":2022},"Income Tax Credits","Income taxes (grossed up)",{"$f":"'3. Data_Input_Sheet'!E51","v":0},{"$f":"'3. Data_Input_Sheet'!U51","v":0}]
[{"$f":"'1. Info'!$G$16","v":"Rideau St. Lawrence Distribution Inc."},{"$f":"'1. Info'!$G$20","v":"EB-2026-0069"},{"$f":"'1. Info'!$G$28","v":2027},{"$f":"'1. Info'!$G$30","v":2026},{"$f":"'1. Info'!$G$32","v":2022},"Long-term debt Capitalization Ratio (%)","Capitalization",{"$f":"'3. Data_Input_Sheet'!E55","v":0.15033514679669099},{"$f":"'3. Data_Input_Sheet'!U55","v":0}]
[{"$f":"'1. Info'!$G$16","v":"Rideau St. Lawrence Distribution Inc."},{"$f":"'1. Info'!$G$20","v":"EB-2026-0069"},{"$f":"'1. Info'!$G$28","v":2027},{"$f":"'1. Info'!$G$30","v":2026},{"$f":"'1. Info'!$G$32","v":2022},"Short-term debt Capitalization Ratio (%)","Capitalization",{"$f":"'3. Data_Input_Sheet'!E57","v":0.04},{"$f":"'3. Data_Input_Sheet'!U57","v":0}]
[{"$f":"'1. Info'!$G$16","v":"Rideau St. Lawrence Distribution Inc."},{"$f":"'1. Info'!$G$20","v":"EB-2026-0069"},{"$f":"'1. Info'!$G$28","v":2027},{"$f":"'1. Info'!$G$30","v":2026},{"$f":"'1. Info'!$G$32","v":2022},"Common Equity Capitalization Ratio (%)","Capitalization",{"$f":"'3. Data_Input_Sheet'!E58","v":0.4},{"$f":"'3. Data_Input_Sheet'!U58","v":0}]
[{"$f":"'1. Info'!$G$16","v":"Rideau St. Lawrence Distribution Inc."},{"$f":"'1. Info'!$G$20","v":"EB-2026-0069"},{"$f":"'1. Info'!$G$28","v":2027},{"$f":"'1. Info'!$G$30","v":2026},{"$f":"'1. Info'!$G$32","v":2022},"Prefered Shares Capitalization Ratio (%)","Capitalization",{"$f":"'3. Data_Input_Sheet'!E59","v":0},{"$f":"'3. Data_Input_Sheet'!U59","v":0}]
[{"$f":"'1. Info'!$G$16","v":"Rideau St. Lawrence Distribution Inc."},{"$f":"'1. Info'!$G$20","v":"EB-2026-0069"},{"$f":"'1. Info'!$G$28","v":2027},{"$f":"'1. Info'!$G$30","v":2026},{"$f":"'1. Info'!$G$32","v":2022},"Long-term debt Cost Rate (%)","Cost of Capital",{"$f":"'3. Data_Input_Sheet'!E63","v":3.8799792196551851E-2},{"$f":"'3. Data_Input_Sheet'!U63","v":0}]
[{"$f":"'1. Info'!$G$16","v":"Rideau St. Lawrence Distribution Inc."},{"$f":"'1. Info'!$G$20","v":"EB-2026-0069"},{"$f":"'1. Info'!$G$28","v":2027},{"$f":"'1. Info'!$G$30","v":2026},{"$f":"'1. Info'!$G$32","v":2022},"Short-term debt Cost Rate (%)","Cost of Capital",{"$f":"'3. Data_Input_Sheet'!E65","v":2.7199999999999998E-2},{"$f":"'3. Data_Input_Sheet'!U65","v":0}]
[{"$f":"'1. Info'!$G$16","v":"Rideau St. Lawrence Distribution Inc."},{"$f":"'1. Info'!$G$20","v":"EB-2026-0069"},{"$f":"'1. Info'!$G$28","v":2027},{"$f":"'1. Info'!$G$30","v":2026},{"$f":"'1. Info'!$G$32","v":2022},"Common Equity Cost Rate (%)","Cost of Capital",{"$f":"'3. Data_Input_Sheet'!E66","v":9.11E-2},{"$f":"'3. Data_Input_Sheet'!U66","v":0}]
[{"$f":"'1. Info'!$G$16","v":"Rideau St. Lawrence Distribution Inc."},{"$f":"'1. Info'!$G$20","v":"EB-2026-0069"},{"$f":"'1. Info'!$G$28","v":2027},{"$f":"'1. Info'!$G$30","v":2026},{"$f":"'1. Info'!$G$32","v":2022},"Prefered Shares Cost Rate (%)","Cost of Capital",{"$f":"'3. Data_Input_Sheet'!E67","v":0},{"$f":"'3. Data_Input_Sheet'!U67","v":0}]

{"sheet":"4. Rate_Base","index":4,"n_rows":35,"n_cols":29,"rows_kept":35,"cut":false,"hidden":false,"merged":[[41,3,41,28],[2,2,2,6],[3,2,3,6],[0,2,0,10],[1,2,1,22],[32,1,32,22],[21,3,21,22],[36,3,36,28],[37,3,37,28],[38,3,38,28],[39,3,39,28],[40,3,40,28],[33,3,33,28],[34,3,34,28],[35,3,35,28]]}
[]
[]
[]
[]
[]
[null,"Rate Base and Working Capital"]
[]
[]
[]
[null,null,null,"Rate Base"]
[null,"Line No.",null,"Particulars",null,null,"Initial Application",null,null,null,{"$f":"IF(ISBLANK('3. Data_Input_Sheet'!M12),\"\",'3. Data_Input_Sheet'!I12)","v":"Adjustments"},null,null,null,{"$f":"IF(ISBLANK('3. Data_Input_Sheet'!M12),\" \",'3. Data_Input_Sheet'!M12)","v":"Interrogatory Responses"},null,null,null,{"$f":"IF(ISBLANK('3. Data_Input_Sheet'!Q12),\"\",'3. Data_Input_Sheet'!Q12)","v":"Adjustments"},null,null,null,{"$f":"IF(ISBLANK('3. Data_Input_Sheet'!U12),\" \",'3. Data_Input_Sheet'!U12)","v":"Settlement Agreement"},null,{"$f":"IF(ISBLANK('3. Data_Input_Sheet'!Y12),\"\",'3. Data_Input_Sheet'!Y12)","v":"Adjustments"},null,null,null,{"$f":"IF(ISBLANK('3. Data_Input_Sheet'!AC12),\" \",'3. Data_Input_Sheet'!AC12)","v":"Per Board Decision"}]
[]
[null,1,null,"Gross Fixed Assets (average)","(2)",null,{"$f":"IFERROR('3. Data_Input_Sheet'!E16,0)","v":18899363.297337506},null,null,null,{"$f":"IFERROR('3. Data_Input_Sheet'!I16,0)","v":""},null,null,null,{"$f":"IFERROR('3. Data_Input_Sheet'!M16,0)","v":0},null,null,null,{"$f":"'3. Data_Input_Sheet'!Q16","v":""},null,null,null,{"$f":"IFERROR('3. Data_Input_Sheet'!U16,0)","v":0},null,{"$f":"'3. Data_Input_Sheet'!Y16","v":""},null,null,null,{"$f":"IFERROR('3. Data_Input_Sheet'!AC16,0)","v":0}]
[null,2,null,"Accumulated Depreciation (average)","(2)",null,{"$f":"IFERROR('3. Data_Input_Sheet'!E17,0)","v":-4826714.3137500016},null,null,null,{"$f":"IFERROR('3. Data_Input_Sheet'!I17,0)","v":""},null,null,null,{"$f":"IFERROR('3. Data_Input_Sheet'!M17,0)","v":0},null,null,null,{"$f":"'3. Data_Input_Sheet'!Q17","v":""},null,null,null,{"$f":"IFERROR('3. Data_Input_Sheet'!U17,0)","v":0},null,{"$f":"'3. Data_Input_Sheet'!Y17","v":""},null,null,null,{"$f":"IFERROR('3. Data_Input_Sheet'!AC17,0)","v":0}]
[null,3,null,"Net Fixed Assets (average)","(2)",null,{"$f":"IFERROR(SUM(G13:G14),0)","v":14072648.983587503},null,null,null,{"$f":"IFERROR(SUM(K13:K14),0)","v":0},null,null,null,{"$f":"SUM(O13:O14)","v":0},null,null,null,{"$f":"IFERROR(SUM(S13:S14),0)","v":0},null,null,null,{"$f":"IFERROR(SUM(W13:W14),0)","v":0},null,{"$f":"IFERROR(SUM(Y13:Y14),0)","v":0},null,null,null,{"$f":"IFERROR(SUM(AC13:AC14),0)","v":0}]
[]
[null,4,null,"Allowance for Working Capital","(1)",null,{"$f":"IFERROR(G30,0)","v":1473029.2707279136},null,null,null,{"$f":"IFERROR(K30,0)","v":-1473029.2707279136},null,null,null,{"$f":"IFERROR(O30,0)","v":0},null,null,null,{"$f":"IFERROR(S30,0)","v":0},null,null,null,{"$f":"IFERROR(W30,0)","v":0},null,{"$f":"IFERROR(Y30,0)","v":0},null,null,null,{"$f":"IFERROR(AC30,0)","v":0}]
[]
[null,5,null,"Total Rate Base",null,null,{"$f":"IFERROR(G17+G15,0)","v":15545678.254315417},null,null,null,{"$f":"IFERROR(K17+K15,0)","v":-1473029.2707279136},null,null,null,{"$f":"IFERROR(O17+O15,0)","v":0},null,null,null,{"$f":"IFERROR(S17+S15,0)","v":0},null,null,null,{"$f":"IFERROR(W15+W17,0)","v":0},null,{"$f":"IFERROR(Y17+Y15,0)","v":0},null,null,null,{"$f":"IFERROR(AC15+AC17,0)","v":0}]
[null,null,"(1)","Allowance for Working Capital - Derivation"]
[]
[]
[]
[null,6,null,"Controllable Expenses",null,null,{"$f":"IFERROR('3. Data_Input_Sheet'!E19,0)","v":3753312.9155929578},null,null,null,{"$f":"'3. Data_Input_Sheet'!I19","v":""},null,null,null,{"$f":"IFERROR('3. Data_Input_Sheet'!M19,0)","v":0},null,null,null,{"$f":"'3. Data_Input_Sheet'!Q19","v":""},null,null,null,{"$f":"IFERROR('3. Data_Input_Sheet'!U19,0)","v":0},null,{"$f":"'3. Data_Input_Sheet'!Y19","v":""},null,null,null,{"$f":"IFERROR('3. Data_Input_Sheet'!AC19,0)","v":0}]
[null,7,null,"Cost of Power",null,null,{"$f":"IFERROR('3. Data_Input_Sheet'!E20,0)","v":15887077.360779226},null,null,null,{"$f":"'3. Data_Input_Sheet'!I20","v":""},null,null,null,{"$f":"IFERROR('3. Data_Input_Sheet'!M20,0)","v":0},null,null,null,{"$f":"'3. Data_Input_Sheet'!Q20","v":""},null,null,null,{"$f":"IFERROR('3. Data_Input_Sheet'!U20,0)","v":0},null,{"$f":"'3. Data_Input_Sheet'!Y20","v":""},null,null,null,{"$f":"IFERROR('3. Data_Input_Sheet'!AC20,0)","v":0}]
[null,8,null,"Working Capital Base",null,null,{"$f":"IFERROR(SUM(G24:G25),0)","v":19640390.276372183},null,null,null,{"$f":"IFERROR(K24+K25,0)","v":0},null,null,null,{"$f":"SUM(O24:O25)","v":0},null,null,null,{"$f":"IFERROR(S24+S25,0)","v":0},null,null,null,{"$f":"IFERROR(SUM(W24:W25),0)","v":0},null,{"$f":"IFERROR(Y24+Y25,0)","v":0},null,null,null,{"$f":"IFERROR(SUM(AC24:AC25),0)","v":0}]
[]
[null,9,null,"Working Capital Rate % ","(1)",null,{"$f":"IFERROR('3. Data_Input_Sheet'!E21,0)","v":7.4999999999999997E-2},null,null,null,{"$f":"IFERROR(O28-G28,0)","v":-7.4999999999999997E-2},null,null,null,{"$f":"IFERROR('3. Data_Input_Sheet'!M21,0)","v":0},null,null,null,{"$f":"IFERROR(W28-O28,0)","v":0},null,null,null,{"$f":"IFERROR('3. Data_Input_Sheet'!U21,0)","v":0},null,{"$f":"IFERROR(AC28-W28,0)","v":0},null,null,null,{"$f":"IFERROR('3. Data_Input_Sheet'!AC21,0)","v":0}]
[]
[null,10,null,"Working Capital Allowance",null,null,{"$f":"IFERROR(G26*G28,0)","v":1473029.2707279136},null,null,null,{"$f":"IFERROR(O30-G30,0)","v":-1473029.2707279136},null,null,null,{"$f":"IFERROR(O26*O28,0)","v":0},null,null,null,{"$f":"IFERROR(W30-O30,0)","v":0},null,null,null,{"$f":"IFERROR(W26*W28,0)","v":0},null,{"$f":"IFERROR(AC30-W30,0)","v":0},null,null,null,{"$f":"IFERROR(AC26*AC28,0)","v":0}]
[]
[]
[null,"Notes"]
[null,"(1)",null,"Some Applicants may have a unique rate as a result of a lead-lag study.  The default rate for cost of service applications is 7.5%, per the letter issued by the OEB on June 3, 2015. "]
[null,"(2)",null,"Average of opening and closing balances for the year."]

{"sheet":"5. Utility Income","index":5,"n_rows":51,"n_cols":30,"rows_kept":51,"cut":false,"hidden":false,"merged":[[0,2,0,11],[2,2,2,7],[3,2,3,7],[1,2,1,21],[17,21,18,21],[17,13,18,13],[17,17,18,17],[7,5,7,21],[17,5,18,5],[17,9,18,9],[26,9,27,9],[34,21,35,21],[34,5,35,5],[36,21,37,21],[36,5,37,5],[36,17,37,17],[34,9,35,9],[36,9,37,9],[26,5,27,5],[26,21,27,21],[26,13,27,13],[34,13,35,13],[26,17,27,17],[34,17,35,17],[17,25,18,25],[17,29,18,29],[26,25,27,25],[26,29,27,29],[34,25,35,25],[34,29,35,29],[36,25,37,25],[36,29,37,29],[47,25,48,25],[47,29,48,29],[51,3,51,29],[47,9,48,9],[47,13,48,13],[47,17,48,17],[47,5,48,5],[47,21,48,21],[41,1,41,21],[36,13,37,13],[50,1,50,21],[52,3,52,29],[53,3,53,29],[54,3,54,29],[55,3,55,29],[56,3,56,29]]}
[]
[]
[]
[]
[]
[]
[]
[]
[]
[]
[null,"Utility Income"]
[]
[null,"Line No.",null,"Particulars                                ",null,"Initial Application   ",null,null,null,{"$f":"IF(N13=\"\",\"\",\"Adjustments\")","v":"Adjustments"},null,null,null,{"$f":"IF(ISBLANK('3. Data_Input_Sheet'!M12),\"\",'3. Data_Input_Sheet'!M12)","v":"Interrogatory Responses"},null,null,null,{"$f":"IF(N13=\"\",\"\",\"Adjustments\")","v":"Adjustments"},null,null,null,{"$f":"IF(ISBLANK('3. Data_Input_Sheet'!U12),\"\",'3. Data_Input_Sheet'!U12)","v":"Settlement Agreement"},null,null,null,{"$f":"IF(V13=\"\",\"\",\"Adjustments\")","v":"Adjustments"},null,null,null,{"$f":"'3. Data_Input_Sheet'!AC12","v":"Per Board Decision"}]
[]
[null,null,null,"Operating Revenues:"]
[null,1,null,"Distribution Revenue (at Proposed Rates)",null,{"$f":"'3. Data_Input_Sheet'!E26","v":4959191.3521111663},null,null,null,{"$f":"N16-F16","v":-4959191.3521111663},null,null,null,{"$f":"'3. Data_Input_Sheet'!M26","v":0},null,null,null,{"$f":"V16-N16","v":0},null,null,null,{"$f":"'3. Data_Input_Sheet'!U26","v":0},null,null,null,{"$f":"AD16-V16","v":0},null,null,null,{"$f":"'3. Data_Input_Sheet'!AC26","v":0}]
[null,2,null,"Other Revenue","(1)",{"$f":"F48","v":400306.04506999999},null,null,null,{"$f":"N17-F17","v":-400306.04506999999},null,null,null,{"$f":"N48","v":0},null,null,null,{"$f":"V17-N17","v":0},null,null,null,{"$f":"V48","v":0},null,null,null,{"$f":"AD17-V17","v":0},null,null,null,{"$f":"AD48","v":0}]
[null,null,null,null,null,{"$f":"SUM(F16:F17)","v":5359497.3971811663},null,null,null,{"$f":"SUM(J16:J17)","v":-5359497.3971811663},null,null,null,{"$f":"SUM(N16:N17)","v":0},null,null,null,{"$f":"SUM(R16:R17)","v":0},null,null,null,{"$f":"SUM(V16:V17)","v":0},null,null,null,{"$f":"SUM(Z16:Z17)","v":0},null,null,null,{"$f":"SUM(AD16:AD17)","v":0}]
[null,3,null,"Total Operating Revenues"]
[]
[null,null,null,"Operating Expenses:"]
[null,4,null,"OM+A Expenses",null,{"$f":"'3. Data_Input_Sheet'!E36","v":3718936.3182769576},null,null,null,{"$f":"'3. Data_Input_Sheet'!I36","v":""},null,null,null,{"$f":"'3. Data_Input_Sheet'!M36","v":0},null,null,null,{"$f":"'3. Data_Input_Sheet'!Q36","v":""},null,null,null,{"$f":"'3. Data_Input_Sheet'!U36","v":0},null,null,null,{"$f":"'3. Data_Input_Sheet'!Y36","v":""},null,null,null,{"$f":"'3. Data_Input_Sheet'!AC36","v":0}]
[null,5,null,"Depreciation/Amortization",null,{"$f":"'3. Data_Input_Sheet'!E37","v":685011.58},null,null,null,{"$f":"'3. Data_Input_Sheet'!I37","v":""},null,null,null,{"$f":"'3. Data_Input_Sheet'!M37","v":0},null,null,null,{"$f":"'3. Data_Input_Sheet'!Q37","v":""},null,null,null,{"$f":"'3. Data_Input_Sheet'!U37","v":0},null,null,null,{"$f":"'3. Data_Input_Sheet'!Y37","v":""},null,null,null,{"$f":"'3. Data_Input_Sheet'!AC37","v":0}]
[null,6,null,"Property taxes",null,{"$f":"'3. Data_Input_Sheet'!E38","v":34376.597315999999},null,null,null,{"$f":"'3. Data_Input_Sheet'!I38","v":""},null,null,null,{"$f":"'3. Data_Input_Sheet'!M38","v":0},null,null,null,{"$f":"'3. Data_Input_Sheet'!Q38","v":""},null,null,null,{"$f":"'3. Data_Input_Sheet'!U38","v":0},null,null,null,{"$f":"'3. Data_Input_Sheet'!Y38","v":""},null,null,null,{"$f":"'3. Data_Input_Sheet'!AC38","v":0}]
[null,7,null,"Capital taxes",null,{"$f":"'6. Taxes_PILs'!G25","v":0},null,null,null,{"$f":"N25-F25","v":0},null,null,null,{"$f":"'6. Taxes_PILs'!K25","v":0},null,null,null,{"$f":"V25-N25","v":0},null,null,null,{"$f":"'6. Taxes_PILs'!O25","v":0},null,null,null,{"$f":"AD25-V25","v":0},null,null,null,{"$f":"'6. Taxes_PILs'!W25","v":0}]
[null,8,null,"Other expense",null,{"$f":"'3. Data_Input_Sheet'!E40","v":0},null,null,null,{"$f":"'3. Data_Input_Sheet'!I40","v":""},null,null,null,{"$f":"'3. Data_Input_Sheet'!M40","v":0},null,null,null,{"$f":"'3. Data_Input_Sheet'!Q40","v":""},null,null,null,{"$f":"'3. Data_Input_Sheet'!U40","v":0},null,null,null,{"$f":"'3. Data_Input_Sheet'!Y40","v":""},null,null,null,{"$f":"'3. Data_Input_Sheet'!AC40","v":0}]
[null,null,null,null,null,{"$f":"SUM(F22:F26)","v":4438324.4955929574},null,null,null,{"$f":"SUM(J22:J26)","v":0},null,null,null,{"$f":"SUM(N22:N26)","v":0},null,null,null,{"$f":"SUM(R22:R26)","v":0},null,null,null,{"$f":"SUM(V22:V26)","v":0},null,null,null,{"$f":"SUM(Z22:Z26)","v":0},null,null,null,{"$f":"SUM(AD22:AD26)","v":0}]
[null,9,null,"Subtotal (lines 4 to 8)"]
[]
[null,10,null,"Deemed Interest Expense",null,{"$f":"'7. Cost_of_Capital'!P20","v":354688.38600095536},null,null,null,{"$f":"N30-F30","v":-354688.38600095536},null,null,null,{"$f":"'7. Cost_of_Capital'!P37","v":0},null,null,null,{"$f":"V30-N30","v":0},null,null,null,{"$f":"'7. Cost_of_Capital'!P54","v":0},null,null,null,{"$f":"AD30-V30","v":0},null,null,null,{"$f":"'7. Cost_of_Capital'!P71","v":0}]
[]
[null,11,null,"Total Expenses (lines 9 to 10)",null,{"$f":"F27+F30","v":4793012.8815939128},null,null,null,{"$f":"J30+J27","v":-354688.38600095536},null,null,null,{"$f":"N30+N27","v":0},null,null,null,{"$f":"R30+R27","v":0},null,null,null,{"$f":"V27+V30","v":0},null,null,null,{"$f":"Z30+Z27","v":0},null,null,null,{"$f":"AD27+AD30","v":0}]
[]
[null,12,null,"Utility income before income taxes",null,{"$f":"F18-(F32)","v":566484.5155872535},null,null,null,{"$f":"J18-(J32)","v":-5004809.0111802109},null,null,null,{"$f":"N18-(N32)","v":0},null,null,null,{"$f":"R18-(R32)","v":0},null,null,null,{"$f":"V18-(V32)","v":0},null,null,null,{"$f":"Z18-(Z32)","v":0},null,null,null,{"$f":"AD18-(AD32)","v":0}]
[null,null,null,null,null,{"$f":"'6. Taxes_PILs'!G31","v":0},null,null,null,{"$f":"N35-F35","v":0},null,null,null,{"$f":"'6. Taxes_PILs'!K31","v":0},null,null,null,{"$f":"V35-N35","v":0},null,null,null,{"$f":"IF('6. Taxes_PILs'!O31=0,N35,'6. Taxes_PILs'!O31)","v":0},null,null,null,{"$f":"AD35-V35","v":0},null,null,null,{"$f":"IF('6. Taxes_PILs'!S31=0,V35,'6. Taxes_PILs'!S31)","v":0}]
[null,13,null,"Income taxes (grossed-up)"]
[null,null,null,null,null,{"$f":"F34-F35","v":566484.5155872535},null,null,null,{"$f":"J34-J35","v":-5004809.0111802109},null,null,null,{"$f":"N34-N35","v":0},null,null,null,{"$f":"R34-R35","v":0},null,null,null,{"$f":"V34-V35","v":0},null,null,null,{"$f":"Z34-Z35","v":0},null,null,null,{"$f":"AD34-AD35","v":0}]
[null,14,null,"Utility net income"]
[]
[]
[]
[]
[]
[null,"(1)",null,"  Specific Service Charges",null,{"$f":"'3. Data_Input_Sheet'!E28","v":92845.201881000001},null,null,null,{"$f":"'3. Data_Input_Sheet'!I28","v":""},null,null,null,{"$f":"'3. Data_Input_Sheet'!M28","v":0},null,null,null,{"$f":"'3. Data_Input_Sheet'!Q28","v":""},null,null,null,{"$f":"IF(ISBLANK('3. Data_Input_Sheet'!U28),N44,'3. Data_Input_Sheet'!U28)","v":0},null,null,null,{"$f":"'3. Data_Input_Sheet'!Y28","v":""},null,null,null,{"$f":"IF(ISBLANK('3. Data_Input_Sheet'!AC28),V44,'3. Data_Input_Sheet'!AC28)","v":0}]
[null,null,null,"  Late Payment Charges",null,{"$f":"'3. Data_Input_Sheet'!E29","v":77582.036258999986},null,null,null,{"$f":"'3. Data_Input_Sheet'!I29","v":""},null,null,null,{"$f":"'3. Data_Input_Sheet'!M29","v":0},null,null,null,{"$f":"'3. Data_Input_Sheet'!Q29","v":""},null,null,null,{"$f":"IF(ISBLANK('3. Data_Input_Sheet'!U29),N45,'3. Data_Input_Sheet'!U29)","v":0},null,null,null,{"$f":"'3. Data_Input_Sheet'!Y29","v":""},null,null,null,{"$f":"IF(ISBLANK('3. Data_Input_Sheet'!AC29),V45,'3. Data_Input_Sheet'!AC29)","v":0}]
[null,null,null,"  Other Distribution Revenue",null,{"$f":"'3. Data_Input_Sheet'!E30","v":196225.91315800001},null,null,null,{"$f":"'3. Data_Input_Sheet'!I30","v":""},null,null,null,{"$f":"'3. Data_Input_Sheet'!M30","v":0},null,null,null,{"$f":"'3. Data_Input_Sheet'!Q30","v":""},null,null,null,{"$f":"IF(ISBLANK('3. Data_Input_Sheet'!U30),N46,'3. Data_Input_Sheet'!U30)","v":0},null,null,null,{"$f":"'3. Data_Input_Sheet'!Y30","v":""},null,null,null,{"$f":"IF(ISBLANK('3. Data_Input_Sheet'!AC30),V46,'3. Data_Input_Sheet'!AC30)","v":0}]
[null,null,null,"  Other Income and Deductions",null,{"$f":"'3. Data_Input_Sheet'!E31","v":33652.893772000003},null,null,null,{"$f":"'3. Data_Input_Sheet'!I31","v":""},null,null,null,{"$f":"'3. Data_Input_Sheet'!M31","v":0},null,null,null,{"$f":"'3. Data_Input_Sheet'!Q31","v":""},null,null,null,{"$f":"IF(ISBLANK('3. Data_Input_Sheet'!U31),N47,'3. Data_Input_Sheet'!U31)","v":0},null,null,null,{"$f":"'3. Data_Input_Sheet'!Y31","v":""},null,null,null,{"$f":"IF(ISBLANK('3. Data_Input_Sheet'!AC31),V47,'3. Data_Input_Sheet'!AC31)","v":0}]
[null,null,null,null,null,{"$f":"SUM(F44:F47)","v":400306.04506999999},null,null,null,{"$f":"SUM(J44:J47)","v":0},null,null,null,{"$f":"SUM(N44:N47)","v":0},null,null,null,{"$f":"SUM(R44:R47)","v":0},null,null,null,{"$f":"SUM(V44:V47)","v":0},null,null,null,{"$f":"SUM(Z44:Z47)","v":0},null,null,null,{"$f":"SUM(AD44:AD47)","v":0}]
[null,null,null,"Total Revenue Offsets"]
[]
[null,"Notes"]

{"sheet":"6. Taxes_PILs","index":6,"n_rows":45,"n_cols":19,"rows_kept":45,"cut":false,"hidden":false,"merged":[[52,3,52,20],[25,10,26,10],[44,3,44,14],[49,3,49,20],[50,3,50,20],[51,3,51,20],[25,18,26,18],[45,3,45,20],[46,3,46,20],[48,3,48,20],[0,3,0,12],[2,2,2,6],[3,2,3,6],[1,2,1,14],[43,1,43,14],[8,1,8,12],[25,6,26,6],[25,14,26,14],[15,3,15,4],[17,3,17,4],[19,3,19,4],[32,3,32,4]]}
[]
[]
[]
[]
[]
[]
[]
[]
[null,"Taxes/PILs"]
[]
[]
[null,"Line No.",null,"Particulars ",null,null,"Application",null,null,null,{"$f":"IF(ISBLANK('3. Data_Input_Sheet'!M12),\"\",'3. Data_Input_Sheet'!M12)","v":"Interrogatory Responses"},null,null,null,{"$f":"IF(ISBLANK('3. Data_Input_Sheet'!U12),\"\",'3. Data_Input_Sheet'!U12)","v":"Settlement Agreement"},null,null,null,{"$f":"'3. Data_Input_Sheet'!AC12","v":"Per Board Decision"}]
[]
[null,null,null,"Determination of Taxable Income"]
[]
[null,1,null,"Utility net income before taxes",null,null,{"$f":"'7. Cost_of_Capital'!P23","v":566484.51558725385},null,null,null,{"$f":"'7. Cost_of_Capital'!P40","v":0},null,null,null,{"$f":"'7. Cost_of_Capital'!P57","v":0},null,null,null,{"$f":"'7. Cost_of_Capital'!P74","v":0}]
[]
[null,2,null,"Adjustments required to arrive at taxable utility income",null,null,{"$f":"'3. Data_Input_Sheet'!E44","v":-619053.18719999993},null,null,null,{"$f":"'3. Data_Input_Sheet'!M44","v":0},null,null,null,{"$f":"'3. Data_Input_Sheet'!U44","v":0},null,null,null,{"$f":"'3. Data_Input_Sheet'!AC44","v":0}]
[]
[null,3,null,"Taxable income",null,null,{"$f":"G16+G18","v":-52568.671612746082},null,null,null,{"$f":"K16+K18","v":0},null,null,null,{"$f":"O16+O18","v":0},null,null,null,{"$f":"S16+S18","v":0}]
[]
[null,null,null,"Calculation of Utility income Taxes"]
[]
[null,4,null,"Income taxes",null,null,{"$f":"'3. Data_Input_Sheet'!E46","v":0},null,null,null,{"$f":"IF(ISBLANK('3. Data_Input_Sheet'!M46),'6. Taxes_PILs'!G24,'3. Data_Input_Sheet'!M46)","v":0},null,null,null,{"$f":"IF(ISBLANK('3. Data_Input_Sheet'!U46),'6. Taxes_PILs'!K24,'3. Data_Input_Sheet'!U46)","v":0},null,null,null,{"$f":"IF(ISBLANK('3. Data_Input_Sheet'!AC46),'6. Taxes_PILs'!O24,'3. Data_Input_Sheet'!AC46)","v":0}]
[null,5,null,"Capital taxes",null,null,{"$f":"'3. Data_Input_Sheet'!E48","v":0},null,null,null,{"$f":"IF(ISBLANK('3. Data_Input_Sheet'!M48),'6. Taxes_PILs'!G25,'3. Data_Input_Sheet'!M48)","v":0},null,null,null,{"$f":"IF(ISBLANK('3. Data_Input_Sheet'!U48),'6. Taxes_PILs'!K25,'3. Data_Input_Sheet'!U48)","v":0},null,null,null,{"$f":"IF(ISBLANK('3. Data_Input_Sheet'!Y48),'6. Taxes_PILs'!O25,'3. Data_Input_Sheet'!Y48)","v":0}]
[null,null,null,null,null,null,{"$f":"SUM(G24:G25)","v":0},null,null,null,{"$f":"SUM(K24:K25)","v":0},null,null,null,{"$f":"SUM(O24:O25)","v":0},null,null,null,{"$f":"SUM(S24:S25)","v":0}]
[null,6,null,"Total taxes"]
[]
[null,7,null,"Gross-up of Income Taxes",null,null,{"$f":"(G24/(1-G41))-G24","v":0},null,null,null,{"$f":"(K24/(1-K41))-K24","v":0},null,null,null,{"$f":"(O24/(1-O41))-O24","v":0},null,null,null,{"$f":"(S24/(1-S41))-S24","v":0}]
[]
[null,8,null,"Grossed-up Income Taxes",null,null,{"$f":"G24+G29","v":0},null,null,null,{"$f":"K24+K29","v":0},null,null,null,{"$f":"O24+O29","v":0},null,null,null,{"$f":"S24+S29","v":0}]
[]
[null,9,null,"PILs / tax Allowance (Grossed-up Income taxes + Capital taxes)",null,null,{"$f":"G26+G29","v":0},null,null,null,{"$f":"K29+K26","v":0},null,null,null,{"$f":"O29+O26","v":0},null,null,null,{"$f":"S29+S26","v":0}]
[]
[null,10,null,"Other tax Credits",null,null,{"$f":"'3. Data_Input_Sheet'!E51","v":0},null,null,null,{"$f":"IF(ISBLANK('3. Data_Input_Sheet'!M51),G35,'3. Data_Input_Sheet'!M51)","v":0},null,null,null,{"$f":"IF(ISBLANK('3. Data_Input_Sheet'!U51),K35,'3. Data_Input_Sheet'!U51)","v":0},null,null,null,{"$f":"IF(ISBLANK('3. Data_Input_Sheet'!AC51),O35,'3. Data_Input_Sheet'!AC51)","v":0}]
[]
[null,null,null,"Tax Rates"]
[]
[null,11,null,"Federal tax (%)",null,null,{"$f":"'3. Data_Input_Sheet'!E49","v":0.15000000000000002},null,null,null,{"$f":"IF(ISBLANK('3. Data_Input_Sheet'!M49),G39,'3. Data_Input_Sheet'!M49)","v":0.15000000000000002},null,null,null,{"$f":"IF(ISBLANK('3. Data_Input_Sheet'!U49),K39,'3. Data_Input_Sheet'!U49)","v":0.15000000000000002},null,null,null,{"$f":"IF(ISBLANK('3. Data_Input_Sheet'!AC49),O39,'3. Data_Input_Sheet'!AC49)","v":0.15000000000000002}]
[null,12,null,"Provincial tax (%)",null,null,{"$f":"'3. Data_Input_Sheet'!E50","v":0.115},null,null,null,{"$f":"IF(ISBLANK('3. Data_Input_Sheet'!M50),G40,'3. Data_Input_Sheet'!M50)","v":0.115},null,null,null,{"$f":"IF(ISBLANK('3. Data_Input_Sheet'!U50),K40,'3. Data_Input_Sheet'!U50)","v":0.115},null,null,null,{"$f":"IF(ISBLANK('3. Data_Input_Sheet'!AC50),O40,'3. Data_Input_Sheet'!AC50)","v":0.115}]
[null,13,null,"Total tax rate (%)",null,null,{"$f":"G39+G40","v":0.26500000000000001},null,null,null,{"$f":"K39+K40","v":0.26500000000000001},null,null,null,{"$f":"O39+O40","v":0.26500000000000001},null,null,null,{"$f":"S39+S40","v":0.26500000000000001}]
[]
[]
[null,"Notes"]
[null,null,null,"Capital Taxes not applicable after July 1, 2010 (i.e. for 2011 and later test years)"]

{"sheet":"7. Cost_of_Capital","index":7,"n_rows":81,"n_cols":16,"rows_kept":81,"cut":false,"hidden":false,"merged":[[13,3,13,15],[30,3,30,15],[46,5,46,9],[29,5,29,9],[86,3,86,15],[80,1,80,15],[47,3,47,15],[63,5,63,9],[64,3,64,15],[87,3,87,15],[85,3,85,15],[82,3,82,15],[83,3,83,15],[84,3,84,15],[0,2,0,13],[2,2,2,13],[3,2,3,9],[1,2,1,17],[12,5,12,9],[4,1,4,13],[10,5,10,9]]}
[]
[]
[]
[]
[null,"Capitalization/Cost of Capital"]
[]
[]
[]
[]
[]
[null,"Line No.",null,"Particulars",null,"Capitalization Ratio",null,null,null,null,null,"Cost Rate",null,null,null,"Return"]
[]
[null,null,null,null,null,"Initial Application"]
[]
[null,null,null,null,null,"(%)",null,null,null,"($)",null,"(%)",null,null,null,"($)"]
[null,null,null,"Debt"]
[null,1,null,"  Long-term Debt (Notional)",null,{"$f":"'3. Data_Input_Sheet'!E55","v":0.15033514679669099},null,null,null,{"$f":"$J$27*F17","v":2337061.8224166352},null,{"$f":"'3. Data_Input_Sheet'!E63","v":3.8799792196551851E-2},null,null,null,{"$f":"L17*J17","v":90677.513060260215}]
[null,2,null,"  Long-term Debt (Actual)",null,{"$f":"'3. Data_Input_Sheet'!E56","v":0.40966485320330909},null,null,null,{"$f":"$J$27*F18","v":6368518},null,{"$f":"'3. Data_Input_Sheet'!E64","v":3.8799792196551851E-2},null,null,null,{"$f":"L18*J18","v":247097.17499999999}]
[null,3,null,"  Short-term Debt",null,{"$f":"'3. Data_Input_Sheet'!E57","v":0.04},null,null,null,{"$f":"$J$27*F19","v":621827.13017261669},null,{"$f":"'3. Data_Input_Sheet'!E65","v":2.7199999999999998E-2},null,null,null,{"$f":"L19*J19","v":16913.697940695172}]
[null,4,null,"Total Debt",null,{"$f":"SUM(F17:F19)","v":0.60000000000000009},null,null,null,{"$f":"SUM(J17:J19)","v":9327406.9525892511},null,{"$f":"IF(F20=0,0,SUMPRODUCT(F17:F19,L17:L19)/F20)","v":3.8026472716781723E-2},null,null,null,{"$f":"SUM(P17:P19)","v":354688.38600095536}]
[]
[null,null,null,"Equity"]
[null,5,null,"  Common Equity",null,{"$f":"'3. Data_Input_Sheet'!E58","v":0.4},null,null,null,{"$f":"$J$27*F23","v":6218271.3017261671},null,{"$f":"'3. Data_Input_Sheet'!E66","v":9.11E-2},null,null,null,{"$f":"L23*J23","v":566484.51558725385}]
[null,6,null,"  Preferred Shares",null,{"$f":"'3. Data_Input_Sheet'!E59","v":0},null,null,null,{"$f":"$J$27*F24","v":0},null,{"$f":"'3. Data_Input_Sheet'!E67","v":0},null,null,null,{"$f":"L24*J24","v":0}]
[null,7,null,"Total Equity",null,{"$f":"SUM(F23:F24)","v":0.4},null,null,null,{"$f":"SUM(J23:J24)","v":6218271.3017261671},null,{"$f":"IF(F25=0,0,SUMPRODUCT(F23:F24,L23:L24)/F25)","v":9.11E-2},null,null,null,{"$f":"SUM(P23:P24)","v":566484.51558725385}]
[]
[null,8,null,"Total",null,{"$f":"SUM(F20,F25)","v":1},null,null,null,{"$f":"'4. Rate_Base'!G19","v":15545678.254315417},null,{"$f":"(L20*F20)+(L25*F25)","v":5.9255883630069034E-2},null,null,null,{"$f":"P20+P25","v":921172.90158820921}]
[]
[]
[null,null,null,null,null,{"$f":"'1. Info'!AC1","v":"Interrogatory Responses"}]
[]
[null,null,null,null,null,"(%)",null,null,null,"($)",null,"(%)",null,null,null,"($)"]
[null,null,null,"Debt"]
[null,1,null,"  Long-term Debt (Notional)",null,{"$f":"'3. Data_Input_Sheet'!M55","v":0},null,null,null,{"$f":"$J$44*F34","v":0},null,{"$f":"'3. Data_Input_Sheet'!M63","v":0},null,null,null,{"$f":"L34*J34","v":0}]
[null,2,null,"  Long-term Debt (Actual)",null,{"$f":"'3. Data_Input_Sheet'!M56","v":0},null,null,null,{"$f":"$J$44*F35","v":0},null,{"$f":"'3. Data_Input_Sheet'!M64","v":0},null,null,null,{"$f":"L35*J35","v":0}]
[null,3,null,"  Short-term Debt",null,{"$f":"'3. Data_Input_Sheet'!M57","v":0},null,null,null,{"$f":"$J$44*F36","v":0},null,{"$f":"'3. Data_Input_Sheet'!M65","v":0},null,null,null,{"$f":"L36*J36","v":0}]
[null,4,null,"Total Debt",null,{"$f":"SUM(F34:F36)","v":0},null,null,null,{"$f":"SUM(J34:J36)","v":0},null,{"$f":"IF(F37=0,0,SUMPRODUCT(F34:F36,L34:L36)/F37)","v":0},null,null,null,{"$f":"SUM(P34:P36)","v":0}]
[]
[null,null,null,"Equity"]
[null,5,null,"  Common Equity",null,{"$f":"'3. Data_Input_Sheet'!M58","v":0},null,null,null,{"$f":"$J$44*F40","v":0},null,{"$f":"'3. Data_Input_Sheet'!M66","v":0},null,null,null,{"$f":"L40*J40","v":0}]
[null,6,null,"  Preferred Shares",null,{"$f":"'3. Data_Input_Sheet'!M59","v":0},null,null,null,{"$f":"$J$44*F41","v":0},null,{"$f":"'3. Data_Input_Sheet'!M67","v":0},null,null,null,{"$f":"L41*J41","v":0}]
[null,7,null,"Total Equity",null,{"$f":"SUM(F40:F41)","v":0},null,null,null,{"$f":"SUM(J40:J41)","v":0},null,{"$f":"IF(F42=0,0,SUMPRODUCT(F40:F41,L40:L41)/F42)","v":0},null,null,null,{"$f":"SUM(P40:P41)","v":0}]
[]
[null,8,null,"Total",null,{"$f":"F37+F42","v":0},null,null,null,{"$f":"'4. Rate_Base'!O19","v":0},null,{"$f":"(L37*F37)+(L42*F42)","v":0},null,null,null,{"$f":"P37+P42","v":0}]
[]
[]
[null,null,null,null,null,{"$f":"'1. Info'!AC2","v":"Settlement Agreement"}]
[]
[null,null,null,null,null,"(%)",null,null,null,"($)",null,"(%)",null,null,null,"($)"]
[null,null,null,"Debt"]
[null,1,null,"  Long-term Debt (Notional)",null,{"$f":"IF(ISBLANK('3. Data_Input_Sheet'!U55),F34,'3. Data_Input_Sheet'!U55)","v":0},null,null,null,{"$f":"$J$61*F51","v":0},null,{"$f":"IF(ISBLANK('3. Data_Input_Sheet'!U63),L17,'3. Data_Input_Sheet'!U63)","v":3.8799792196551851E-2},null,null,null,{"$f":"L51*J51","v":0}]
[null,2,null,"  Long-term Debt (Actual)",null,{"$f":"IF(ISBLANK('3. Data_Input_Sheet'!U56),F35,'3. Data_Input_Sheet'!U56)","v":0},null,null,null,{"$f":"$J$61*F52","v":0},null,{"$f":"IF(ISBLANK('3. Data_Input_Sheet'!U64),L18,'3. Data_Input_Sheet'!U64)","v":3.8799792196551851E-2},null,null,null,{"$f":"L52*J52","v":0}]
[null,3,null,"  Short-term Debt",null,{"$f":"IF(ISBLANK('3. Data_Input_Sheet'!U57),F36,'3. Data_Input_Sheet'!U57)","v":0},null,null,null,{"$f":"$J$61*F53","v":0},null,{"$f":"IF(ISBLANK('3. Data_Input_Sheet'!U65),L19,'3. Data_Input_Sheet'!U65)","v":2.7199999999999998E-2},null,null,null,{"$f":"L53*J53","v":0}]
[null,4,null,"Total Debt",null,{"$f":"SUM(F51:F53)","v":0},null,null,null,{"$f":"SUM(J51:J53)","v":0},null,{"$f":"IF(F54=0,0,SUMPRODUCT(F51:F53,L51:L53)/F54)","v":0},null,null,null,{"$f":"SUM(P51:P53)","v":0}]
[]
[null,null,null,"Equity"]
[null,5,null,"  Common Equity",null,{"$f":"IF(ISBLANK('3. Data_Input_Sheet'!U58),F40,'3. Data_Input_Sheet'!U58)","v":0},null,null,null,{"$f":"$J$61*F57","v":0},null,{"$f":"IF(ISBLANK('3. Data_Input_Sheet'!U66),L23,'3. Data_Input_Sheet'!U66)","v":9.11E-2},null,null,null,{"$f":"L57*J57","v":0}]
[null,6,null,"  Preferred Shares",null,{"$f":"IF(ISBLANK('3. Data_Input_Sheet'!U59),F41,'3. Data_Input_Sheet'!U59)","v":0},null,null,null,{"$f":"$J$61*F58","v":0},null,{"$f":"IF(ISBLANK('3. Data_Input_Sheet'!U67),L24,'3. Data_Input_Sheet'!U67)","v":0},null,null,null,{"$f":"L58*J58","v":0}]
[null,7,null,"Total Equity",null,{"$f":"SUM(F57:F58)","v":0},null,null,null,{"$f":"SUM(J57:J58)","v":0},null,{"$f":"IF(F59=0,0,SUMPRODUCT(F57:F58,L57:L58)/F59)","v":0},null,null,null,{"$f":"SUM(P57:P58)","v":0}]
[]
[null,8,null,"Total",null,{"$f":"F54+F59","v":0},null,null,null,{"$f":"'4. Rate_Base'!W19","v":0},null,{"$f":"(L54*F54)+(L59*F59)","v":0},null,null,null,{"$f":"P54+P59","v":0}]
[]
[]
[null,null,null,null,null,"Per Board Decision"]
[]
[null,null,null,null,null,"(%)",null,null,null,"($)",null,"(%)",null,null,null,"($)"]
[null,null,null,"Debt"]
[null,1,null,"  Long-term Debt (Notional)",null,{"$f":"IF(ISBLANK('3. Data_Input_Sheet'!AC55),F51,'3. Data_Input_Sheet'!AC55)","v":0},null,null,null,{"$f":"$J$78*F68","v":0},null,{"$f":"IF(ISBLANK('3. Data_Input_Sheet'!AC63),L51,'3. Data_Input_Sheet'!AC63)","v":3.8799792196551851E-2},null,null,null,{"$f":"L68*J68","v":0}]
[null,2,null,"  Long-term Debt (Actual)",null,{"$f":"IF(ISBLANK('3. Data_Input_Sheet'!AC56),F52,'3. Data_Input_Sheet'!AC56)","v":0},null,null,null,{"$f":"$J$78*F69","v":0},null,{"$f":"IF(ISBLANK('3. Data_Input_Sheet'!AC64),L52,'3. Data_Input_Sheet'!AC64)","v":3.8799792196551851E-2},null,null,null,{"$f":"L69*J69","v":0}]
[null,3,null,"  Short-term Debt",null,{"$f":"IF(ISBLANK('3. Data_Input_Sheet'!AC57),F53,'3. Data_Input_Sheet'!AC57)","v":0},null,null,null,{"$f":"$J$78*F70","v":0},null,{"$f":"IF(ISBLANK('3. Data_Input_Sheet'!AC65),L53,'3. Data_Input_Sheet'!AC65)","v":2.7199999999999998E-2},null,null,null,{"$f":"L70*J70","v":0}]
[null,4,null,"Total Debt",null,{"$f":"SUM(F68:F70)","v":0},null,null,null,{"$f":"SUM(J68:J70)","v":0},null,{"$f":"IF(F71=0,0,SUMPRODUCT(F68:F70,L68:L70)/F71)","v":0},null,null,null,{"$f":"SUM(P68:P70)","v":0}]
[]
[null,null,null,"Equity"]
[null,5,null,"  Common Equity",null,{"$f":"IF(ISBLANK('3. Data_Input_Sheet'!AC58),F57,'3. Data_Input_Sheet'!AC58)","v":0},null,null,null,{"$f":"$J$78*F74","v":0},null,{"$f":"IF(ISBLANK('3. Data_Input_Sheet'!AC66),L57,'3. Data_Input_Sheet'!AC66)","v":9.11E-2},null,null,null,{"$f":"L74*J74","v":0}]
[null,6,null,"  Preferred Shares",null,{"$f":"IF(ISBLANK('3. Data_Input_Sheet'!AC59),F58,'3. Data_Input_Sheet'!AC59)","v":0},null,null,null,{"$f":"$J$61*F75","v":0},null,{"$f":"IF(ISBLANK('3. Data_Input_Sheet'!AC67),L58,'3. Data_Input_Sheet'!AC67)","v":0},null,null,null,{"$f":"L75*J75","v":0}]
[null,7,null,"Total Equity",null,{"$f":"SUM(F74:F75)","v":0},null,null,null,{"$f":"SUM(J74:J75)","v":0},null,{"$f":"IF(F76=0,0,SUMPRODUCT(F74:F75,L74:L75)/F76)","v":0},null,null,null,{"$f":"SUM(P74:P75)","v":0}]
[]
[null,8,null,"Total",null,{"$f":"F71+F76","v":0},null,null,null,{"$f":"'4. Rate_Base'!AC19","v":0},null,{"$f":"(L71*F71)+(L76*F76)","v":0},null,null,null,{"$f":"P71+P76","v":0}]
[]
[]
[null,"Notes"]

{"sheet":"8. Rev_Def_Suff","index":8,"n_rows":56,"n_cols":20,"rows_kept":56,"cut":false,"hidden":false,"merged":[[14,11,15,11],[12,17,12,19],[14,17,15,17],[14,19,15,19],[59,3,59,15],[55,3,55,15],[57,3,57,15],[58,3,58,15],[56,3,56,15],[0,2,0,14],[1,2,1,14],[2,2,2,14],[3,2,3,7],[54,1,54,8],[14,3,15,3],[14,1,15,1],[12,5,12,7],[7,5,7,15],[14,7,15,7],[14,15,15,15],[14,5,15,5],[12,13,12,15],[14,13,15,13],[12,9,12,11],[14,9,15,9]]}
[null,null,null,null,null,null,null,null,null,null,null,null,null,null,null,{"$f":"CONCATENATE('2. Table of Contents'!$F$6,\" \",'2. Table of Contents'!$G$6)","v":" "}]
[]
[]
[]
[]
[]
[]
[]
[]
[null,"Revenue Deficiency/Sufficiency"]
[]
[]
[null,null,null,null,null,"Initial Application",null,null,null,{"$f":"IF(ISBLANK('3. Data_Input_Sheet'!M12),\"\",'3. Data_Input_Sheet'!M12)","v":"Interrogatory Responses"},null,null,null,{"$f":"IF(ISBLANK('3. Data_Input_Sheet'!U12),\"\",'3. Data_Input_Sheet'!U12)","v":"Settlement Agreement"},null,null,null,{"$f":"'3. Data_Input_Sheet'!AC12","v":"Per Board Decision"}]
[]
[null,"Line No.",null,"Particulars",null,"At Current Approved Rates",null,"At Proposed Rates",null,"At Current Approved Rates",null,"At Proposed Rates",null,"At Current Approved Rates",null,"At Proposed Rates",null,"At Current Approved Rates",null,"At Proposed Rates"]
[]
[]
[]
[null,1,null,"Revenue Deficiency from Below",null,null,null,{"$f":"F52","v":1268827.8585785055},null,null,null,{"$f":"J52","v":0},null,null,null,{"$f":"N52","v":0},null,null,null,{"$f":"R52","v":0}]
[null,2,null,"Distribution Revenue",null,{"$f":"'3. Data_Input_Sheet'!E25","v":4026602.8760559652},null,{"$f":"'3. Data_Input_Sheet'!E26-H19","v":3690363.4935326609},null,{"$f":"IF(ISBLANK('3. Data_Input_Sheet'!M25),,'3. Data_Input_Sheet'!M25)","v":0},null,{"$f":"'3. Data_Input_Sheet'!M26-L19","v":0},null,{"$f":"IF(ISBLANK('3. Data_Input_Sheet'!U25),,'3. Data_Input_Sheet'!U25)","v":0},null,{"$f":"'3. Data_Input_Sheet'!U26-P19","v":0},null,{"$f":"IF(ISBLANK('3. Data_Input_Sheet'!AC25),,'3. Data_Input_Sheet'!AC25)","v":0},null,{"$f":"'3. Data_Input_Sheet'!AC26-T19","v":0}]
[null,3,null,"Other Operating Revenue Offsets - net",null,{"$f":"'5. Utility Income'!F48","v":400306.04506999999},null,{"$f":"'5. Utility Income'!F48","v":400306.04506999999},null,{"$f":"'5. Utility Income'!N48","v":0},null,{"$f":"J21","v":0},null,{"$f":"'5. Utility Income'!V48","v":0},null,{"$f":"'5. Utility Income'!V48","v":0},null,{"$f":"'5. Utility Income'!AD48","v":0},null,{"$f":"'5. Utility Income'!AD48","v":0}]
[null,4,null,"Total Revenue",null,{"$f":"SUM(F20:F21)","v":4426908.9211259652},null,{"$f":"SUM(H19:H21)","v":5359497.3971811663},null,{"$f":"SUM(J20:J21)","v":0},null,{"$f":"SUM(L19:L21)","v":0},null,{"$f":"SUM(N20:N21)","v":0},null,{"$f":"SUM(P19:P21)","v":0},null,{"$f":"SUM(R20:R21)","v":0},null,{"$f":"SUM(T19:T21)","v":0}]
[]
[null,5,null,"Operating Expenses",null,{"$f":"'5. Utility Income'!F27","v":4438324.4955929574},null,{"$f":"'5. Utility Income'!F27","v":4438324.4955929574},null,{"$f":"'5. Utility Income'!N27","v":0},null,{"$f":"'5. Utility Income'!N27","v":0},null,{"$f":"'5. Utility Income'!V27","v":0},null,{"$f":"'5. Utility Income'!V27","v":0},null,{"$f":"'5. Utility Income'!AD27","v":0},null,{"$f":"'5. Utility Income'!AD27","v":0}]
[null,6,null,"Deemed Interest Expense",null,{"$f":"'5. Utility Income'!F30","v":354688.38600095536},null,{"$f":"'5. Utility Income'!F30","v":354688.38600095536},null,{"$f":"'5. Utility Income'!N30","v":0},null,{"$f":"'5. Utility Income'!N30","v":0},null,{"$f":"'5. Utility Income'!V30","v":0},null,{"$f":"'5. Utility Income'!V30","v":0},null,{"$f":"'5. Utility Income'!AD30","v":0},null,{"$f":"'5. Utility Income'!AD30","v":0}]
[null,8,null,"Total Cost and Expenses",null,{"$f":"SUM(F24:F25)","v":4793012.8815939128},null,{"$f":"SUM(H24:H25)","v":4793012.8815939128},null,{"$f":"SUM(J24:J25)","v":0},null,{"$f":"SUM(L24:L25)","v":0},null,{"$f":"SUM(N24:N25)","v":0},null,{"$f":"SUM(P24:P25)","v":0},null,{"$f":"SUM(R24:R25)","v":0},null,{"$f":"SUM(T24:T25)","v":0}]
[]
[null,9,null,"Utility Income Before Income Taxes",null,{"$f":"F22-F26","v":-366103.96046794765},null,{"$f":"H22-H26","v":566484.5155872535},null,{"$f":"J22-J26","v":0},null,{"$f":"L22-L26","v":0},null,{"$f":"N22-N26","v":0},null,{"$f":"P22-P26","v":0},null,{"$f":"R22-R26","v":0},null,{"$f":"T22-T26","v":0}]
[null,null,null,"   "]
[null,10,null,"Tax Adjustments to Accounting               Income per 2013 PILs model",null,{"$f":"'3. Data_Input_Sheet'!E44","v":-619053.18719999993},null,{"$f":"'3. Data_Input_Sheet'!E44","v":-619053.18719999993},null,{"$f":"'3. Data_Input_Sheet'!M44","v":0},null,{"$f":"'3. Data_Input_Sheet'!M44","v":0},null,{"$f":"'3. Data_Input_Sheet'!U44","v":0},null,{"$f":"'3. Data_Input_Sheet'!U44","v":0},null,{"$f":"'3. Data_Input_Sheet'!AC44","v":0},null,{"$f":"'3. Data_Input_Sheet'!AC44","v":0}]
[null,11,null,"Taxable Income",null,{"$f":"SUM(F28:F30)","v":-985157.14766794757},null,{"$f":"SUM(H28:H30)","v":-52568.671612746431},null,{"$f":"SUM(J28+J30)","v":0},null,{"$f":"L28+L30","v":0},null,{"$f":"SUM(N28+N30)","v":0},null,{"$f":"P28+P30","v":0},null,{"$f":"SUM(R28+R30)","v":0},null,{"$f":"T28+T30","v":0}]
[]
[null,12,null,"Income Tax Rate",null,{"$f":"'6. Taxes_PILs'!G41","v":0.26500000000000001},null,{"$f":"'6. Taxes_PILs'!G41","v":0.26500000000000001},null,{"$f":"'6. Taxes_PILs'!K41","v":0.26500000000000001},null,{"$f":"'6. Taxes_PILs'!K41","v":0.26500000000000001},null,{"$f":"'6. Taxes_PILs'!O41","v":0.26500000000000001},null,{"$f":"'6. Taxes_PILs'!O41","v":0.26500000000000001},null,{"$f":"'6. Taxes_PILs'!S41","v":0.26500000000000001},null,{"$f":"'6. Taxes_PILs'!S41","v":0.26500000000000001}]
[null,13,null,"Income Tax on Taxable Income",null,{"$f":"MAX(F31*F33,0)","v":0},null,{"$f":"MAX(H31*H33,0)","v":0},null,{"$f":"MAX(J31*J33,0)","v":0},null,{"$f":"MAX(L31*L33,0)","v":0},null,{"$f":"MAX(N31*N33,0)","v":0},null,{"$f":"MAX(P31*P33,0)","v":0},null,{"$f":"MAX(R31*R33,0)","v":0},null,{"$f":"MAX(T31*T33,0)","v":0}]
[null,14,null,"Income Tax Credits",null,{"$f":"'3. Data_Input_Sheet'!E51","v":0},null,{"$f":"'3. Data_Input_Sheet'!E51","v":0},null,{"$f":"'3. Data_Input_Sheet'!M51","v":0},null,{"$f":"'3. Data_Input_Sheet'!M51","v":0},null,{"$f":"'3. Data_Input_Sheet'!U51","v":0},null,{"$f":"'3. Data_Input_Sheet'!U51","v":0},null,{"$f":"'3. Data_Input_Sheet'!AC51","v":0},null,{"$f":"'3. Data_Input_Sheet'!AC51","v":0}]
[null,15,null,"Utility Net Income ",null,{"$f":"F28-SUM(F34:F35)","v":-366103.96046794765},null,{"$f":"'5. Utility Income'!F37","v":566484.5155872535},null,{"$f":"J28-SUM(J34:J35)","v":0},null,{"$f":"'5. Utility Income'!N37","v":0},null,{"$f":"N28-SUM(N34:N35)","v":0},null,{"$f":"'5. Utility Income'!V37","v":0},null,{"$f":"R28-SUM(R34:R35)","v":0},null,{"$f":"'5. Utility Income'!AD37","v":0}]
[]
[null,16,null,"Utility Rate Base",null,{"$f":"'4. Rate_Base'!G19","v":15545678.254315417},null,{"$f":"'4. Rate_Base'!G19","v":15545678.254315417},null,{"$f":"'4. Rate_Base'!O19","v":0},null,{"$f":"'4. Rate_Base'!O19","v":0},null,{"$f":"'4. Rate_Base'!W19","v":0},null,{"$f":"'4. Rate_Base'!W19","v":0},null,{"$f":"'4. Rate_Base'!AC19","v":0},null,{"$f":"'4. Rate_Base'!AC19","v":0}]
[]
[null,17,null,"Deemed Equity Portion of Rate Base ",null,{"$f":"'7. Cost_of_Capital'!J25","v":6218271.3017261671},null,{"$f":"F40","v":6218271.3017261671},null,{"$f":"'7. Cost_of_Capital'!J42","v":0},null,{"$f":"J40","v":0},null,{"$f":"'7. Cost_of_Capital'!J59","v":0},null,{"$f":"N40","v":0},null,{"$f":"'7. Cost_of_Capital'!J76","v":0},null,{"$f":"R40","v":0}]
[]
[null,18,null,"Income/(Equity Portion of Rate Base)",null,{"$f":"IF(F40=0,0,F36/F40)","v":-5.8875520655767892E-2},null,{"$f":"IF(H40=0,0,H36/H40)","v":9.1099999999999945E-2},null,{"$f":"IF(J40=0,0,J36/J40)","v":0},null,{"$f":"IF(L40=0,0,L36/L40)","v":0},null,{"$f":"IF(N40=0,0,N36/N40)","v":0},null,{"$f":"IF(P40=0,0,P36/P40)","v":0},null,{"$f":"IF(R40=0,0,R36/R40)","v":0},null,{"$f":"IF(T40=0,0,T36/T40)","v":0}]
[null,19,null,"Target Return - Equity on Rate Base",null,{"$f":"'7. Cost_of_Capital'!L25","v":9.11E-2},null,{"$f":"'7. Cost_of_Capital'!L25","v":9.11E-2},null,{"$f":"'7. Cost_of_Capital'!L42","v":0},null,{"$f":"'7. Cost_of_Capital'!L42","v":0},null,{"$f":"'7. Cost_of_Capital'!L59","v":0},null,{"$f":"'7. Cost_of_Capital'!L59","v":0},null,{"$f":"'7. Cost_of_Capital'!L76","v":0},null,{"$f":"'7. Cost_of_Capital'!L76","v":0}]
[null,20,null,"Deficiency/Sufficiency in Return on Equity",null,{"$f":"F42-F43","v":-0.14997552065576789},null,{"$f":"H42-H43","v":0},null,{"$f":"J42-J43","v":0},null,{"$f":"L42-L43","v":0},null,{"$f":"N42-N43","v":0},null,{"$f":"P42-P43","v":0},null,{"$f":"R42-R43","v":0},null,{"$f":"T42-T43","v":0}]
[]
[null,21,null,"Indicated Rate of Return",null,{"$f":"IF(F38=0,0,(F36+F25)/F38)","v":-7.3432463223811859E-4},null,{"$f":"IF(H38=0,0,(H36+H25)/H38)","v":5.925588363006902E-2},null,{"$f":"IF(J38=0,0,(J36+J25)/J38)","v":0},null,{"$f":"IF(L40=0,0,(L36+L25)/L38)","v":0},null,{"$f":"IF(N38=0,0,(N36+N25)/N38)","v":0},null,{"$f":"IF(P40=0,0,(P36+P25)/P38)","v":0},null,{"$f":"IF(R38=0,0,(R36+R25)/R38)","v":0},null,{"$f":"IF(T40=0,0,(T36+T25)/T38)","v":0}]
[null,22,null,"Requested Rate of Return on Rate Base",null,{"$f":"'7. Cost_of_Capital'!L27","v":5.9255883630069034E-2},null,{"$f":"'7. Cost_of_Capital'!L27","v":5.9255883630069034E-2},null,{"$f":"'7. Cost_of_Capital'!L44","v":0},null,{"$f":"'7. Cost_of_Capital'!L44","v":0},null,{"$f":"'7. Cost_of_Capital'!L61","v":0},null,{"$f":"'7. Cost_of_Capital'!L61","v":0},null,{"$f":"'7. Cost_of_Capital'!L78","v":0},null,{"$f":"'7. Cost_of_Capital'!L78","v":0}]
[null,23,null,"Deficiency/Sufficiency in Rate of Return",null,{"$f":"F46-F47","v":-5.9990208262307151E-2},null,{"$f":"H46-H47","v":0},null,{"$f":"J46-J47","v":0},null,{"$f":"L46-L47","v":0},null,{"$f":"N46-N47","v":0},null,{"$f":"P46-P47","v":0},null,{"$f":"R46-R47","v":0},null,{"$f":"T46-T47","v":0}]
[]
[null,24,null,"Target Return on Equity",null,{"$f":"H50","v":566484.51558725385},null,{"$f":"'7. Cost_of_Capital'!P25","v":566484.51558725385},null,{"$f":"L50","v":0},null,{"$f":"'7. Cost_of_Capital'!P42","v":0},null,{"$f":"P50","v":0},null,{"$f":"'7. Cost_of_Capital'!P59","v":0},null,{"$f":"T50","v":0},null,{"$f":"'7. Cost_of_Capital'!P76","v":0}]
[null,25,null,"Revenue Deficiency/(Sufficiency)",null,{"$f":"F50-F36","v":932588.47605520149}," ",{"$f":"H38*H48","v":0},null,{"$f":"J50-J36","v":0},null,{"$f":"L38*L48","v":0},null,{"$f":"N50-N36","v":0},null,{"$f":"P38*P48","v":0},null,{"$f":"R50-R36","v":0},null,{"$f":"T38*T48","v":0}]
[null,26,null,"Gross Revenue Deficiency/(Sufficiency)",null,{"$f":"F51/(1-F33)","v":1268827.8585785055},"(1)",null,null,{"$f":"J51/(1-J33)","v":0},"(1)",null,null,{"$f":"N51/(1-N33)","v":0},"(1)",null,null,{"$f":"R51/(1-R33)","v":0},"(1)"]
[]
[]
[null,"Notes:"]
[null,"(1)",null,"Revenue Deficiency/Sufficiency divided by (1 - Tax Rate)"]

{"sheet":"9. Rev_Reqt","index":9,"n_rows":51,"n_cols":20,"rows_kept":51,"cut":false,"hidden":false,"merged":[[56,3,56,20],[0,2,0,13],[0,14,0,15],[1,2,1,16],[2,2,2,16],[3,2,3,13],[7,5,7,13],[48,1,48,13],[38,3,38,15],[49,3,49,20],[50,3,50,20],[51,3,51,20],[52,3,52,20],[53,3,53,20],[54,3,54,20],[55,3,55,20]]}
[]
[]
[]
[]
[]
[]
[]
[]
[]
[]
[null,"Revenue Requirement"]
[]
[null,"Line No.",null,"Particulars",null,"Application   ",null,null,null,{"$f":"IF(ISBLANK('3. Data_Input_Sheet'!M12),\"\",'3. Data_Input_Sheet'!M12)","v":"Interrogatory Responses"},null,null,null,{"$f":"IF(ISBLANK('3. Data_Input_Sheet'!U12),\"\",'3. Data_Input_Sheet'!U12)","v":"Settlement Agreement"},null,null,null,{"$f":"'3. Data_Input_Sheet'!AC12","v":"Per Board Decision"}]
[]
[null,1,null,"OM&A Expenses",null,{"$f":"'5. Utility Income'!F22","v":3718936.3182769576},null,null,null,{"$f":"'5. Utility Income'!N22","v":0},null,null,null,{"$f":"'5. Utility Income'!V22","v":0},null,null,null,{"$f":"'5. Utility Income'!AD22","v":0}]
[null,2,null,"Amortization/Depreciation",null,{"$f":"'5. Utility Income'!F23","v":685011.58},null,null,null,{"$f":"'5. Utility Income'!N23","v":0},null,null,null,{"$f":"'5. Utility Income'!V23","v":0},null,null,null,{"$f":"'5. Utility Income'!AD23","v":0}]
[null,3,null,"Property Taxes",null,{"$f":"'5. Utility Income'!F24","v":34376.597315999999},null,null,null,{"$f":"'5. Utility Income'!N24","v":0},null,null,null,{"$f":"'5. Utility Income'!V24","v":0},null,null,null,{"$f":"'5. Utility Income'!AD24","v":0}]
[null,4,null,"Capital Taxes",null,{"$f":"'6. Taxes_PILs'!G25","v":0},null,null,null,{"$f":"'6. Taxes_PILs'!K25","v":0},null,null,null,{"$f":"'6. Taxes_PILs'!O25","v":0},null,null,null,{"$f":"'6. Taxes_PILs'!S25","v":0}]
[null,5,null,"Income Taxes (Grossed up)",null,{"$f":"'6. Taxes_PILs'!G33","v":0},null,null,null,{"$f":"'6. Taxes_PILs'!K33","v":0},null,null,null,{"$f":"'6. Taxes_PILs'!O33","v":0},null,null,null,{"$f":"'6. Taxes_PILs'!S33","v":0}]
[null,6,null,"Other Expenses",null,{"$f":"'5. Utility Income'!F26","v":0},null,null,null,{"$f":"'5. Utility Income'!N26","v":0},null,null,null,{"$f":"'5. Utility Income'!V26","v":0},null,null,null,{"$f":"'5. Utility Income'!AD26","v":0}]
[null,7,null,"Return"]
[null,null,null,"Deemed Interest Expense",null,{"$f":"'8. Rev_Def_Suff'!F25","v":354688.38600095536},null,null,null,{"$f":"'8. Rev_Def_Suff'!L25","v":0},null,null,null,{"$f":"'8. Rev_Def_Suff'!P25","v":0},null,null,null,{"$f":"'8. Rev_Def_Suff'!T25","v":0}]
[null,null,null,"Return on Deemed Equity",null,{"$f":"'8. Rev_Def_Suff'!F50","v":566484.51558725385},null,null,null,{"$f":"'8. Rev_Def_Suff'!L50","v":0},null,null,null,{"$f":"'8. Rev_Def_Suff'!P50","v":0},null,null,null,{"$f":"'8. Rev_Def_Suff'!T50","v":0}]
[]
[null,8,null,"Service Revenue Requirement (before Revenues)",null,{"$f":"SUM(F15:F23)","v":5359497.3971811663},null,null,null,{"$f":"SUM(J15:J23)","v":0},null,null,null,{"$f":"SUM(N15:N23)","v":0},null,null,null,{"$f":"SUM(R15:R23)","v":0}]
[]
[null,9,null,"Revenue Offsets",null,{"$f":"'3. Data_Input_Sheet'!E33","v":400306.04506999999},null,null,null,{"$f":"'3. Data_Input_Sheet'!M33","v":0},null,null,null,{"$f":"'3. Data_Input_Sheet'!U33","v":0},null,null,null,{"$f":"'3. Data_Input_Sheet'!AC33","v":0}]
[null,10,null,"Base Revenue Requirement",null,{"$f":"F25-F27","v":4959191.3521111663},null,null,null,{"$f":"J25-J27","v":0},null,null,null,{"$f":"N25-N27","v":0},null,null,null,{"$f":"R25-R27","v":0}]
[null,null,null,"(excluding Tranformer Owership Allowance credit adjustment)"]
[]
[null,11,null,"Distribution revenue",null,{"$f":"'5. Utility Income'!F16","v":4959191.3521111663},null,null,null,{"$f":"'5. Utility Income'!N16","v":0},null,null,null,{"$f":"'5. Utility Income'!V16","v":0},null,null,null,{"$f":"'5. Utility Income'!AD16","v":0}]
[null,12,null,"Other revenue",null,{"$f":"'5. Utility Income'!F17","v":400306.04506999999},null,null,null,{"$f":"'5. Utility Income'!N17","v":0},null,null,null,{"$f":"'5. Utility Income'!V17","v":0},null,null,null,{"$f":"'5. Utility Income'!AD17","v":0}]
[]
[null,13,null,"Total revenue",null,{"$f":"SUM(F31:F32)","v":5359497.3971811663},null,null,null,{"$f":"SUM(J31:J32)","v":0},null,null,null,{"$f":"SUM(N31:N32)","v":0},null,null,null,{"$f":"SUM(R31:R32)","v":0}]
[]
[null,14,null,"Difference (Total Revenue Less Distribution Revenue Requirement before Revenues)",null,{"$f":"F34-F25","v":0},null,"(1)",null,{"$f":"J34-J25","v":0},null,"(1)",null,{"$f":"N34-N25","v":0},null,"(1)",null,{"$f":"R34-R25","v":0},null,"(1)"]
[]
[]
[null,null,null,"Summary Table of Revenue Requirement and Revenue Deficiency/Sufficiency"]
[]
[null,null,null,null,null,{"$f":"F13","v":"Application   "},null,null,null,{"$f":"J13","v":"Interrogatory Responses"},null,"Δ% (2)",null,{"$f":"N13","v":"Settlement Agreement"},null,"Δ% (2)",null,{"$f":"R13","v":"Per Board Decision"},null,"Δ% (2)"]
[null,null,null,"Service Revenue Requirement",null,{"$f":"F25","v":5359497.3971811663},null,null,null,{"$f":"J25","v":0},null,{"$f":"IF($F42=0,\" \",(J42-$F42)/$F42)","v":-1},null,{"$f":"N25","v":0},null,{"$f":"IF($F42=0,\" \",(N42-$F42)/$F42)","v":-1},null,{"$f":"R25","v":0},null,{"$f":"IF($F42=0,\" \",(R42-$F42)/$F42)","v":-1}]
[null,null,null,"Grossed-Up Revenue Deficiency/(Sufficiency)",null,{"$f":"'8. Rev_Def_Suff'!F52","v":1268827.8585785055},null,null,null,{"$f":"'8. Rev_Def_Suff'!J52","v":0},null,{"$f":"IF($F43=0,\" \",(J43-$F43)/$F43)","v":-1},null,{"$f":"'8. Rev_Def_Suff'!N52","v":0},null,{"$f":"IF($F43=0,\" \",(N43-$F43)/$F43)","v":-1},null,{"$f":"'8. Rev_Def_Suff'!R52","v":0},null,{"$f":"IF($F43=0,\" \",(R43-$F43)/$F43)","v":-1}]
[]
[null,null,null,"Base Revenue Requirement (to be recovered from Distribution Rates)",null,{"$f":"F28","v":4959191.3521111663},null,null,null,{"$f":"J28","v":0},null,{"$f":"IF($F45=0,\" \",(J45-$F45)/$F45)","v":-1},null,{"$f":"N28","v":0},null,{"$f":"IF($F45=0,\" \",(N45-$F45)/$F45)","v":-1},null,{"$f":"R28","v":0},null,{"$f":"IF($F45=0,\" \",(R45-$F45)/$F45)","v":-1}]
[null,null,null,"Revenue Deficiency/(Sufficiency) Associated with Base Revenue Requirement",null,{"$f":"'3. Data_Input_Sheet'!E26-'3. Data_Input_Sheet'!E25","v":932588.47605520114},null,null,null,{"$f":"'3. Data_Input_Sheet'!M26-'3. Data_Input_Sheet'!M25","v":0},null,{"$f":"IF($F46=0,\" \",(J46-$F46)/$F46)","v":-1},null,{"$f":"'3. Data_Input_Sheet'!U26-'3. Data_Input_Sheet'!U25","v":0},null,{"$f":"IF($F46=0,\" \",(N46-$F46)/$F46)","v":-1},null,{"$f":"'3. Data_Input_Sheet'!AC26-'3. Data_Input_Sheet'!AC25","v":0},null,{"$f":"IF($F46=0,\" \",(R46-$F46)/$F46)","v":-1}]
[]
[]
[null,"Notes"]
[null,"(1)",null,"Line 11 - Line 8"]
[null,"(2)",null,"Percentage Change Relative to Initial Application"]

{"sheet":"Hidden Data_Rev Reqt","index":10,"n_rows":4,"n_cols":8,"rows_kept":4,"cut":false,"hidden":true,"merged":[]}
["Utility Name","EB Number","Test Year","Bridge Year","Last Rebasing Year","Data Elements","Intital Application","Per Board Decision"]
[{"$f":"'1. Info'!$G$16","v":"Rideau St. Lawrence Distribution Inc."},{"$f":"'1. Info'!$G$20","v":"EB-2026-0069"},{"$f":"'1. Info'!$G$28","v":2027},{"$f":"'1. Info'!$G$30","v":2026},{"$f":"'1. Info'!$G$32","v":2022},"Service Revenue Requirement (before Revenues)",{"$f":"'9. Rev_Reqt'!F25","v":5359497.3971811663},{"$f":"'9. Rev_Reqt'!N25","v":0}]
[{"$f":"'1. Info'!$G$16","v":"Rideau St. Lawrence Distribution Inc."},{"$f":"'1. Info'!$G$20","v":"EB-2026-0069"},{"$f":"'1. Info'!$G$28","v":2027},{"$f":"'1. Info'!$G$30","v":2026},{"$f":"'1. Info'!$G$32","v":2022},"Base Revenue Requirement",{"$f":"'9. Rev_Reqt'!F28","v":4959191.3521111663},{"$f":"'9. Rev_Reqt'!N28","v":0}]
[{"$f":"'1. Info'!$G$16","v":"Rideau St. Lawrence Distribution Inc."},{"$f":"'1. Info'!$G$20","v":"EB-2026-0069"},{"$f":"'1. Info'!$G$28","v":2027},{"$f":"'1. Info'!$G$30","v":2026},{"$f":"'1. Info'!$G$32","v":2022},"Revenue Deficiency/(Sufficiency) Associated with Base Revenue Requirement",{"$f":"'9. Rev_Reqt'!F46","v":932588.47605520114},{"$f":"'9. Rev_Reqt'!N46","v":0}]

{"sheet":"10. Load Forecast","index":11,"n_rows":54,"n_cols":28,"rows_kept":54,"cut":false,"hidden":false,"merged":[[23,23,23,27],[54,2,54,27],[55,2,55,27],[56,2,56,27],[57,2,57,27],[13,1,13,21],[25,3,26,3],[23,5,23,9],[23,11,23,15],[23,17,23,21],[15,1,15,21],[17,1,17,21],[21,5,21,9],[19,1,19,21],[63,2,63,27],[58,2,58,27],[59,2,59,27],[60,2,60,27],[61,2,61,27],[62,2,62,27]]}
[]
[]
[]
[]
[]
[]
[]
[]
[]
[]
[]
[]
[]
[null,"Load Forecast Summary"]
[]
[null,"This spreadsheet provides a summary of the customer and load forecast on which the test year revenue requirement is derived. The amounts serve as the denominators for deriving the rates to recover the test year revenue requirement for purposes of this RRWF."]
[]
[null,"The information to be input is inclusive of any adjustments to kWh and kW to reflect the impacts of CDM programs up to and including CDM programs planned to be executed in the test year. i.e., the load forecast adjustments determined in Appendix 2-IB should be incorporated into the entries. The inputs should correspond with the summary of the Load Forecast for the Test Year in Appendix 2-IB and in Exhibit 3 of the application."]
[]
[null,"Appendix 2-IB is still required to be filled out, as it also provides a year-over-year variance analysis of demand growth and trends from historical actuals to the Bridge and Test Year forecasts."]
[]
[null,null,null,"Stage in Process:",null,"Initial Application"]
[]
[null,null,null,"Customer Class",null,{"$f":"IF(ISBLANK('3. Data_Input_Sheet'!E12),\" \",'3. Data_Input_Sheet'!E12)","v":"Initial Application"},null,null,null,null,null,{"$f":"IF(ISBLANK('3. Data_Input_Sheet'!M12),\" \",'3. Data_Input_Sheet'!M12)","v":"Interrogatory Responses"},null,null,null,null,null,{"$f":"IF(ISBLANK('3. Data_Input_Sheet'!U12),\" \",'3. Data_Input_Sheet'!U12)","v":"Settlement Agreement"},null,null,null,null,null,{"$f":"IF(ISBLANK('3. Data_Input_Sheet'!AC12),\" \",'3. Data_Input_Sheet'!AC12)","v":"Per Board Decision"}]
[]
[null,null,null,"Input the name of each customer class.",null,"Customer / Connections",null,"kWh",null,"kW/kVA (1)",null,{"$f":"F26","v":"Customer / Connections"},null,{"$f":"H26","v":"kWh"},null,"kW/kVA (1)",null,{"$f":"F26","v":"Customer / Connections"},null,{"$f":"H26","v":"kWh"},null,"kW/kVA (1)",null,{"$f":"L26","v":"Customer / Connections"},null,{"$f":"N26","v":"kWh"},null,"kW/kVA (1)"]
[null,null,null,null,null,"Test Year average or mid-year",null,"Annual",null,"Annual",null,{"$f":"F27","v":"Test Year average or mid-year"},null,{"$f":"H27","v":"Annual"},null,{"$f":"J27","v":"Annual"},null,{"$f":"F27","v":"Test Year average or mid-year"},null,{"$f":"H27","v":"Annual"},null,{"$f":"J27","v":"Annual"},null,{"$f":"L27","v":"Test Year average or mid-year"},null,{"$f":"N27","v":"Annual"},null,{"$f":"P27","v":"Annual"}]
[]
[null,1,null,"Residential",null,5376.2524555963046,null,50042036.118735202,null,0]
[null,2,null,"General Service < 50 kW",null,741.62995572952639,null,22686576.893522337,null,0]
[null,3,null,"General Service > 50 to 4999 kW",null,65.940470955505745,null,44638220.485632457,null,121843.8867897208]
[null,4,null,"Unmetered Scattered Load",null,60.45372766210599,null,638256.91924484563,null,0]
[null,5,null,"Sentinel",null,69.35025782373404,null,137576.67902799696,null,152.39502934968934]
[null,6,null,"StreetLights",null,1713.4447618292145,null,647807.3303502202,null,1620.8252626261246]
[null,7]
[null,8]
[null,9]
[null,10]
[null,11]
[null,12]
[null,13]
[null,14]
[null,15]
[null,16]
[null,17]
[null,18]
[null,19]
[null,20]
[]
[null,null,null,"Total",null,{"$f":"SUM(F29:F48)","v":8027.0716295963903},null,{"$f":"SUM(H29:H48)","v":118790474.42651305},null,{"$f":"SUM(J29:J48)","v":123617.10708169661},null,{"$f":"SUM(L29:L48)","v":0},null,{"$f":"SUM(N29:N48)","v":0},null,{"$f":"SUM(P29:P48)","v":0},null,{"$f":"SUM(R29:R48)","v":0},null,{"$f":"SUM(T29:T48)","v":0},null,{"$f":"SUM(V29:V48)","v":0},null,{"$f":"SUM(X29:X48)","v":0},null,{"$f":"SUM(Z29:Z48)","v":0},null,{"$f":"SUM(AB29:AB48)","v":0}]
[]
[null,"Notes:"]
[]
[null,"(1)","Input kW or kVA for those customer classes for which billing is based on demand (kW or kVA) versus energy consumption (kWh)"]

{"sheet":"11. Cost_Allocation","index":12,"n_rows":152,"n_cols":15,"rows_kept":152,"cut":false,"hidden":false,"merged":[[13,1,13,12],[56,2,56,12],[21,2,21,12],[19,4,19,6],[15,1,15,12],[52,2,52,12],[53,2,53,12],[54,2,54,12],[50,4,50,6],[23,4,24,4],[23,8,24,8],[85,2,85,12],[151,2,151,12],[123,2,123,12],[93,6,94,6],[86,2,86,12],[87,2,87,12],[88,2,88,12],[119,2,119,12],[90,2,90,12],[126,6,126,8],[125,4,125,8],[120,2,120,12],[121,2,121,12]]}
[]
[]
[]
[]
[]
[]
[]
[]
[]
[]
[]
[]
[]
[null,"Cost Allocation and Rate Design"]
[]
[null,"This spreadsheet replaces Appendix 2-P and provides a summary of the results from the Cost Allocation spreadsheet, and is used in the determination of the class revenue requirement and, hence, ultimately, the determination of rates from customers in all classes to recover the revenue requirement."]
[]
[]
[]
[null,null,"Stage in Application Process:",null,{"$f":"IF(ISBLANK('10. Load Forecast'!F22),\"\",'10. Load Forecast'!F22)","v":"Initial Application"}]
[]
[null,"A)","Allocated Costs"]
[]
[null,null,"Name of Customer Class (3)",null,"Costs Allocated from Previous Study (1)",null,"%",null,"Allocated Class Revenue Requirement (1)",null,"%"]
[null,null,"From Sheet 10. Load Forecast"]
[null,null,null,null,null,null,null,null,"(7A)"]
[]
[null,1,{"$f":"IF(ISBLANK('10. Load Forecast'!D29),\"\",'10. Load Forecast'!D29)","v":"Residential"},null,null,null,{"$f":"IF(E$49=0,\"\",E28/E$49)","v":""},null,3155186.2359095989,null,{"$f":"IF(I$49=0,\"\",I28/I$49)","v":0.58870935128526658}]
[null,2,{"$f":"IF(ISBLANK('10. Load Forecast'!D30),\"\",'10. Load Forecast'!D30)","v":"General Service < 50 kW"},null,null,null,{"$f":"IF(E$49=0,\"\",E29/E$49)","v":""},null,864927.62232879596,null,{"$f":"IF(I$49=0,\"\",I29/I$49)","v":0.16138222639751734}]
[null,3,{"$f":"IF(ISBLANK('10. Load Forecast'!D31),\"\",'10. Load Forecast'!D31)","v":"General Service > 50 to 4999 kW"},null,null,null,{"$f":"IF(E$49=0,\"\",E30/E$49)","v":""},null,1032405.0083518414,null,0.19263093753806765]
[null,4,{"$f":"IF(ISBLANK('10. Load Forecast'!D32),\"\",'10. Load Forecast'!D32)","v":"Unmetered Scattered Load"},null,null,null,{"$f":"IF(E$49=0,\"\",E31/E$49)","v":""},null,19636.779525319322,null,3.6639218326045475E-3]
[null,5,{"$f":"IF(ISBLANK('10. Load Forecast'!D33),\"\",'10. Load Forecast'!D33)","v":"Sentinel"},null,null,null,"",null,26645.89141480382,null,4.9717145918977881E-3]
[null,6,{"$f":"IF(ISBLANK('10. Load Forecast'!D34),\"\",'10. Load Forecast'!D34)","v":"StreetLights"},null,null,null,"",null,260695.85965080737,null,4.864184835464621E-2]
[null,7,{"$f":"IF(ISBLANK('10. Load Forecast'!D35),\"\",'10. Load Forecast'!D35)","v":""},null,null,null,"",null,null,null,0]
[null,8,{"$f":"IF(ISBLANK('10. Load Forecast'!D36),\"\",'10. Load Forecast'!D36)","v":""},null,null,null,"",null,null,null,0]
[null,9,{"$f":"IF(ISBLANK('10. Load Forecast'!D37),\"\",'10. Load Forecast'!D37)","v":""},null,null,null,"",null,null,null,0]
[null,10,{"$f":"IF(ISBLANK('10. Load Forecast'!D38),\"\",'10. Load Forecast'!D38)","v":""},null,null,null,"",null,null,null,0]
[null,11,{"$f":"IF(ISBLANK('10. Load Forecast'!D39),\"\",'10. Load Forecast'!D39)","v":""},null,null,null,"",null,null,null,0]
[null,12,{"$f":"IF(ISBLANK('10. Load Forecast'!D40),\"\",'10. Load Forecast'!D40)","v":""},null,null,null,"",null,null,null,0]
[null,13,{"$f":"IF(ISBLANK('10. Load Forecast'!D41),\"\",'10. Load Forecast'!D41)","v":""},null,null,null,"",null,null,null,0]
[null,14,{"$f":"IF(ISBLANK('10. Load Forecast'!D42),\"\",'10. Load Forecast'!D42)","v":""},null,null,null,"",null,null,null,0]
[null,15,{"$f":"IF(ISBLANK('10. Load Forecast'!D43),\"\",'10. Load Forecast'!D43)","v":""},null,null,null,"",null,null,null,0]
[null,16,{"$f":"IF(ISBLANK('10. Load Forecast'!D44),\"\",'10. Load Forecast'!D44)","v":""},null,null,null,"",null,null,null,0]
[null,17,{"$f":"IF(ISBLANK('10. Load Forecast'!D45),\"\",'10. Load Forecast'!D45)","v":""},null,null,null,"",null,null,null,0]
[null,18,{"$f":"IF(ISBLANK('10. Load Forecast'!D46),\"\",'10. Load Forecast'!D46)","v":""},null,null,null,"",null,null,null,0]
[null,19,{"$f":"IF(ISBLANK('10. Load Forecast'!D47),\"\",'10. Load Forecast'!D47)","v":""},null,null,null,"",null,null,null,0]
[null,20,{"$f":"IF(ISBLANK('10. Load Forecast'!D48),\"\",'10. Load Forecast'!D48)","v":""},null,null,null,"",null,null,null,0]
[null,null,null,null,null,null,null,null,null,null,0]
[null,null,"Total",null,{"$f":"SUM(E28:E47)","v":0},null,{"$f":"SUM(G28:G47)","v":0},null,{"$f":"SUM(I28:I48)","v":5359497.3971811663},null,{"$f":"SUM(K28:K48)","v":1.0000000000000002}]
[]
[null,null,{"$f":"IF(I51=0,\"\",IF(ABS(I51-I49)<(0.001*I51),\" \",\"Allocated Revenue Requirement does not match Base Revenue Requirement from Sheet 9. Check data.\"))","v":" "},null,"Service Revenue Requirement (from Sheet 9)",null,null,null,{"$f":"IF(ISBLANK(E20),\"\",IF(E20='13. Rate Design'!AC4,'9. Rev_Reqt'!F25,IF(E20='13. Rate Design'!AC6,'9. Rev_Reqt'!N25,'9. Rev_Reqt'!J25)))","v":5359497.3971811663}]
[]
[null,"(1)","Class Allocated Revenue Requirement, from Sheet O-1, Revenue to Cost || RR, row 40, from the Cost Allocation Study in this application. This excludes costs in deferral and variance accounts. For Embedded Distributors, Account 4750 - Low Voltage (LV) Costs are also excluded."]
[null,"(2)","Host Distributors - Provide information on any embedded distributor(s) as a separate class, if applicable. If embedded distributors are billed in a General Service class, include the allocated costs and revenues of the embedded distributor(s) in the applicable class, and also complete Appendix 2-Q."]
[null,"(3)","Customer Classes - If these differ from those in place in the previous cost allocation study, modify the customer classes to match the proposal in the current application as closely as possible."]
[]
[null,"B)","Calculated Class Revenues"]
[]
[null,null,"Name of Customer Class",null,"Load Forecast (LF) X current approved rates",null,"LF X current approved rates X (1+d)",null,"LF X Proposed Rates",null,"Miscellaneous Revenues"]
[null,null,null,null,"(7B)",null,"(7C)",null,"(7D)",null,"(7E)"]
[]
[null,1,{"$f":"IF(ISBLANK(C28),\"\",C28)","v":"Residential"},null,2358669.4773192108,null,2904953.2905184906,null,2903639.5465671774,null,261012.24805014933]
[null,2,{"$f":"IF(ISBLANK(C29),\"\",C29)","v":"General Service < 50 kW"},null,760152.13008181925,null,936208.50772427779,null,918478.97061500885,null,59695.222873690618]
[null,3,"General Service > 50 to 4999 kW",null,747071.72513646423,null,920098.59247217944,null,919706.63578035403,null,43527.237011914149]
[null,4,"Unmetered Scattered Load",null,22702.588431177694,null,27960.661551186604,null,21931.00905574132,null,1633.1263746418651]
[null,5,"Sentinel",null,8404.2320672675851,null,10350.709089532145,null,19319.248970267603,null,1997.4641615754485]
[null,6,"StreetLights",null,129602.72302002541,null,159619.59075549908,null,176115.94112261728,null,32440.746598028589]
[null,7,""]
[null,8,""]
[null,9,""]
[null,10,""]
[null,11,""]
[null,12,""]
[null,13,""]
[null,14,""]
[null,15,""]
[null,16,""]
[null,17,""]
[null,18,""]
[null,19,""]
[null,20,""]
[]
[null,null,"Total",null,{"$f":"SUM(E62:E81)","v":4026602.8760559652},null,{"$f":"SUM(G62:G81)","v":4959191.3521111663},null,{"$f":"SUM(I62:I81)","v":4959191.3521111663},null,{"$f":"SUM(K62:K81)","v":400306.04506999993}]
[]
[]
[null,"(4)","In columns 7B to 7D, LF means Load Forecast of Annual Billing Quantities (i.e., customers or connections, as applicable X 12 months, and kWh, kW or kVA as applicable. Revenue quantities should be net of the Transformer Ownership Allowance for applicable customer classes. Exclude revenues from rate adders and rate riders."]
[null,"(5)","Columns 7C and 7D - Column Total should equal the Base Revenue Requirement for each."]
[null,"(6)","Column 7C - The OEB-issued cost allocation model calculates \"1+d\" on worksheet O-1, cell C22. \"d\" is defined as Revenue Deficiency/Revenue at Current Rates."]
[null,"(7)","Column 7E - If using the OEB-issued cost allocation model, enter Miscellaneous Revenues as it appears on worksheet O-1, row 19."]
[]
[null,"C)","Rebalancing Revenue-to-Cost Ratios"]
[]
[null,null,"Name of Customer Class",null,"Previously Approved Ratios",null,"Status Quo Ratios",null,"Proposed Ratios",null,"Policy Range"]
[null,null,null,null,"Most Recent Year:",null,"(7C + 7E) / (7A)",null,"(7D + 7E) / (7A)"]
[null,null,null,null,2022]
[null,null,null,null,"%",null,"%",null,"%",null,"%"]
[]
[null,1,{"$f":"IF(ISBLANK(C62),\"\",C62)","v":"Residential"},null,0.91080000000000005,null,{"$f":"IF(ISBLANK(I28),\"\",(G62+K62)/I28)","v":1.0034163760402985},null,{"$f":"IF(ISBLANK(I28),\"\",(I62+K62)/I28)","v":1.0029999999999997},null,"85 - 115",null,{"$f":"IF(ISBLANK(K98),\"\",LEFT(K98,2)/100)","v":0.85},{"$f":"IF(ISBLANK(K98),\"\",RIGHT(K98,3)/100)","v":1.1499999999999999},"85 - 115"]
[null,2,"General Service < 50 kW",null,1.2,null,1.151430136913101,null,1.1309318470544274,null,null,null,{"$f":"IF(ISBLANK(K99),\"\",LEFT(K99,2)/100)","v":""},{"$f":"IF(ISBLANK(K99),\"\",RIGHT(K99,3)/100)","v":""},"80 - 120"]
[null,3,"General Service > 50 to 4999 kW",null,1.2,null,0.93337965400076017,null,0.93300000000000016,null,null,null,"",""]
[null,4,"Unmetered Scattered Load",null,1.0868,null,1.507059132973956,null,1.2,null,null,null,"",""]
[null,5,"Sentinel",null,0.89990000000000003,null,0.46341753251487183,null,0.79999999999999982,null,null,null,"",""]
[null,6,"StreetLights",null,1.0728,null,0.73672185515637079,null,0.79999999999999982,null,null,null,"",""]
[null,7,"",null,null,null,"",null,"",null,null,null,"",""]
[null,8,"",null,null,null,"",null,"",null,null,null,"",""]
[null,9,"",null,null,null,"",null,"",null,null,null,"",""]
[null,10,"",null,null,null,"",null,"",null,null,null,"",""]
[null,11,"",null,null,null,"",null,"",null,null,null,"",""]
[null,12,"",null,null,null,"",null,"",null,null,null,"",""]
[null,13,"",null,null,null,"",null,"",null,null,null,"",""]
[null,14,"",null,null,null,"",null,"",null,null,null,"",""]
[null,15,"",null,null,null,"",null,"",null,null,null,"",""]
[null,16,"",null,null,null,"",null,"",null,null,null,"",""]
[null,17,"",null,null,null,"",null,"",null,null,null,"",""]
[null,18,"",null,null,null,"",null,"",null,null,null,"",""]
[null,19,"",null,null,null,"",null,"",null,null,null,"",""]
[null,20,"",null,null,null,"",null,"",null,null,null,"",""]
[null,null,null,null,null,null,null,null,null,null,null,null,"",""]
[]
[null,"(8)","Previously Approved Revenue-to-Cost (R/C) Ratios - For most applicants, the most recent year would be the third year (at the latest) of the Price Cap IR period. For example, if the applicant, rebased in 2021 with further adjustments to move within the range over two years, the Most Recent Year would be 2024. However, the ratios in 2025 would be equal to those after the adjustment in 2023."]
[null,"(9)","Status Quo Ratios - The OEB-issued cost allocation model provides the Status Quo Ratios on Worksheet O-1. The Status Quo means \"Before Rebalancing\"."]
[null,"(10)","Ratios shown in red are outside of the allowed range. Applies to both Tables C and D."]
[]
[null,"(D)","Proposed Revenue-to-Cost Ratios (11)"]
[]
[null,null,"Name of Customer Class",null,"Proposed Revenue-to-Cost Ratio",null,null,null,null,null,"Policy Range"]
[null,null,null,null,"Test Year",null,"Price Cap IR Period"]
[null,null,null,null,{"$f":"'1. Info'!G28","v":2027},null,{"$f":"E128+1","v":2028},null,{"$f":"G128+1","v":2029}]
[]
[null,1,{"$f":"IF(ISBLANK(C98),\"\",C98)","v":"Residential"},null,{"$f":"I98","v":1.0029999999999997},null,{"$f":"IF(E130=0,\"\",E130)","v":1.0029999999999997},null,{"$f":"IF(G130=0,\"\",G130)","v":1.0029999999999997},null,{"$f":"IF(ISBLANK(K98),\"\",K98)","v":"85 - 115"},null,{"$f":"IF(K130=\"\",\"\",LEFT(K130,2)/100)","v":0.85},{"$f":"IF(K130=\"\",\"\",RIGHT(K130,3)/100)","v":1.1499999999999999}]
[null,2,{"$f":"IF(ISBLANK(C99),\"\",C99)","v":"General Service < 50 kW"},null,{"$f":"I99","v":1.1309318470544274},null,{"$f":"IF(E131=0,\"\",E131)","v":1.1309318470544274},null,{"$f":"IF(G131=0,\"\",G131)","v":1.1309318470544274},null,{"$f":"IF(ISBLANK(K99),\"\",K99)","v":""},null,{"$f":"IF(K131=\"\",\"\",LEFT(K131,2)/100)","v":""},{"$f":"IF(K131=\"\",\"\",RIGHT(K131,3)/100)","v":""}]
[null,3,"General Service > 50 to 4999 kW",null,0.93300000000000016,null,0.93300000000000016,null,0.93300000000000016,null,"",null,"",""]
[null,4,"Unmetered Scattered Load",null,1.2,null,1.2,null,1.2,null,"",null,"",""]
[null,5,"Sentinel",null,0.79999999999999982,null,0.79999999999999982,null,0.79999999999999982,null,"",null,"",""]
[null,6,"StreetLights",null,0.79999999999999982,null,0.79999999999999982,null,0.79999999999999982,null,"",null,"",""]
[null,7,"",null,"",null,"",null,"",null,"",null,"",""]
[null,8,"",null,"",null,"",null,"",null,"",null,"",""]
[null,9,"",null,"",null,"",null,"",null,"",null,"",""]
[null,10,"",null,"",null,"",null,"",null,"",null,"",""]
[null,11,"",null,"",null,"",null,"",null,"",null,"",""]
[null,12,"",null,"",null,"",null,"",null,"",null,"",""]
[null,13,"",null,"",null,"",null,"",null,"",null,"",""]
[null,14,"",null,"",null,"",null,"",null,"",null,"",""]
[null,15,"",null,"",null,"",null,"",null,"",null,"",""]
[null,16,"",null,"",null,"",null,"",null,"",null,"",""]
[null,17,"",null,"",null,"",null,"",null,"",null,"",""]
[null,18,"",null,"",null,"",null,"",null,"",null,"",""]
[null,19,"",null,"",null,"",null,"",null,"",null,"",""]
[null,20,"",null,"",null,"",null,"",null,"",null,"",""]
[]
[]
[null,"(11)","The applicant should complete Table D if it is applying for approval of a revenue-to-cost ratio in 2027 that is outside of the OEB's policy range for any customer class. Table D will show that the distributor is likely to enter into the 2028 and 2029 Price Cap IR models, as necessary. For 2028 and 2029, enter the planned revenue-to-cost ratios that will be \"Change\" or \"No Change\" in 2028 (in the current Revenue/Cost Ratio Adjustment Workform, Worksheet C1.1 'Decision - Cost Revenue Adjustment, column d), and enter TBD for class(es) that will be entered as 'Rebalance'."]

{"sheet":"12. Res_Rate_Design","index":13,"n_rows":67,"n_cols":7,"rows_kept":67,"cut":false,"hidden":true,"merged":[[58,2,59,6],[66,2,67,6],[13,1,13,8],[19,2,19,3],[25,2,25,3],[51,2,51,3],[53,2,54,2],[23,5,23,6],[25,5,28,6],[61,2,64,6]]}
[]
[]
[]
[]
[]
[]
[]
[]
[]
[]
[]
[]
[]
[null,"New Rate Design Policy For Residential Customers"]
[]
[null,"Please complete the following tables."]
[]
[null,"A","Data Inputs (from Sheet 10. Load Forecast)"]
[]
[null,null,"Test Year Billing Determinants for Residential Class"]
[null,null,"Customers",{"$f":"VLOOKUP(\"Residential\",'13. Rate Design'!D28:L47,5,FALSE)","v":5376.2524555963046}]
[null,null,"kWh",{"$f":"VLOOKUP(\"Residential\",'13. Rate Design'!D28:L47,7,FALSE)","v":50042036.118735202}]
[]
[null,null,"Proposed Residential Class Specific Revenue Requirement1",{"$f":"VLOOKUP(\"Residential\",'11. Cost_Allocation'!C62:K81,7,FALSE)","v":2903639.5465671774}]
[]
[null,null,"Residential Base Rates on Current Tariff"]
[null,null,"Monthly Fixed Charge ($)"]
[null,null,"Distribution Volumetric Rate ($/kWh)"]
[]
[]
[null,"B","Current Fixed/Variable Split"]
[]
[null,null,null,"Base Rates","Billing Determinants","Revenue","% of Total Revenue"]
[null,null,"Fixed",{"$f":"IF(D27=\"\",\"\",D27)","v":""},{"$f":"IF(D21=\"\",\"\",D21)","v":5376.2524555963046},{"$f":"IF(ISERROR(D34*E34*12),\"\",D34*E34*12)","v":""},{"$f":"IF(ISERROR(F34/F36),\"\",F34/F36)","v":""}]
[null,null,"Variable",{"$f":"IF(D28=\"\",\"\",D28)","v":""},{"$f":"IF(D22=\"\",\"\",D22)","v":50042036.118735202},{"$f":"IF(ISERROR(D35*E35),\"\",D35*E35)","v":""},{"$f":"IF(ISERROR(F35/F36),\"\",F35/F36)","v":""}]
[null,null,"TOTAL","-","-",{"$f":"IF(ISERROR(F34+F35),\"\",F34+F35)","v":""},"-"]
[]
[null,"C","Calculating Test Year Base Rates"]
[]
[null,null,"Number of Remaining Rate Design Policy Transition Years2"]
[]
[null,null,null,"Test Year Revenue @ Current F/V Split","Test Year Base Rates @ Current F/V Split","Reconciliation - Test Year Base Rates @ Current F/V Split"]
[null,null,"Fixed",{"$f":"IF(ISERROR(D$24*G34),\"\",D$24*G34)","v":""},{"$f":"IF(ISERROR(ROUND(D43/D21/12,2)),\"\",ROUND(D43/D21/12,2))","v":""},{"$f":"IF(ISERROR(E43*D21*12),\"\",E43*D21*12)","v":""}]
[null,null,"Variable",{"$f":"IF(ISERROR(D$24*G35),\"\",D$24*G35)","v":""},{"$f":"IF(ISERROR(ROUND(D44/D22,4)),\"\",ROUND(D44/D22,4))","v":""},{"$f":"IF(ISERROR(E44*D22),\"\",E44*D22)","v":""}]
[null,null,"TOTAL",{"$f":"IF(ISERROR(D43+D44),\"\",D43+D44)","v":""},"-",{"$f":"IF(ISERROR(F43+F44),\"\",F43+F44)","v":""}]
[]
[null,null,null,"New F/V Split","Revenue @ new\n F/V Split","Final Adjusted \nBase Rates","Revenue Reconciliation @ Adjusted Rates"]
[null,null,"Fixed",{"$f":"IF(ISERROR(((1-G34)/D40)+G34),\"\",((1-G34)/D40)+G34)","v":""},{"$f":"IF(ISERROR(D48*D$24),\"\",D48*D$24)","v":""},{"$f":"IF(ISERROR(ROUND(E48/D21/12,2)),\"\",ROUND(E48/D21/12,2))","v":""},{"$f":"IF(ISERROR(F48*12*D21),\"\",F48*12*D21)","v":""}]
[null,null,"Variable",{"$f":"IF(ISERROR(1-D48),\"\",1-D48)","v":""},{"$f":"IF(ISERROR(D49*D$24),\"\",D49*D$24)","v":""},{"$f":"IF(ISERROR(ROUND(E49/D22,4)),\"\",ROUND(E49/D22,4))","v":""},{"$f":"IF(ISERROR(F49*D22),\"\",F49*D22)","v":""}]
[null,null,"TOTAL","-",{"$f":"IF(ISERROR(SUM(E48:E49)),\"\",SUM(E48:E49))","v":0},"-",{"$f":"IF(ISERROR(G48+G49),\"\",G48+G49)","v":""}]
[]
[null,null,"Checks3"]
[null,null,"Change in Fixed Rate",{"$f":"IF(ISERROR(F48-E43),\"\",F48-E43)","v":""}]
[null,null,"Difference Between Revenues @ Proposed Rates and Class Specific Revenue Requirement",{"$f":"IF(ISERROR((F48*12*D21)+(F49*D22)-D24),\"\",(F48*12*D21)+(F49*D22)-D24)","v":""}]
[null,null,null,{"$f":"IF(ISERROR(D54/D24), \"\", D54/D24)","v":""}]
[]
[null,"Notes:"]
[]
[null,1,"The final residential class specific revenue requirement, excluding allocated Miscellaneous Revenues, as shown on Sheet 11. Cost Allocation, should be used (i.e. the revenue requirement after any proposed adjustments to R/C ratios)."]
[]
[]
[null,2,"The distributor should enter the number of years remaining before the transition to fully fixed rates is completed. The change in residential rate design is almost complete and distributors should have either 0 or 1 year remaining. If the distributor has fully transitioned to fixed rates put \"0\" in cell D40. If the distributor has proposed an additional transition year because the change in the residential rate design will result in the fixed charge increasing by more than $4/year, put \"1\" in cell D40."]
[]
[]
[]
[]
[null,3,"Change in fixed rate due to rate design policy should be less than $4. The difference between the proposed class revenue requirement and the revenue at calculated base rates should be minimal (i.e. should be reasonably considered as a rounding error)"]

{"sheet":"13. Rate Design","index":14,"n_rows":59,"n_cols":43,"rows_kept":59,"cut":false,"hidden":false,"merged":[[58,3,58,40],[23,18,25,18],[44,42,46,42],[19,36,19,40],[50,30,53,34],[21,20,21,22],[21,14,22,18],[22,20,22,22],[48,18,48,22],[23,26,23,28],[55,3,56,33],[14,1,14,40],[16,1,16,40],[23,30,23,34],[23,11,25,11],[21,3,21,11],[23,24,25,24],[19,26,19,34],[23,40,25,40],[19,7,19,11],[23,5,25,5],[23,7,25,7],[23,9,25,9],[19,14,19,18],[23,14,25,14],[23,16,25,16]]}
[]
[]
[]
[null,null,null,null,null,null,null,null,null,null,null,null,null,null,null,null,null,null,null,null,null,null,null,null,null,null,null,null,{"$f":"'3. Data_Input_Sheet'!E12","v":"Initial Application"},1,"F","H","J"]
[null,null,null,null,null,null,null,null,null,null,null,null,null,null,null,null,null,null,null,null,null,null,null,null,null,null,null,null,{"$f":"IF(ISBLANK('3. Data_Input_Sheet'!M12),\" \",'3. Data_Input_Sheet'!M12)","v":"Interrogatory Responses"},2,"L","N","P"]
[null,null,null,null,null,null,null,null,null,null,null,null,null,null,null,null,null,null,null,null,null,null,null,null,null,null,null,null,{"$f":"IF(ISBLANK('3. Data_Input_Sheet'!U12),\" \",'3. Data_Input_Sheet'!U12)","v":"Settlement Agreement"},3,"R","T","V"]
[null,null,null,null,null,null,null,null,null,null,null,null,null,null,null,null,null,null,null,null,null,null,null,null,null,null,null,null,{"$f":"'3. Data_Input_Sheet'!AC12","v":"Per Board Decision"}]
[]
[]
[]
[]
[]
[]
[]
[null,"Rate Design and Revenue Reconciliation"]
[]
[null,"This sheet replaces Appendix 2-V, and provides a simplified model for calculating the standard monthly and voluemtric rates based on the allocated class revenues and fixed/variable split resulting from the cost allocation study and rate design and as proposed by the applicant. However, the RRWF does not replace the rate generator model that an applicant distributor may use in support of its application. The RRWF provides a demonstrative check on the derivation of the revenue requirement and on the proposed base distribution rates to recover the revenue requirement, based on summary information from a more detailed rate generator model and other models that applicants use for cost allocation, load forecasting, taxes/PILs, etc. "]
[]
[]
[null,null,null,"Stage in Process:",null,null,null,{"$f":"IF(ISBLANK('10. Load Forecast'!F22),\"\",'10. Load Forecast'!F22)","v":"Initial Application"},null,null,null,null,null,null,"Class Allocated Revenues",null,null,null,null,null,null,null,null,null,null,null,"Distribution Rates",null,null,null,null,null,null,null,null,null,"Revenue Reconciliation"]
[]
[null,null,null,"Customer and Load Forecast",null,null,null,null,null,null,null,null,null,null,"From Sheet 11. Cost Allocation and Sheet 12. Residential Rate Design",null,null,null,null,null,"Fixed / Variable Splits 2,3"]
[null,null,null,null,null,null,null,null,null,null,null,null,null,null,null,null,null,null,null,null,"Percentage to be entered as a fraction between 0 and 1"]
[null,null,null,"Customer Class",null,"Volumetric Charge Determinant",null,"Customers / Connections",null,"kWh",null,"kW or kVA",null,null,"Total Class Revenue Requirement",null,"Monthly Service Charge",null,"Volumetric",null,null,null,null,null,"Transformer Ownership Allowance 1 ($)",null,"Monthly Service Charge 2",null,null,null,"Volumetric Rate 3",null,null,null,null,null,null,null,null,null,"Distribution Revenues less Transformer Ownership Allowance"]
[null,null,null,null,null,null,null,null,null,null,null,null,null,null,null,null,null,null,null,null,"Fixed",null,"Variable"]
[null,null,null,"From sheet 10. Load Forecast",null,null,null,null,null,null,null,null,null,null,null,null,null,null,null,null,null,null,null,null,null,null,"Rate",null,"No. of decimals",null,"Rate",null,null,null,"No. of decimals",null,"MSC Revenues",null,"Volumetric revenues"]
[]
[null,1,null,{"$f":"IF(ISBLANK('10. Load Forecast'!D29),\"\",'10. Load Forecast'!D29)","v":"Residential"},null,"kWh",null,{"$f":"IF(ISBLANK($H$20),0,IF($H$20=$AC$4,'10. Load Forecast'!F29,IF($H$20=$AC$5,'10. Load Forecast'!L29,IF($H$20=$AC$6,'10. Load Forecast'!R29,'10. Load Forecast'!X29))))","v":5376.2524555963046},null,{"$f":"IF(ISBLANK($H$20),0,IF($H$20=$AC$4,'10. Load Forecast'!H29,IF($H$20=$AC$5,'10. Load Forecast'!N29,IF($H$20=$AC$6,'10. Load Forecast'!T29,'10. Load Forecast'!Z29))))","v":50042036.118735202},null,{"$f":"IF(ISBLANK($H$20),0,IF($H$20=$AC$4,'10. Load Forecast'!J29,IF($H$20=$AC$5,'10. Load Forecast'!P29,IF($H$20=$AC$6,'10. Load Forecast'!V29,'10. Load Forecast'!AB29))))","v":0},null,null,{"$f":"IF(ISBLANK('11. Cost_Allocation'!I62),\"\",'11. Cost_Allocation'!I62)","v":2903639.5465671774},null,{"$f":"IF(ISBLANK(U28),\"\",O28*U28)","v":2903639.5465671769},null,{"$f":"IF(Q28=\"\",\"\",O28-Q28)","v":4.6566128730773926E-10},null,0.99999999999999989,null,{"$f":"IF(ISBLANK(U28),\"\",1-U28)","v":1.1102230246251565E-16},null,null,null,{"$f":"IF(O28=\"\",\"\",IF(H28=0,0,IF(U28=0,0,ROUND(Q28/(H28*12),AC28))))","v":45.01},null,2,null,{"$f":"IF(S28=\"\",\"\",ROUND(IF(F28=\"kWh\",(S28+Y28)/J28,(S28+Y28)/L28),AI28))","v":0},null,{"$f":"IF(ISBLANK(F28),\"\",CONCATENATE(\"/\",F28))","v":"/kWh"},null,4,null,{"$f":"IF(AA28=\"\",0,AA28*H28*12)","v":2903821.476316676},null,{"$f":"ROUND(IF(AE28=\"\",0,IF(F28=\"kWh\",J28*AE28,IF(F28=\"kW\",IF(AE28=\"\",0,AE28*L28)))),AI28)","v":0},null,{"$f":"ROUND(AK28+AM28-Y28,2)","v":2903821.48}]
[null,2,null,{"$f":"IF(ISBLANK('10. Load Forecast'!D30),\"\",'10. Load Forecast'!D30)","v":"General Service < 50 kW"},null,"kWh",null,{"$f":"IF(ISBLANK($H$20),0,IF($H$20=$AC$4,'10. Load Forecast'!F30,IF($H$20=$AC$5,'10. Load Forecast'!L30,IF($H$20=$AC$6,'10. Load Forecast'!R30,'10. Load Forecast'!X30))))","v":741.62995572952639},null,{"$f":"IF(ISBLANK($H$20),0,IF($H$20=$AC$4,'10. Load Forecast'!H30,IF($H$20=$AC$5,'10. Load Forecast'!N30,IF($H$20=$AC$6,'10. Load Forecast'!T30,'10. Load Forecast'!Z30))))","v":22686576.893522337},null,{"$f":"IF(ISBLANK($H$20),0,IF($H$20=$AC$4,'10. Load Forecast'!J30,IF($H$20=$AC$5,'10. Load Forecast'!P30,IF($H$20=$AC$6,'10. Load Forecast'!V30,'10. Load Forecast'!AB30))))","v":0},null,null,{"$f":"IF(ISBLANK('11. Cost_Allocation'!I63),\"\",'11. Cost_Allocation'!I63)","v":918478.97061500885},null,{"$f":"IF(ISBLANK(U29),\"\",O29*U29)","v":333644.48448359931},null,{"$f":"IF(Q29=\"\",\"\",O29-Q29)","v":584834.48613140953},null,0.36325761956225594,null,{"$f":"IF(ISBLANK(U29),\"\",1-U29)","v":0.63674238043774412},null,null,null,{"$f":"IF(O29=\"\",\"\",IF(H29=0,0,IF(U29=0,0,ROUND(Q29/(H29*12),AC29))))","v":37.49},null,{"$f":"AC28","v":2},null,{"$f":"IF(S29=\"\",\"\",ROUND(IF(F29=\"kWh\",(S29+Y29)/J29,(S29+Y29)/L29),AI29))","v":2.58E-2},null,"/kWh",null,{"$f":"AI28","v":4},null,{"$f":"IF(AA29=\"\",0,AA29*H29*12)","v":333644.48448359931},null,{"$f":"ROUND(IF(AE29=\"\",0,IF(F29=\"kWh\",J29*AE29,IF(F29=\"kW\",IF(AE29=\"\",0,AE29*L29)))),AI29)","v":585313.68389999995},null,{"$f":"ROUND(AK29+AM29-Y29,2)","v":918958.17}]
[null,3,null,{"$f":"IF(ISBLANK('10. Load Forecast'!D31),\"\",'10. Load Forecast'!D31)","v":"General Service > 50 to 4999 kW"},null,"kW",null,{"$f":"IF(ISBLANK($H$20),0,IF($H$20=$AC$4,'10. Load Forecast'!F31,IF($H$20=$AC$5,'10. Load Forecast'!L31,IF($H$20=$AC$6,'10. Load Forecast'!R31,'10. Load Forecast'!X31))))","v":65.940470955505745},null,{"$f":"IF(ISBLANK($H$20),0,IF($H$20=$AC$4,'10. Load Forecast'!H31,IF($H$20=$AC$5,'10. Load Forecast'!N31,IF($H$20=$AC$6,'10. Load Forecast'!T31,'10. Load Forecast'!Z31))))","v":44638220.485632457},null,{"$f":"IF(ISBLANK($H$20),0,IF($H$20=$AC$4,'10. Load Forecast'!J31,IF($H$20=$AC$5,'10. Load Forecast'!P31,IF($H$20=$AC$6,'10. Load Forecast'!V31,'10. Load Forecast'!AB31))))","v":121843.8867897208},null,null,{"$f":"IF(ISBLANK('11. Cost_Allocation'!I64),\"\",'11. Cost_Allocation'!I64)","v":919706.63578035403},null,282718.45041231182,null,636988.18536804221,null,0.30740068562453121,null,0.69259931437546873,null,-33513.291035699702,null,357.29,null,{"$f":"AC29","v":2},null,4.9528999999999996,null,"/kW",null,{"$f":"AI29","v":4},null,282718.45041231182,null,603480.58689999999,null,919712.33]
[null,4,null,{"$f":"IF(ISBLANK('10. Load Forecast'!D32),\"\",'10. Load Forecast'!D32)","v":"Unmetered Scattered Load"},null,"kWh",null,{"$f":"IF(ISBLANK($H$20),0,IF($H$20=$AC$4,'10. Load Forecast'!F32,IF($H$20=$AC$5,'10. Load Forecast'!L32,IF($H$20=$AC$6,'10. Load Forecast'!R32,'10. Load Forecast'!X32))))","v":60.45372766210599},null,{"$f":"IF(ISBLANK($H$20),0,IF($H$20=$AC$4,'10. Load Forecast'!H32,IF($H$20=$AC$5,'10. Load Forecast'!N32,IF($H$20=$AC$6,'10. Load Forecast'!T32,'10. Load Forecast'!Z32))))","v":638256.91924484563},null,{"$f":"IF(ISBLANK($H$20),0,IF($H$20=$AC$4,'10. Load Forecast'!J32,IF($H$20=$AC$5,'10. Load Forecast'!P32,IF($H$20=$AC$6,'10. Load Forecast'!V32,'10. Load Forecast'!AB32))))","v":0},null,null,{"$f":"IF(ISBLANK('11. Cost_Allocation'!I65),\"\",'11. Cost_Allocation'!I65)","v":21931.00905574132},null,4358.9105229670522,null,17572.098532774267,null,0.19875558447348016,null,0.80124441552651982,null,null,null,6.01,null,2,null,{"$f":"IF(S31=\"\",\"\",ROUND(IF(F31=\"kWh\",(S31+Y31)/J31,(S31+Y31)/L31),AI31))","v":2.75E-2},null,"/kWh",null,4,null,4359.9228389910841,null,17552.065299999998,null,{"$f":"ROUND(AK31+AM31-Y31,2)","v":21911.99}]
[null,5,null,{"$f":"IF(ISBLANK('10. Load Forecast'!D33),\"\",'10. Load Forecast'!D33)","v":"Sentinel"},null,"kW",null,{"$f":"IF(ISBLANK($H$20),0,IF($H$20=$AC$4,'10. Load Forecast'!F33,IF($H$20=$AC$5,'10. Load Forecast'!L33,IF($H$20=$AC$6,'10. Load Forecast'!R33,'10. Load Forecast'!X33))))","v":69.35025782373404},null,{"$f":"IF(ISBLANK($H$20),0,IF($H$20=$AC$4,'10. Load Forecast'!H33,IF($H$20=$AC$5,'10. Load Forecast'!N33,IF($H$20=$AC$6,'10. Load Forecast'!T33,'10. Load Forecast'!Z33))))","v":137576.67902799696},null,{"$f":"IF(ISBLANK($H$20),0,IF($H$20=$AC$4,'10. Load Forecast'!J33,IF($H$20=$AC$5,'10. Load Forecast'!P33,IF($H$20=$AC$6,'10. Load Forecast'!V33,'10. Load Forecast'!AB33))))","v":152.39502934968934},null,null,{"$f":"IF(ISBLANK('11. Cost_Allocation'!I66),\"\",'11. Cost_Allocation'!I66)","v":19319.248970267603},null,3595.1173655823727,null,15724.13160468523,null,0.18608991328365154,null,0.81391008671634846,null,null,null,4.32,null,2,null,{"$f":"IF(S32=\"\",\"\",ROUND(IF(F32=\"kWh\",(S32+Y32)/J32,(S32+Y32)/L32),AI32))","v":103.1801},null,"/kW",null,4,null,3595.1173655823732,null,15724.134400000001,null,{"$f":"ROUND(AK32+AM32-Y32,2)","v":19319.25}]
[null,6,null,{"$f":"IF(ISBLANK('10. Load Forecast'!D34),\"\",'10. Load Forecast'!D34)","v":"StreetLights"},null,"kW",null,{"$f":"IF(ISBLANK($H$20),0,IF($H$20=$AC$4,'10. Load Forecast'!F34,IF($H$20=$AC$5,'10. Load Forecast'!L34,IF($H$20=$AC$6,'10. Load Forecast'!R34,'10. Load Forecast'!X34))))","v":1713.4447618292145},null,{"$f":"IF(ISBLANK($H$20),0,IF($H$20=$AC$4,'10. Load Forecast'!H34,IF($H$20=$AC$5,'10. Load Forecast'!N34,IF($H$20=$AC$6,'10. Load Forecast'!T34,'10. Load Forecast'!Z34))))","v":647807.3303502202},null,{"$f":"IF(ISBLANK($H$20),0,IF($H$20=$AC$4,'10. Load Forecast'!J34,IF($H$20=$AC$5,'10. Load Forecast'!P34,IF($H$20=$AC$6,'10. Load Forecast'!V34,'10. Load Forecast'!AB34))))","v":1620.8252626261246},null,null,{"$f":"IF(ISBLANK('11. Cost_Allocation'!I67),\"\",'11. Cost_Allocation'!I67)","v":176115.94112261728},null,99722.485138460281,null,76393.455984157001,null,0.56623202024074837,null,0.43376797975925163,null,null,null,4.8499999999999996,null,2,null,47.132399999999997,null,"/kW",null,4,null,99722.485138460281,null,76393.384600000005,null,176115.87]
[null,7,null,{"$f":"IF(ISBLANK('10. Load Forecast'!D35),\"\",'10. Load Forecast'!D35)","v":""},null,null,null,{"$f":"IF(ISBLANK($H$20),0,IF($H$20=$AC$4,'10. Load Forecast'!F35,IF($H$20=$AC$5,'10. Load Forecast'!L35,IF($H$20=$AC$6,'10. Load Forecast'!R35,'10. Load Forecast'!X35))))","v":0},null,{"$f":"IF(ISBLANK($H$20),0,IF($H$20=$AC$4,'10. Load Forecast'!H35,IF($H$20=$AC$5,'10. Load Forecast'!N35,IF($H$20=$AC$6,'10. Load Forecast'!T35,'10. Load Forecast'!Z35))))","v":0},null,{"$f":"IF(ISBLANK($H$20),0,IF($H$20=$AC$4,'10. Load Forecast'!J35,IF($H$20=$AC$5,'10. Load Forecast'!P35,IF($H$20=$AC$6,'10. Load Forecast'!V35,'10. Load Forecast'!AB35))))","v":0},null,null,{"$f":"IF(ISBLANK('11. Cost_Allocation'!I68),\"\",'11. Cost_Allocation'!I68)","v":""},null,"",null,"",null,null,null,"",null,null,null,"",null,2,null,"",null,"",null,4,null,0,null,0,null,0]
[null,8,null,{"$f":"IF(ISBLANK('10. Load Forecast'!D36),\"\",'10. Load Forecast'!D36)","v":""},null,null,null,{"$f":"IF(ISBLANK($H$20),0,IF($H$20=$AC$4,'10. Load Forecast'!F36,IF($H$20=$AC$5,'10. Load Forecast'!L36,IF($H$20=$AC$6,'10. Load Forecast'!R36,'10. Load Forecast'!X36))))","v":0},null,{"$f":"IF(ISBLANK($H$20),0,IF($H$20=$AC$4,'10. Load Forecast'!H36,IF($H$20=$AC$5,'10. Load Forecast'!N36,IF($H$20=$AC$6,'10. Load Forecast'!T36,'10. Load Forecast'!Z36))))","v":0},null,{"$f":"IF(ISBLANK($H$20),0,IF($H$20=$AC$4,'10. Load Forecast'!J36,IF($H$20=$AC$5,'10. Load Forecast'!P36,IF($H$20=$AC$6,'10. Load Forecast'!V36,'10. Load Forecast'!AB36))))","v":0},null,null,{"$f":"IF(ISBLANK('11. Cost_Allocation'!I69),\"\",'11. Cost_Allocation'!I69)","v":""},null,"",null,"",null,null,null,"",null,null,null,"",null,2,null,"",null,"",null,4,null,0,null,0,null,0]
[null,9,null,{"$f":"IF(ISBLANK('10. Load Forecast'!D37),\"\",'10. Load Forecast'!D37)","v":""},null,null,null,{"$f":"IF(ISBLANK($H$20),0,IF($H$20=$AC$4,'10. Load Forecast'!F37,IF($H$20=$AC$5,'10. Load Forecast'!L37,IF($H$20=$AC$6,'10. Load Forecast'!R37,'10. Load Forecast'!X37))))","v":0},null,{"$f":"IF(ISBLANK($H$20),0,IF($H$20=$AC$4,'10. Load Forecast'!H37,IF($H$20=$AC$5,'10. Load Forecast'!N37,IF($H$20=$AC$6,'10. Load Forecast'!T37,'10. Load Forecast'!Z37))))","v":0},null,{"$f":"IF(ISBLANK($H$20),0,IF($H$20=$AC$4,'10. Load Forecast'!J37,IF($H$20=$AC$5,'10. Load Forecast'!P37,IF($H$20=$AC$6,'10. Load Forecast'!V37,'10. Load Forecast'!AB37))))","v":0},null,null,{"$f":"IF(ISBLANK('11. Cost_Allocation'!I70),\"\",'11. Cost_Allocation'!I70)","v":""},null,"",null,"",null,null,null,"",null,null,null,"",null,2,null,"",null,"",null,4,null,0,null,0,null,0]
[null,10,null,{"$f":"IF(ISBLANK('10. Load Forecast'!D38),\"\",'10. Load Forecast'!D38)","v":""},null,null,null,{"$f":"IF(ISBLANK($H$20),0,IF($H$20=$AC$4,'10. Load Forecast'!F38,IF($H$20=$AC$5,'10. Load Forecast'!L38,IF($H$20=$AC$6,'10. Load Forecast'!R38,'10. Load Forecast'!X38))))","v":0},null,{"$f":"IF(ISBLANK($H$20),0,IF($H$20=$AC$4,'10. Load Forecast'!H38,IF($H$20=$AC$5,'10. Load Forecast'!N38,IF($H$20=$AC$6,'10. Load Forecast'!T38,'10. Load Forecast'!Z38))))","v":0},null,{"$f":"IF(ISBLANK($H$20),0,IF($H$20=$AC$4,'10. Load Forecast'!J38,IF($H$20=$AC$5,'10. Load Forecast'!P38,IF($H$20=$AC$6,'10. Load Forecast'!V38,'10. Load Forecast'!AB38))))","v":0},null,null,{"$f":"IF(ISBLANK('11. Cost_Allocation'!I71),\"\",'11. Cost_Allocation'!I71)","v":""},null,"",null,"",null,null,null,"",null,null,null,"",null,2,null,"",null,"",null,4,null,0,null,0,null,0]
[null,11,null,{"$f":"IF(ISBLANK('10. Load Forecast'!D39),\"\",'10. Load Forecast'!D39)","v":""},null,null,null,{"$f":"IF(ISBLANK($H$20),0,IF($H$20=$AC$4,'10. Load Forecast'!F39,IF($H$20=$AC$5,'10. Load Forecast'!L39,IF($H$20=$AC$6,'10. Load Forecast'!R39,'10. Load Forecast'!X39))))","v":0},null,{"$f":"IF(ISBLANK($H$20),0,IF($H$20=$AC$4,'10. Load Forecast'!H39,IF($H$20=$AC$5,'10. Load Forecast'!N39,IF($H$20=$AC$6,'10. Load Forecast'!T39,'10. Load Forecast'!Z39))))","v":0},null,{"$f":"IF(ISBLANK($H$20),0,IF($H$20=$AC$4,'10. Load Forecast'!J39,IF($H$20=$AC$5,'10. Load Forecast'!P39,IF($H$20=$AC$6,'10. Load Forecast'!V39,'10. Load Forecast'!AB39))))","v":0},null,null,{"$f":"IF(ISBLANK('11. Cost_Allocation'!I72),\"\",'11. Cost_Allocation'!I72)","v":""},null,"",null,"",null,null,null,"",null,null,null,"",null,2,null,"",null,"",null,4,null,0,null,0,null,0]
[null,12,null,{"$f":"IF(ISBLANK('10. Load Forecast'!D40),\"\",'10. Load Forecast'!D40)","v":""},null,null,null,{"$f":"IF(ISBLANK($H$20),0,IF($H$20=$AC$4,'10. Load Forecast'!F40,IF($H$20=$AC$5,'10. Load Forecast'!L40,IF($H$20=$AC$6,'10. Load Forecast'!R40,'10. Load Forecast'!X40))))","v":0},null,{"$f":"IF(ISBLANK($H$20),0,IF($H$20=$AC$4,'10. Load Forecast'!H40,IF($H$20=$AC$5,'10. Load Forecast'!N40,IF($H$20=$AC$6,'10. Load Forecast'!T40,'10. Load Forecast'!Z40))))","v":0},null,{"$f":"IF(ISBLANK($H$20),0,IF($H$20=$AC$4,'10. Load Forecast'!J40,IF($H$20=$AC$5,'10. Load Forecast'!P40,IF($H$20=$AC$6,'10. Load Forecast'!V40,'10. Load Forecast'!AB40))))","v":0},null,null,{"$f":"IF(ISBLANK('11. Cost_Allocation'!I73),\"\",'11. Cost_Allocation'!I73)","v":""},null,"",null,"",null,null,null,"",null,null,null,"",null,2,null,"",null,"",null,4,null,0,null,0,null,0]
[null,13,null,{"$f":"IF(ISBLANK('10. Load Forecast'!D41),\"\",'10. Load Forecast'!D41)","v":""},null,null,null,{"$f":"IF(ISBLANK($H$20),0,IF($H$20=$AC$4,'10. Load Forecast'!F41,IF($H$20=$AC$5,'10. Load Forecast'!L41,IF($H$20=$AC$6,'10. Load Forecast'!R41,'10. Load Forecast'!X41))))","v":0},null,{"$f":"IF(ISBLANK($H$20),0,IF($H$20=$AC$4,'10. Load Forecast'!H41,IF($H$20=$AC$5,'10. Load Forecast'!N41,IF($H$20=$AC$6,'10. Load Forecast'!T41,'10. Load Forecast'!Z41))))","v":0},null,{"$f":"IF(ISBLANK($H$20),0,IF($H$20=$AC$4,'10. Load Forecast'!J41,IF($H$20=$AC$5,'10. Load Forecast'!P41,IF($H$20=$AC$6,'10. Load Forecast'!V41,'10. Load Forecast'!AB41))))","v":0},null,null,{"$f":"IF(ISBLANK('11. Cost_Allocation'!I74),\"\",'11. Cost_Allocation'!I74)","v":""},null,"",null,"",null,null,null,"",null,null,null,"",null,2,null,"",null,"",null,4,null,0,null,0,null,0]
[null,14,null,{"$f":"IF(ISBLANK('10. Load Forecast'!D42),\"\",'10. Load Forecast'!D42)","v":""},null,null,null,{"$f":"IF(ISBLANK($H$20),0,IF($H$20=$AC$4,'10. Load Forecast'!F42,IF($H$20=$AC$5,'10. Load Forecast'!L42,IF($H$20=$AC$6,'10. Load Forecast'!R42,'10. Load Forecast'!X42))))","v":0},null,{"$f":"IF(ISBLANK($H$20),0,IF($H$20=$AC$4,'10. Load Forecast'!H42,IF($H$20=$AC$5,'10. Load Forecast'!N42,IF($H$20=$AC$6,'10. Load Forecast'!T42,'10. Load Forecast'!Z42))))","v":0},null,{"$f":"IF(ISBLANK($H$20),0,IF($H$20=$AC$4,'10. Load Forecast'!J42,IF($H$20=$AC$5,'10. Load Forecast'!P42,IF($H$20=$AC$6,'10. Load Forecast'!V42,'10. Load Forecast'!AB42))))","v":0},null,null,{"$f":"IF(ISBLANK('11. Cost_Allocation'!I75),\"\",'11. Cost_Allocation'!I75)","v":""},null,"",null,"",null,null,null,"",null,null,null,"",null,2,null,"",null,"",null,4,null,0,null,0,null,0]
[null,15,null,{"$f":"IF(ISBLANK('10. Load Forecast'!D43),\"\",'10. Load Forecast'!D43)","v":""},null,null,null,{"$f":"IF(ISBLANK($H$20),0,IF($H$20=$AC$4,'10. Load Forecast'!F43,IF($H$20=$AC$5,'10. Load Forecast'!L43,IF($H$20=$AC$6,'10. Load Forecast'!R43,'10. Load Forecast'!X43))))","v":0},null,{"$f":"IF(ISBLANK($H$20),0,IF($H$20=$AC$4,'10. Load Forecast'!H43,IF($H$20=$AC$5,'10. Load Forecast'!N43,IF($H$20=$AC$6,'10. Load Forecast'!T43,'10. Load Forecast'!Z43))))","v":0},null,{"$f":"IF(ISBLANK($H$20),0,IF($H$20=$AC$4,'10. Load Forecast'!J43,IF($H$20=$AC$5,'10. Load Forecast'!P43,IF($H$20=$AC$6,'10. Load Forecast'!V43,'10. Load Forecast'!AB43))))","v":0},null,null,{"$f":"IF(ISBLANK('11. Cost_Allocation'!I76),\"\",'11. Cost_Allocation'!I76)","v":""},null,"",null,"",null,null,null,"",null,null,null,"",null,2,null,"",null,"",null,4,null,0,null,0,null,0]
[null,16,null,{"$f":"IF(ISBLANK('10. Load Forecast'!D44),\"\",'10. Load Forecast'!D44)","v":""},null,null,null,{"$f":"IF(ISBLANK($H$20),0,IF($H$20=$AC$4,'10. Load Forecast'!F44,IF($H$20=$AC$5,'10. Load Forecast'!L44,IF($H$20=$AC$6,'10. Load Forecast'!R44,'10. Load Forecast'!X44))))","v":0},null,{"$f":"IF(ISBLANK($H$20),0,IF($H$20=$AC$4,'10. Load Forecast'!H44,IF($H$20=$AC$5,'10. Load Forecast'!N44,IF($H$20=$AC$6,'10. Load Forecast'!T44,'10. Load Forecast'!Z44))))","v":0},null,{"$f":"IF(ISBLANK($H$20),0,IF($H$20=$AC$4,'10. Load Forecast'!J44,IF($H$20=$AC$5,'10. Load Forecast'!P44,IF($H$20=$AC$6,'10. Load Forecast'!V44,'10. Load Forecast'!AB44))))","v":0},null,null,{"$f":"IF(ISBLANK('11. Cost_Allocation'!I77),\"\",'11. Cost_Allocation'!I77)","v":""},null,"",null,"",null,null,null,"",null,null,null,"",null,2,null,"",null,"",null,4,null,0,null,0,null,0]
[null,17,null,{"$f":"IF(ISBLANK('10. Load Forecast'!D45),\"\",'10. Load Forecast'!D45)","v":""},null,null,null,{"$f":"IF(ISBLANK($H$20),0,IF($H$20=$AC$4,'10. Load Forecast'!F45,IF($H$20=$AC$5,'10. Load Forecast'!L45,IF($H$20=$AC$6,'10. Load Forecast'!R45,'10. Load Forecast'!X45))))","v":0},null,{"$f":"IF(ISBLANK($H$20),0,IF($H$20=$AC$4,'10. Load Forecast'!H45,IF($H$20=$AC$5,'10. Load Forecast'!N45,IF($H$20=$AC$6,'10. Load Forecast'!T45,'10. Load Forecast'!Z45))))","v":0},null,{"$f":"IF(ISBLANK($H$20),0,IF($H$20=$AC$4,'10. Load Forecast'!J45,IF($H$20=$AC$5,'10. Load Forecast'!P45,IF($H$20=$AC$6,'10. Load Forecast'!V45,'10. Load Forecast'!AB45))))","v":0},null,null,{"$f":"IF(ISBLANK('11. Cost_Allocation'!I78),\"\",'11. Cost_Allocation'!I78)","v":""},null,"",null,"",null,null,null,"",null,null,null,"",null,2,null,"",null,"",null,4,null,0,null,0,null,0]
[null,18,null,{"$f":"IF(ISBLANK('10. Load Forecast'!D46),\"\",'10. Load Forecast'!D46)","v":""},null,null,null,{"$f":"IF(ISBLANK($H$20),0,IF($H$20=$AC$4,'10. Load Forecast'!F46,IF($H$20=$AC$5,'10. Load Forecast'!L46,IF($H$20=$AC$6,'10. Load Forecast'!R46,'10. Load Forecast'!X46))))","v":0},null,{"$f":"IF(ISBLANK($H$20),0,IF($H$20=$AC$4,'10. Load Forecast'!H46,IF($H$20=$AC$5,'10. Load Forecast'!N46,IF($H$20=$AC$6,'10. Load Forecast'!T46,'10. Load Forecast'!Z46))))","v":0},null,{"$f":"IF(ISBLANK($H$20),0,IF($H$20=$AC$4,'10. Load Forecast'!J46,IF($H$20=$AC$5,'10. Load Forecast'!P46,IF($H$20=$AC$6,'10. Load Forecast'!V46,'10. Load Forecast'!AB46))))","v":0},null,null,{"$f":"IF(ISBLANK('11. Cost_Allocation'!I79),\"\",'11. Cost_Allocation'!I79)","v":""},null,"",null,"",null,null,null,"",null,null,null,"",null,2,null,"",null,"",null,4,null,0,null,0,null,0,null,"Distribution Revenues including TOA Credit Recovery in Rates"]
[null,19,null,{"$f":"IF(ISBLANK('10. Load Forecast'!D47),\"\",'10. Load Forecast'!D47)","v":""},null,null,null,{"$f":"IF(ISBLANK($H$20),0,IF($H$20=$AC$4,'10. Load Forecast'!F47,IF($H$20=$AC$5,'10. Load Forecast'!L47,IF($H$20=$AC$6,'10. Load Forecast'!R47,'10. Load Forecast'!X47))))","v":0},null,{"$f":"IF(ISBLANK($H$20),0,IF($H$20=$AC$4,'10. Load Forecast'!H47,IF($H$20=$AC$5,'10. Load Forecast'!N47,IF($H$20=$AC$6,'10. Load Forecast'!T47,'10. Load Forecast'!Z47))))","v":0},null,{"$f":"IF(ISBLANK($H$20),0,IF($H$20=$AC$4,'10. Load Forecast'!J47,IF($H$20=$AC$5,'10. Load Forecast'!P47,IF($H$20=$AC$6,'10. Load Forecast'!V47,'10. Load Forecast'!AB47))))","v":0},null,null,{"$f":"IF(ISBLANK('11. Cost_Allocation'!I80),\"\",'11. Cost_Allocation'!I80)","v":""},null,"",null,"",null,null,null,"",null,null,null,"",null,2,null,"",null,"",null,4,null,0,null,0,null,0]
[null,20,null,{"$f":"IF(ISBLANK('10. Load Forecast'!D48),\"\",'10. Load Forecast'!D48)","v":""},null,null,null,{"$f":"IF(ISBLANK($H$20),0,IF($H$20=$AC$4,'10. Load Forecast'!F48,IF($H$20=$AC$5,'10. Load Forecast'!L48,IF($H$20=$AC$6,'10. Load Forecast'!R48,'10. Load Forecast'!X48))))","v":0},null,{"$f":"IF(ISBLANK($H$20),0,IF($H$20=$AC$4,'10. Load Forecast'!H48,IF($H$20=$AC$5,'10. Load Forecast'!N48,IF($H$20=$AC$6,'10. Load Forecast'!T48,'10. Load Forecast'!Z48))))","v":0},null,{"$f":"IF(ISBLANK($H$20),0,IF($H$20=$AC$4,'10. Load Forecast'!J48,IF($H$20=$AC$5,'10. Load Forecast'!P48,IF($H$20=$AC$6,'10. Load Forecast'!V48,'10. Load Forecast'!AB48))))","v":0},null,null,{"$f":"IF(ISBLANK('11. Cost_Allocation'!I81),\"\",'11. Cost_Allocation'!I81)","v":""},null,"",null,"",null,null,null,"",null,null,null,"",null,2,null,"",null,"",null,4,null,0,null,0,null,0]
[]
[null,null,null,null,null,null,null,null,null,null,null,null,null,null,null,null,null,null,"Total Transformer Ownership Allowance",null,null,null,null,null,{"$f":"SUM(Y28:Y47)","v":-33513.291035699702},null,null,null,null,null,null,null,null,null,null,"Total Distribution Revenues",null,null,null,null,{"$f":"SUM(AO28:AO47)","v":4959839.09},null,{"$f":"SUM(AK28:AK47)+SUM(AM28:AM47)","v":4926325.7916556206}]
[null,null,null,null,null,null,null,null,null,null,null,null,null,null,null,null,null,null,null,null,null,null,null,null,null,null,null,null,null,null,null,null,null,null,null,null,null,null,null,null,null,null,{"$f":"AO49+Y49","v":4926325.7989643002}]
[null,null,null,null,null,null,null,null,null,null,null,null,null,null,null,null,null,null,null,null,null,null,null,null,null,null,null,null,null,null,{"$f":"IF(AO54=\"\",\"\",IF((ABS(AO54)<=0.5%),\"Rates recover revenue requirement\",\"Revenues recovered from rates deviate materially from revenue requirement - check data inputs and calculations\"))","v":"Rates recover revenue requirement"},null,null,null,null,"Base Revenue Requirement",null,null,null,null,{"$f":"IF(SIP=\"\",0,IF(SIP=IA,BRRAPP,IF(SIP=IR,BRRIR,IF(SIP=SA,BRRSA,IF(SIP=PBD,BRRPBD)))))","v":4959191.3521111663}]
[null,"Notes:"]
[null,null,null,null,null,null,null,null,null,null,null,null,null,null,null,null,null,null,null,null,null,null,null,null,null,null,null,null,null,null,null,null,null,null,null,"Difference",null,null,null,null,{"$f":"AO49-AO51","v":647.7378888335079}]
[null,1,null,"Transformer Ownership Allowance is entered as a positive amount, and only for those classes to which it applies.",null,null,null,null,null,null,null,null,null,null,null,null,null,null,null,null,null,null,null,null,null,null,null,null,null,null,null,null,null,null,null,"% Difference",null,null,null,null,{"$f":"IF(AO51=0,\"\",AO53/AO51)","v":1.306136107367103E-4}]
[]
[null,2,null,"The Fixed/Variable split, for each customer class, drives the \"rate generator\" portion of this sheet of the RRWF. Only the \"fixed\" fraction is entered, as the sum of the \"fixed\" and \"variable\" portions must sum to 100%. For a distributor that may set the Monthly Service Charge, the \"fixed\" ratio is calcutated as: [MSC x (average number of customers or connections) x 12 months] / (Class Allocated Revenue Requirement)."]
[]
[]
[null,3,null,"The Volumetric rate is calculated as [(allocated volumetric revenue requirement for the class + transformer allowance credit for the class)/(annual estimate of the charge determinant for the test year (either kW or kVA for demand-billed customer classes, or kWh for non-demand-billed classes)]"]

{"sheet":"14. Tracking_Sheet","index":15,"n_rows":203,"n_cols":18,"rows_kept":203,"cut":false,"hidden":true,"merged":[[210,1,210,14],[211,1,211,14],[15,1,15,14],[73,0,75,0],[73,1,74,1],[208,1,208,14],[76,0,78,0],[76,1,77,1],[79,0,81,0],[79,1,80,1],[67,0,69,0],[67,1,68,1],[70,0,72,0],[70,1,71,1],[61,0,63,0],[52,0,54,0],[52,1,53,1],[43,0,45,0],[43,1,44,1],[46,0,48,0],[46,1,47,1],[61,1,62,1],[64,0,66,0],[64,1,65,1],[55,0,57,0],[55,1,56,1],[58,0,60,0],[58,1,59,1],[37,0,39,0],[37,1,38,1],[40,0,42,0],[40,1,41,1],[31,0,33,0],[31,1,32,1],[34,0,36,0],[34,1,35,1],[49,0,51,0],[49,1,50,1],[17,3,17,4],[17,8,17,10],[17,5,17,7],[17,11,17,14],[22,1,23,1],[25,1,26,1],[22,0,24,0],[25,0,27,0],[28,0,30,0],[28,1,29,1],[91,0,93,0],[91,1,92,1],[94,0,96,0],[94,1,95,1],[97,0,99,0],[97,1,98,1],[82,0,84,0],[82,1,83,1],[85,0,87,0],[85,1,86,1],[88,0,90,0],[88,1,89,1],[109,0,111,0],[109,1,110,1],[112,0,114,0],[112,1,113,1],[115,0,117,0],[115,1,116,1],[100,0,102,0],[100,1,101,1],[103,0,105,0],[103,1,104,1],[106,0,108,0],[106,1,107,1],[127,0,129,0],[127,1,128,1],[130,0,132,0],[130,1,131,1],[133,0,135,0],[133,1,134,1],[118,0,120,0],[118,1,119,1],[121,0,123,0],[121,1,122,1],[124,0,126,0],[124,1,125,1],[145,0,147,0],[145,1,146,1],[148,0,150,0],[148,1,149,1],[151,0,153,0],[151,1,152,1],[136,0,138,0],[136,1,137,1],[139,0,141,0],[139,1,140,1],[142,0,144,0],[142,1,143,1],[166,1,167,1],[169,0,171,0],[169,1,170,1],[154,0,156,0],[154,1,155,1],[157,0,159,0],[157,1,158,1],[160,0,162,0],[160,1,161,1],[14,1,14,14],[199,0,201,0],[199,1,200,1],[190,0,192,0],[190,1,191,1],[193,0,195,0],[193,1,194,1],[196,0,198,0],[196,1,197,1],[181,0,183,0],[181,1,182,1],[184,0,186,0],[184,1,185,1],[187,0,189,0],[187,1,188,1],[172,0,174,0],[172,1,173,1],[175,0,177,0],[175,1,176,1],[178,0,180,0],[178,1,179,1],[163,0,165,0],[163,1,164,1],[166,0,168,0]]}
[]
[]
[]
[]
[]
[]
[]
[]
[]
[]
[]
[]
[]
[null,"Tracking Form"]
[null,"The first row shown, labelled \"Original Application\", summarizes key statistics based on the data inputs into the RRWF. After the original application filing, the applicant provides key changes in capital and operating expenses, load forecasts, cost of capital, etc., as revised through the processing of the application. This could be due to revisions or responses to interrogatories. The last row shown is the most current estimate of the cost of service data reflecting the original application and any updates provided by the applicant distributor (for updated evidence, responses to interrogatories, undertakings, etc.)\nPlease ensure a Reference (Column B) and/or Item Description (Column C) is entered. \n(1) Short reference to evidence material (interrogatory response, undertaking, exhibit number, Board Decision, Code, Guideline, Report of the Board, etc.)\n(2) Short description of change, issue, etc.\n\n60 Tracking Rows have been provided below.  If you require more, please contact Industry Relations @ IndustryRelations@ontarioenergyboard.ca. "]
[null,"Summary of Proposed Changes"]
[]
[null,null,null,"Cost of Capital",null,"Rate Base and Capital Expenditures",null,null,"Operating Expenses",null,null,"Revenue Requirement"]
[null,"Reference (1)","Item / Description (2)","Regulated Return on Capital","Regulated Rate of Return","Rate Base","Working Capital","Working Capital Allowance ($)","Amortization / Depreciation","Taxes/PILs","OM&A","Service Revenue Requirement","Other Revenues","Base Revenue Requirement","Grossed up Revenue Deficiency / Sufficiency"]
[]
[null,null,"Original Application",{"$f":"'7. Cost_of_Capital'!P27","v":921172.90158820921},{"$f":"'7. Cost_of_Capital'!L27","v":5.9255883630069034E-2},{"$f":"'4. Rate_Base'!G19","v":15545678.254315417},{"$f":"'4. Rate_Base'!G26","v":19640390.276372183},{"$f":"'4. Rate_Base'!G30","v":1473029.2707279136},{"$f":"'9. Rev_Reqt'!F16","v":685011.58},{"$f":"'9. Rev_Reqt'!F19","v":0},{"$f":"'9. Rev_Reqt'!F15","v":3718936.3182769576},{"$f":"'9. Rev_Reqt'!F25","v":5359497.3971811663},{"$f":"'9. Rev_Reqt'!F32","v":400306.04506999999},{"$f":"'9. Rev_Reqt'!F28","v":4959191.3521111663},{"$f":"'8. Rev_Def_Suff'!F52","v":1268827.8585785055}]
[]
[1,null,null,null,null,null,null,null,null,null,null,null,null,null,null,null,{"$f":"IF(AND(ISBLANK(B23), ISBLANK(C23)), \"X\", \"\")","v":"X"}]
[null,null,"          Change",{"$f":"IF(D23=\"\",\"\",D23-D21)","v":""},{"$f":"IF(E23=\"\",\"\",E23-E21)","v":""},"","","","","","","","","",""]
[]
[2,null,null,null,null,null,null,null,null,null,null,null,null,null,null,null,{"$f":"IF(AND(ISBLANK(B26), ISBLANK(C26)), \"X\", \"\")","v":"X"}]
[null,null,"          Change",{"$f":"IF(D26=\"\",\"\",D26-D23)","v":""},"","","","","","","","","","",""]
[]
[3,null,null,null,null,null,null,null,null,null,null,null,null,null,null,null,{"$f":"IF(AND(ISBLANK(B29), ISBLANK(C29)), \"X\", \"\")","v":"X"}]
[null,null,"          Change",{"$f":"IF(D29=\"\",\"\",D29-D26)","v":""},{"$f":"IF(E29=\"\",\"\",E29-E26)","v":""},"","","","","","","","","",""]
[]
[4,null,null,null,null,null,null,null,null,null,null,null,null,null,null,null,{"$f":"IF(AND(ISBLANK(B32), ISBLANK(C32)), \"X\", \"\")","v":"X"}]
[null,null,"          Change",{"$f":"IF(D32=\"\",\"\",D32-D29)","v":""},{"$f":"IF(E32=\"\",\"\",E32-E29)","v":""},"","","","","","","","","",""]
[]
[5,null,null,null,null,null,null,null,null,null,null,null,null,null,null,null,{"$f":"IF(AND(ISBLANK(B35), ISBLANK(C35)), \"X\", \"\")","v":"X"}]
[null,null,"          Change",{"$f":"IF(D35=\"\",\"\",D35-D32)","v":""},{"$f":"IF(E35=\"\",\"\",E35-E32)","v":""},"","","","","","","","","",""]
[]
[6,null,null,null,null,null,null,null,null,null,null,null,null,null,null,null,{"$f":"IF(AND(ISBLANK(B38), ISBLANK(C38)), \"X\", \"\")","v":"X"}]
[null,null,"          Change",{"$f":"IF(D38=\"\",\"\",D38-D35)","v":""},{"$f":"IF(E38=\"\",\"\",E38-E35)","v":""},"","","","","","","","","",""]
[]
[7,null,null,null,null,null,null,null,null,null,null,null,null,null,null,null,{"$f":"IF(AND(ISBLANK(B41), ISBLANK(C41)), \"X\", \"\")","v":"X"}]
[null,null,"          Change",{"$f":"IF(D41=\"\",\"\",D41-D38)","v":""},{"$f":"IF(E41=\"\",\"\",E41-E38)","v":""},"","","","","","","","","",""]
[]
[8,null,null,null,null,null,null,null,null,null,null,null,null,null,null,null,{"$f":"IF(AND(ISBLANK(B44), ISBLANK(C44)), \"X\", \"\")","v":"X"}]
[null,null,"          Change",{"$f":"IF(D44=\"\",\"\",D44-D41)","v":""},{"$f":"IF(E44=\"\",\"\",E44-E41)","v":""},"","","","","","","","","",""]
[]
[9,null,null,null,null,null,null,null,null,null,null,null,null,null,null,null,{"$f":"IF(AND(ISBLANK(B47), ISBLANK(C47)), \"X\", \"\")","v":"X"}]
[null,null,"          Change",{"$f":"IF(D47=\"\",\"\",D47-D44)","v":""},{"$f":"IF(E47=\"\",\"\",E47-E44)","v":""},"","","","","","","","","",""]
[]
[10,null,null,null,null,null,null,null,null,null,null,null,null,null,null,null,{"$f":"IF(AND(ISBLANK(B50), ISBLANK(C50)), \"X\", \"\")","v":"X"}]
[null,null,"          Change",{"$f":"IF(D50=\"\",\"\",D50-D47)","v":""},{"$f":"IF(E50=\"\",\"\",E50-E47)","v":""},"","","","","","","","","",""]
[]
[11,null,null,null,null,null,null,null,null,null,null,null,null,null,null,null,{"$f":"IF(AND(ISBLANK(B53), ISBLANK(C53)), \"X\", \"\")","v":"X"}]
[null,null,"          Change",{"$f":"IF(D53=\"\",\"\",D53-D50)","v":""},{"$f":"IF(E53=\"\",\"\",E53-E50)","v":""},"","","","","","","","","",""]
[]
[12,null,null,null,null,null,null,null,null,null,null,null,null,null,null,null,{"$f":"IF(AND(ISBLANK(B56), ISBLANK(C56)), \"X\", \"\")","v":"X"}]
[null,null,"          Change",{"$f":"IF(D56=\"\",\"\",D56-D53)","v":""},{"$f":"IF(E56=\"\",\"\",E56-E53)","v":""},"","","","","","","","","",""]
[]
[13,null,null,null,null,null,null,null,null,null,null,null,null,null,null,null,{"$f":"IF(AND(ISBLANK(B59), ISBLANK(C59)), \"X\", \"\")","v":"X"}]
[null,null,"          Change",{"$f":"IF(D59=\"\",\"\",D59-D56)","v":""},{"$f":"IF(E59=\"\",\"\",E59-E56)","v":""},"","","","","","","","","",""]
[]
[14,null,null,null,null,null,null,null,null,null,null,null,null,null,null,null,{"$f":"IF(AND(ISBLANK(B62), ISBLANK(C62)), \"X\", \"\")","v":"X"}]
[null,null,"          Change",{"$f":"IF(D62=\"\",\"\",D62-D59)","v":""},{"$f":"IF(E62=\"\",\"\",E62-E59)","v":""},"","","","","","","","","",""]
[]
[15,null,null,null,null,null,null,null,null,null,null,null,null,null,null,null,{"$f":"IF(AND(ISBLANK(B65), ISBLANK(C65)), \"X\", \"\")","v":"X"}]
[null,null,"          Change",{"$f":"IF(D65=\"\",\"\",D65-D62)","v":""},{"$f":"IF(E65=\"\",\"\",E65-E62)","v":""},"","","","","","","","","",""]
[]
[16,null,null,null,null,null,null,null,null,null,null,null,null,null,null,null,{"$f":"IF(AND(ISBLANK(B68), ISBLANK(C68)), \"X\", \"\")","v":"X"}]
[null,null,"          Change",{"$f":"IF(D68=\"\",\"\",D68-D65)","v":""},{"$f":"IF(E68=\"\",\"\",E68-E65)","v":""},"","","","","","","","","",""]
[]
[17,null,null,null,null,null,null,null,null,null,null,null,null,null,null,null,{"$f":"IF(AND(ISBLANK(B71), ISBLANK(C71)), \"X\", \"\")","v":"X"}]
[null,null,"          Change",{"$f":"IF(D71=\"\",\"\",D71-D68)","v":""},{"$f":"IF(E71=\"\",\"\",E71-E68)","v":""},"","","","","","","","","",""]
[]
[18,null,null,null,null,null,null,null,null,null,null,null,null,null,null,null,{"$f":"IF(AND(ISBLANK(B74), ISBLANK(C74)), \"X\", \"\")","v":"X"}]
[null,null,"          Change",{"$f":"IF(D74=\"\",\"\",D74-D71)","v":""},{"$f":"IF(E74=\"\",\"\",E74-E71)","v":""},"","","","","","","","","",""]
[null,null,null,null,null,null,null,null,null,null,null,null,null,null,null,null,null,"Page Break 1"]
[19,null,null,null,null,null,null,null,null,null,null,null,null,null,null,null,{"$f":"IF(AND(ISBLANK(B77), ISBLANK(C77)), \"X\", \"\")","v":"X"}]
[null,null,"          Change",{"$f":"IF(D77=\"\",\"\",D77-D74)","v":""},{"$f":"IF(E77=\"\",\"\",E77-E74)","v":""},"","","","","","","","","",""]
[]
[20,null,null,null,null,null,null,null,null,null,null,null,null,null,null,null,{"$f":"IF(AND(ISBLANK(B80), ISBLANK(C80)), \"X\", \"\")","v":"X"}]
[null,null,"          Change",{"$f":"IF(D80=\"\",\"\",D80-D77)","v":""},{"$f":"IF(E80=\"\",\"\",E80-E77)","v":""},"","","","","","","","","",""]
[]
[21,null,null,null,null,null,null,null,null,null,null,null,null,null,null,null,{"$f":"IF(AND(ISBLANK(B83), ISBLANK(C83)), \"X\", \"\")","v":"X"}]
[null,null,"          Change",{"$f":"IF(D83=\"\",\"\",D83-D80)","v":""},{"$f":"IF(E83=\"\",\"\",E83-E80)","v":""},"","","","","","","","","",""]
[]
[22,null,null,null,null,null,null,null,null,null,null,null,null,null,null,null,{"$f":"IF(AND(ISBLANK(B86), ISBLANK(C86)), \"X\", \"\")","v":"X"}]
[null,null,"          Change",{"$f":"IF(D86=\"\",\"\",D86-D83)","v":""},{"$f":"IF(E86=\"\",\"\",E86-E83)","v":""},"","","","","","","","","",""]
[]
[23,null,null,null,null,null,null,null,null,null,null,null,null,null,null,null,{"$f":"IF(AND(ISBLANK(B89), ISBLANK(C89)), \"X\", \"\")","v":"X"}]
[null,null,"          Change",{"$f":"IF(D89=\"\",\"\",D89-D86)","v":""},{"$f":"IF(E89=\"\",\"\",E89-E86)","v":""},"","","","","","","","","",""]
[]
[24,null,null,null,null,null,null,null,null,null,null,null,null,null,null,null,{"$f":"IF(AND(ISBLANK(B92), ISBLANK(C92)), \"X\", \"\")","v":"X"}]
[null,null,"          Change",{"$f":"IF(D92=\"\",\"\",D92-D89)","v":""},{"$f":"IF(E92=\"\",\"\",E92-E89)","v":""},"","","","","","","","","",""]
[]
[25,null,null,null,null,null,null,null,null,null,null,null,null,null,null,null,{"$f":"IF(AND(ISBLANK(B95), ISBLANK(C95)), \"X\", \"\")","v":"X"}]
[null,null,"          Change",{"$f":"IF(D95=\"\",\"\",D95-D92)","v":""},{"$f":"IF(E95=\"\",\"\",E95-E92)","v":""},"","","","","","","","","",""]
[]
[26,null,null,null,null,null,null,null,null,null,null,null,null,null,null,null,{"$f":"IF(AND(ISBLANK(B98), ISBLANK(C98)), \"X\", \"\")","v":"X"}]
[null,null,"          Change",{"$f":"IF(D98=\"\",\"\",D98-D95)","v":""},{"$f":"IF(E98=\"\",\"\",E98-E95)","v":""},"","","","","","","","","",""]
[]
[27,null,null,null,null,null,null,null,null,null,null,null,null,null,null,null,{"$f":"IF(AND(ISBLANK(B101), ISBLANK(C101)), \"X\", \"\")","v":"X"}]
[null,null,"          Change",{"$f":"IF(D101=\"\",\"\",D101-D98)","v":""},{"$f":"IF(E101=\"\",\"\",E101-E98)","v":""},"","","","","","","","","",""]
[]
[28,null,null,null,null,null,null,null,null,null,null,null,null,null,null,null,{"$f":"IF(AND(ISBLANK(B104), ISBLANK(C104)), \"X\", \"\")","v":"X"}]
[null,null,"          Change",{"$f":"IF(D104=\"\",\"\",D104-D101)","v":""},{"$f":"IF(E104=\"\",\"\",E104-E101)","v":""},"","","","","","","","","",""]
[]
[29,null,null,null,null,null,null,null,null,null,null,null,null,null,null,null,{"$f":"IF(AND(ISBLANK(B107), ISBLANK(C107)), \"X\", \"\")","v":"X"}]
[null,null,"          Change",{"$f":"IF(D107=\"\",\"\",D107-D104)","v":""},{"$f":"IF(E107=\"\",\"\",E107-E104)","v":""},"","","","","","","","","",""]
[]
[30,null,null,null,null,null,null,null,null,null,null,null,null,null,null,null,{"$f":"IF(AND(ISBLANK(B110), ISBLANK(C110)), \"X\", \"\")","v":"X"}]
[null,null,"          Change",{"$f":"IF(D110=\"\",\"\",D110-D107)","v":""},{"$f":"IF(E110=\"\",\"\",E110-E107)","v":""},"","","","","","","","","",""]
[]
[31,null,null,null,null,null,null,null,null,null,null,null,null,null,null,null,{"$f":"IF(AND(ISBLANK(B113), ISBLANK(C113)), \"X\", \"\")","v":"X"}]
[null,null,"          Change",{"$f":"IF(D113=\"\",\"\",D113-D110)","v":""},{"$f":"IF(E113=\"\",\"\",E113-E110)","v":""},"","","","","","","","","",""]
[]
[32,null,null,null,null,null,null,null,null,null,null,null,null,null,null,null,{"$f":"IF(AND(ISBLANK(B116), ISBLANK(C116)), \"X\", \"\")","v":"X"}]
[null,null,"          Change",{"$f":"IF(D116=\"\",\"\",D116-D113)","v":""},{"$f":"IF(E116=\"\",\"\",E116-E113)","v":""},"","","","","","","","","",""]
[]
[33,null,null,null,null,null,null,null,null,null,null,null,null,null,null,null,{"$f":"IF(AND(ISBLANK(B119), ISBLANK(C119)), \"X\", \"\")","v":"X"}]
[null,null,"          Change",{"$f":"IF(D119=\"\",\"\",D119-D116)","v":""},{"$f":"IF(E119=\"\",\"\",E119-E116)","v":""},"","","","","","","","","",""]
[]
[34,null,null,null,null,null,null,null,null,null,null,null,null,null,null,null,{"$f":"IF(AND(ISBLANK(B122), ISBLANK(C122)), \"X\", \"\")","v":"X"}]
[null,null,"          Change",{"$f":"IF(D122=\"\",\"\",D122-D119)","v":""},{"$f":"IF(E122=\"\",\"\",E122-E119)","v":""},"","","","","","","","","",""]
[]
[35,null,null,null,null,null,null,null,null,null,null,null,null,null,null,null,{"$f":"IF(AND(ISBLANK(B125), ISBLANK(C125)), \"X\", \"\")","v":"X"}]
[null,null,"          Change",{"$f":"IF(D125=\"\",\"\",D125-D122)","v":""},{"$f":"IF(E125=\"\",\"\",E125-E122)","v":""},"","","","","","","","","",""]
[]
[36,null,null,null,null,null,null,null,null,null,null,null,null,null,null,null,{"$f":"IF(AND(ISBLANK(B128), ISBLANK(C128)), \"X\", \"\")","v":"X"}]
[null,null,"          Change",{"$f":"IF(D128=\"\",\"\",D128-D125)","v":""},{"$f":"IF(E128=\"\",\"\",E128-E125)","v":""},"","","","","","","","","",""]
[null,null,null,null,null,null,null,null,null,null,null,null,null,null,null,null,null,"Page Break 2"]
[37,null,null,null,null,null,null,null,null,null,null,null,null,null,null,null,{"$f":"IF(AND(ISBLANK(B131), ISBLANK(C131)), \"X\", \"\")","v":"X"}]
[null,null,"          Change",{"$f":"IF(D131=\"\",\"\",D131-D128)","v":""},{"$f":"IF(E131=\"\",\"\",E131-E128)","v":""},"","","","","","","","","",""]
[]
[38,null,null,null,null,null,null,null,null,null,null,null,null,null,null,null,{"$f":"IF(AND(ISBLANK(B134), ISBLANK(C134)), \"X\", \"\")","v":"X"}]
[null,null,"          Change",{"$f":"IF(D134=\"\",\"\",D134-D131)","v":""},{"$f":"IF(E134=\"\",\"\",E134-E131)","v":""},"","","","","","","","","",""]
[]
[39,null,null,null,null,null,null,null,null,null,null,null,null,null,null,null,{"$f":"IF(AND(ISBLANK(B137), ISBLANK(C137)), \"X\", \"\")","v":"X"}]
[null,null,"          Change",{"$f":"IF(D137=\"\",\"\",D137-D134)","v":""},{"$f":"IF(E137=\"\",\"\",E137-E134)","v":""},"","","","","","","","","",""]
[]
[40,null,null,null,null,null,null,null,null,null,null,null,null,null,null,null,{"$f":"IF(AND(ISBLANK(B140), ISBLANK(C140)), \"X\", \"\")","v":"X"}]
[null,null,"          Change",{"$f":"IF(D140=\"\",\"\",D140-D137)","v":""},{"$f":"IF(E140=\"\",\"\",E140-E137)","v":""},"","","","","","","","","",""]
[]
[41,null,null,null,null,null,null,null,null,null,null,null,null,null,null,null,{"$f":"IF(AND(ISBLANK(B143), ISBLANK(C143)), \"X\", \"\")","v":"X"}]
[null,null,"          Change",{"$f":"IF(D143=\"\",\"\",D143-D140)","v":""},{"$f":"IF(E143=\"\",\"\",E143-E140)","v":""},"","","","","","","","","",""]
[]
[42,null,null,null,null,null,null,null,null,null,null,null,null,null,null,null,{"$f":"IF(AND(ISBLANK(B146), ISBLANK(C146)), \"X\", \"\")","v":"X"}]
[null,null,"          Change",{"$f":"IF(D146=\"\",\"\",D146-D143)","v":""},{"$f":"IF(E146=\"\",\"\",E146-E143)","v":""},"","","","","","","","","",""]
[]
[43,null,null,null,null,null,null,null,null,null,null,null,null,null,null,null,{"$f":"IF(AND(ISBLANK(B149), ISBLANK(C149)), \"X\", \"\")","v":"X"}]
[null,null,"          Change",{"$f":"IF(D149=\"\",\"\",D149-D146)","v":""},{"$f":"IF(E149=\"\",\"\",E149-E146)","v":""},"","","","","","","","","",""]
[]
[44,null,null,null,null,null,null,null,null,null,null,null,null,null,null,null,{"$f":"IF(AND(ISBLANK(B152), ISBLANK(C152)), \"X\", \"\")","v":"X"}]
[null,null,"          Change",{"$f":"IF(D152=\"\",\"\",D152-D149)","v":""},{"$f":"IF(E152=\"\",\"\",E152-E149)","v":""},"","","","","","","","","",""]
[]
[45,null,null,null,null,null,null,null,null,null,null,null,null,null,null,null,{"$f":"IF(AND(ISBLANK(B155), ISBLANK(C155)), \"X\", \"\")","v":"X"}]
[null,null,"          Change",{"$f":"IF(D155=\"\",\"\",D155-D152)","v":""},{"$f":"IF(E155=\"\",\"\",E155-E152)","v":""},"","","","","","","","","",""]
[]
[46,null,null,null,null,null,null,null,null,null,null,null,null,null,null,null,{"$f":"IF(AND(ISBLANK(B158), ISBLANK(C158)), \"X\", \"\")","v":"X"}]
[null,null,"          Change",{"$f":"IF(D158=\"\",\"\",D158-D155)","v":""},{"$f":"IF(E158=\"\",\"\",E158-E155)","v":""},"","","","","","","","","",""]
[]
[47,null,null,null,null,null,null,null,null,null,null,null,null,null,null,null,{"$f":"IF(AND(ISBLANK(B161), ISBLANK(C161)), \"X\", \"\")","v":"X"}]
[null,null,"          Change",{"$f":"IF(D161=\"\",\"\",D161-D158)","v":""},{"$f":"IF(E161=\"\",\"\",E161-E158)","v":""},"","","","","","","","","",""]
[]
[48,null,null,null,null,null,null,null,null,null,null,null,null,null,null,null,{"$f":"IF(AND(ISBLANK(B164), ISBLANK(C164)), \"X\", \"\")","v":"X"}]
[null,null,"          Change",{"$f":"IF(D164=\"\",\"\",D164-D161)","v":""},{"$f":"IF(E164=\"\",\"\",E164-E161)","v":""},"","","","","","","","","",""]
[]
[49,null,null,null,null,null,null,null,null,null,null,null,null,null,null,null,{"$f":"IF(AND(ISBLANK(B167), ISBLANK(C167)), \"X\", \"\")","v":"X"}]
[null,null,"          Change",{"$f":"IF(D167=\"\",\"\",D167-D164)","v":""},{"$f":"IF(E167=\"\",\"\",E167-E164)","v":""},"","","","","","","","","",""]
[]
[50,null,null,null,null,null,null,null,null,null,null,null,null,null,null,null,{"$f":"IF(AND(ISBLANK(B170), ISBLANK(C170)), \"X\", \"\")","v":"X"}]
[null,null,"          Change",{"$f":"IF(D170=\"\",\"\",D170-D167)","v":""},{"$f":"IF(E170=\"\",\"\",E170-E167)","v":""},"","","","","","","","","",""]
[]
[51,null,null,null,null,null,null,null,null,null,null,null,null,null,null,null,{"$f":"IF(AND(ISBLANK(B173), ISBLANK(C173)), \"X\", \"\")","v":"X"}]
[null,null,"          Change",{"$f":"IF(D173=\"\",\"\",D173-D170)","v":""},{"$f":"IF(E173=\"\",\"\",E173-E170)","v":""},"","","","","","","","","",""]
[]
[52,null,null,null,null,null,null,null,null,null,null,null,null,null,null,null,{"$f":"IF(AND(ISBLANK(B176), ISBLANK(C176)), \"X\", \"\")","v":"X"}]
[null,null,"          Change",{"$f":"IF(D176=\"\",\"\",D176-D173)","v":""},{"$f":"IF(E176=\"\",\"\",E176-E173)","v":""},"","","","","","","","","",""]
[]
[53,null,null,null,null,null,null,null,null,null,null,null,null,null,null,null,{"$f":"IF(AND(ISBLANK(B179), ISBLANK(C179)), \"X\", \"\")","v":"X"}]
[null,null,"          Change",{"$f":"IF(D179=\"\",\"\",D179-D176)","v":""},{"$f":"IF(E179=\"\",\"\",E179-E176)","v":""},"","","","","","","","","",""]
[null,null,null,null,null,null,null,null,null,null,null,null,null,null,null,null,null,"Page Break 3"]
[54,null,null,null,null,null,null,null,null,null,null,null,null,null,null,null,{"$f":"IF(AND(ISBLANK(B182), ISBLANK(C182)), \"X\", \"\")","v":"X"}]
[null,null,"          Change",{"$f":"IF(D182=\"\",\"\",D182-D179)","v":""},{"$f":"IF(E182=\"\",\"\",E182-E179)","v":""},"","","","","","","","","",""]
[]
[55,null,null,null,null,null,null,null,null,null,null,null,null,null,null,null,{"$f":"IF(AND(ISBLANK(B185), ISBLANK(C185)), \"X\", \"\")","v":"X"}]
[null,null,"          Change",{"$f":"IF(D185=\"\",\"\",D185-D182)","v":""},{"$f":"IF(E185=\"\",\"\",E185-E182)","v":""},"","","","","","","","","",""]
[]
[56,null,null,null,null,null,null,null,null,null,null,null,null,null,null,null,{"$f":"IF(AND(ISBLANK(B188), ISBLANK(C188)), \"X\", \"\")","v":"X"}]
[null,null,"          Change",{"$f":"IF(D188=\"\",\"\",D188-D185)","v":""},{"$f":"IF(E188=\"\",\"\",E188-E185)","v":""},"","","","","","","","","",""]
[]
[57,null,null,null,null,null,null,null,null,null,null,null,null,null,null,null,{"$f":"IF(AND(ISBLANK(B191), ISBLANK(C191)), \"X\", \"\")","v":"X"}]
[null,null,"          Change",{"$f":"IF(D191=\"\",\"\",D191-D188)","v":""},{"$f":"IF(E191=\"\",\"\",E191-E188)","v":""},"","","","","","","","","",""]
[]
[58,null,null,null,null,null,null,null,null,null,null,null,null,null,null,null,{"$f":"IF(AND(ISBLANK(B194), ISBLANK(C194)), \"X\", \"\")","v":"X"}]
[null,null,"          Change",{"$f":"IF(D194=\"\",\"\",D194-D191)","v":""},{"$f":"IF(E194=\"\",\"\",E194-E191)","v":""},"","","","","","","","","",""]
[]
[59,null,null,null,null,null,null,null,null,null,null,null,null,null,null,null,{"$f":"IF(AND(ISBLANK(B197), ISBLANK(C197)), \"X\", \"\")","v":"X"}]
[null,null,"          Change",{"$f":"IF(D197=\"\",\"\",D197-D194)","v":""},{"$f":"IF(E197=\"\",\"\",E197-E194)","v":""},"","","","","","","","","",""]
[]
[60,null,null,null,null,null,null,null,null,null,null,null,null,null,null,null,{"$f":"IF(AND(ISBLANK(B200), ISBLANK(C200)), \"X\", \"\")","v":"X"}]
[null,null,"          Change",{"$f":"IF(D200=\"\",\"\",D200-D197)","v":""},{"$f":"IF(E200=\"\",\"\",E200-E197)","v":""},"","","","","","","","","",""]
[]
[null,null,null,null,null,null,null,null,null,null,null,null,null,null,null,null,null,"Page Break 4"]

{"sheet":"11. Cost_Allocation RSL","index":16,"n_rows":129,"n_cols":15,"rows_kept":129,"cut":false,"hidden":false,"merged":[[102,3,102,13],[103,12,103,13],[104,5,104,6],[104,7,104,8],[45,12,45,13],[46,5,46,6],[46,7,46,8],[73,3,73,13],[74,12,74,13],[75,5,75,6],[75,7,75,8],[44,3,44,13],[13,1,13,9],[16,3,16,13],[17,12,17,13],[18,5,18,6],[18,7,18,8]]}
[]
[]
[]
[]
[]
[]
[]
[]
[]
[]
[]
[]
[]
[null,"Cost Allocation and Rate Design"]
[]
[]
[null,null,null,{"$f":"'3. Data_Input_Sheet'!E12","v":"Initial Application"}]
[null,null,null,null,null,null,null,null,null,null,null,null,"Multi Year Adjustments"]
[null,null,"Name of Customer Class ","Revenue To Expense Status Quo % ","Service Rev Req  ($)","Cost Allocation Results (Base Rev Req)",null,"Proposed Allocation (Base Rev Req) ",null,"Misc. Revenues $","Cost Allocation Results (Serv Rev Req)","Proposed Ratios (Test Year)","Test Year (+1)","Test Year (+2)","Policy Range"]
[null,null,null,"(CA Row 75)","(CA Row 40)","$","%","$","%","(CA Row 19)","$"," "," "," "]
[]
[null,1,{"$f":"IF(ISBLANK('10. Load Forecast'!D28),\"\",'10. Load Forecast'!D28)","v":""},1.0034163760402985,3155186.2359095989,{"$f":"'9. Rev_Reqt'!$F$31*G22","v":2894173.9878594493},{"$f":"(E22-J22)/($E$43-$J$43)","v":0.58359796635541739},{"$f":"'11. Cost_Allocation'!I62","v":2903639.5465671774},{"$f":"H22/$H$43","v":0.58550665630820542},{"$f":"'11. Cost_Allocation'!K62","v":261012.24805014933},{"$f":"F22+J22","v":3155186.2359095989},{"$f":"IF(ISBLANK(H22),\"\",(H22+J22)/E22)","v":1.0029999999999997},null,null,"85-115"]
[null,2,{"$f":"IF(ISBLANK('10. Load Forecast'!D29),\"\",'10. Load Forecast'!D29)","v":"Residential"},1.151430136913101,864927.62232879596,{"$f":"'9. Rev_Reqt'!$F$31*G23","v":805232.3994551053},0.16237171391104149,{"$f":"'11. Cost_Allocation'!I63","v":918478.97061500885},{"$f":"H23/$H$43","v":0.18520740689386894},{"$f":"'11. Cost_Allocation'!K63","v":59695.222873690618},{"$f":"F23+J23","v":864927.62232879596},{"$f":"IF(ISBLANK(H23),\"\",(H23+J23)/E23)","v":1.1309318470544274},null,null,"80-120"]
[null,3,{"$f":"IF(ISBLANK('10. Load Forecast'!D30),\"\",'10. Load Forecast'!D30)","v":"General Service < 50 kW"},0.93337965400076017,1032405.0083518414,{"$f":"'9. Rev_Reqt'!$F$31*G24","v":988877.77133992722},0.1994030278583532,{"$f":"'11. Cost_Allocation'!I64","v":919706.63578035403},0.18545496039164283,{"$f":"'11. Cost_Allocation'!K64","v":43527.237011914149},1032405.0083518414,0.93300000000000016,null,null,"80-120"]
[null,4,{"$f":"IF(ISBLANK('10. Load Forecast'!D31),\"\",'10. Load Forecast'!D31)","v":"General Service > 50 to 4999 kW"},1.507059132973956,19636.779525319322,{"$f":"'9. Rev_Reqt'!$F$31*G25","v":18003.653150677455},3.6303606520472656E-3,{"$f":"'11. Cost_Allocation'!I65","v":21931.00905574132},4.4222953902363776E-3,{"$f":"'11. Cost_Allocation'!K65","v":1633.1263746418651},19636.779525319322,1.2,null,null,"80-120"]
[null,5,{"$f":"IF(ISBLANK('10. Load Forecast'!D32),\"\",'10. Load Forecast'!D32)","v":"Unmetered Scattered Load"},0.46341753251487183,26645.89141480382,{"$f":"'9. Rev_Reqt'!$F$31*G26","v":24648.427253228372},4.9702512976708075E-3,{"$f":"'11. Cost_Allocation'!I66","v":19319.248970267603},3.8956449950339682E-3,{"$f":"'11. Cost_Allocation'!K66","v":1997.4641615754485},26645.89141480382,0.79999999999999982,null,null,"80-120"]
[null,6,{"$f":"IF(ISBLANK('10. Load Forecast'!D33),\"\",'10. Load Forecast'!D33)","v":"Sentinel"},0.73672185515637079,260695.85965080737,{"$f":"'9. Rev_Reqt'!$F$31*G27","v":228255.11305277879},4.6026679925469868E-2,{"$f":"'11. Cost_Allocation'!I67","v":176115.94112261728},3.5513036021012447E-2,{"$f":"'11. Cost_Allocation'!K67","v":32440.746598028589},260695.85965080737,{"$f":"IF(ISBLANK(H27),\"\",(H27+J27)/K27)","v":0.79999999999999982},null,null,"80-120"]
[null,7,{"$f":"IF(ISBLANK('10. Load Forecast'!D34),\"\",'10. Load Forecast'!D34)","v":"StreetLights"},null,null,{"$f":"'9. Rev_Reqt'!$F$31*G28","v":0},{"$f":"IF(ISBLANK(E28),0,(E28-J28)/($E$43-$J$43))","v":0},null,0,null,0,"","","","80-120"]
[null,8,{"$f":"IF(ISBLANK('10. Load Forecast'!D35),\"\",'10. Load Forecast'!D35)","v":""},null,null,{"$f":"'9. Rev_Reqt'!$F$31*G29","v":0},{"$f":"IF(ISBLANK(E29),0,(E29-J29)/($E$43-$J$43))","v":0},null,0,null,0,"","","","80-120"]
[null,9,{"$f":"IF(ISBLANK('10. Load Forecast'!D36),\"\",'10. Load Forecast'!D36)","v":""},null,null,{"$f":"'9. Rev_Reqt'!$F$31*G30","v":0},0,null,0,null,0,"","","","80-120"]
[null,10,{"$f":"IF(ISBLANK('10. Load Forecast'!D37),\"\",'10. Load Forecast'!D37)","v":""},null,null,{"$f":"'9. Rev_Reqt'!$F$31*G31","v":0},0,null,0,null,0,"","","","80-120"]
[null,11,{"$f":"IF(ISBLANK('10. Load Forecast'!D38),\"\",'10. Load Forecast'!D38)","v":""},null,null,{"$f":"'9. Rev_Reqt'!$F$31*G32","v":0},0,null,0,null,0,"","","","80-120"]
[null,12,{"$f":"IF(ISBLANK('10. Load Forecast'!D39),\"\",'10. Load Forecast'!D39)","v":""},null,null,{"$f":"'9. Rev_Reqt'!$F$31*G33","v":0},0,null,0,null,0,"","","","80-120"]
[null,13,{"$f":"IF(ISBLANK('10. Load Forecast'!D40),\"\",'10. Load Forecast'!D40)","v":""},null,null,{"$f":"'9. Rev_Reqt'!$F$31*G34","v":0},0,null,0,null,0,"","","","80-120"]
[null,14,{"$f":"IF(ISBLANK('10. Load Forecast'!D41),\"\",'10. Load Forecast'!D41)","v":""},null,null,{"$f":"'9. Rev_Reqt'!$F$31*G35","v":0},0,null,0,null,0,"","","","80-120"]
[null,15,{"$f":"IF(ISBLANK('10. Load Forecast'!D42),\"\",'10. Load Forecast'!D42)","v":""},null,null,{"$f":"'9. Rev_Reqt'!$F$31*G36","v":0},0,null,0,null,0,"","","","80-120"]
[null,16,{"$f":"IF(ISBLANK('10. Load Forecast'!D43),\"\",'10. Load Forecast'!D43)","v":""},null,null,{"$f":"'9. Rev_Reqt'!$F$31*G37","v":0},0,null,0,null,0,"","","","80-120"]
[null,17,{"$f":"IF(ISBLANK('10. Load Forecast'!D44),\"\",'10. Load Forecast'!D44)","v":""},null,null,{"$f":"'9. Rev_Reqt'!$F$31*G38","v":0},0,null,0,null,0,"","","","80-120"]
[null,18,{"$f":"IF(ISBLANK('10. Load Forecast'!D45),\"\",'10. Load Forecast'!D45)","v":""},null,null,{"$f":"'9. Rev_Reqt'!$F$31*G39","v":0},0,null,0,null,0,"","","","80-120"]
[null,19,{"$f":"IF(ISBLANK('10. Load Forecast'!D46),\"\",'10. Load Forecast'!D46)","v":""},null,null,{"$f":"'9. Rev_Reqt'!$F$31*G40","v":0},0,null,0,null,0,"","","","80-120"]
[null,20,{"$f":"IF(ISBLANK('10. Load Forecast'!D47),\"\",'10. Load Forecast'!D47)","v":""},null,null,{"$f":"'9. Rev_Reqt'!$F$31*G41","v":0},0,null,0,null,0,"","","","80-120"]
[]
[null,null,"Total",null,{"$f":"SUM(E22:E41)","v":5359497.3971811663},4959191.3521111673,0.99999999999999989,4959191.3521111663,1,400306.04506999993,{"$f":"SUM(K22:K42)","v":5359497.3971811663}]
[]
[null,null,null,{"$f":"'3. Data_Input_Sheet'!M12","v":"Interrogatory Responses"}]
[null,null,null,null,null,null,null,null,null,null,null,null,"Multi Year Adjustments"]
[null,null,"Name of Customer Class ","Revenue To Expense Status Quo %","Service Rev Req %","Cost Allocation Results (Base Rev Req)",null,"Proposed Allocation (Base Rev Req) ",null,"Misc. Revenues $","Cost Allocation Results (Serv Rev Req)","Prposed Ratios","Test Year +1","Test Year +2","Policy Range"]
[null,null,null,"(CA Row 75)","(CA Row 40)","$","%","$","%","(CA Row 19)","$"," "," "," "]
[]
[null,1,{"$f":"IF(ISBLANK('10. Load Forecast'!D28),\"\",'10. Load Forecast'!D28)","v":""},null,null,{"$f":"'9. Rev_Reqt'!$J$31*G50","v":{"$error":"#DIV/0!"}},{"$f":"(E50-J50)/($E$71-$J$71)","v":{"$error":"#DIV/0!"}},null,{"$f":"H50/$H$71","v":{"$error":"#DIV/0!"}},null,{"$f":"F50+J50","v":{"$error":"#DIV/0!"}},{"$f":"IF(ISBLANK(H50),\"\",(H50+J50)/E50)","v":""},null,null,"85-115"]
[null,2,{"$f":"IF(ISBLANK('10. Load Forecast'!D29),\"\",'10. Load Forecast'!D29)","v":"Residential"},null,null,{"$f":"'9. Rev_Reqt'!$J$31*G51","v":{"$error":"#DIV/0!"}},{"$f":"(E51-J51)/($E$71-$J$71)","v":{"$error":"#DIV/0!"}},null,{"$f":"H51/$H$71","v":{"$error":"#DIV/0!"}},null,{"$f":"F51+J51","v":{"$error":"#DIV/0!"}},{"$f":"IF(ISBLANK(H51),\"\",(H51+J51)/E51)","v":""},null,null,"80-120"]
[null,3,{"$f":"IF(ISBLANK('10. Load Forecast'!D30),\"\",'10. Load Forecast'!D30)","v":"General Service < 50 kW"},null,null,{"$f":"'9. Rev_Reqt'!$J$31*G52","v":{"$error":"#DIV/0!"}},{"$error":"#DIV/0!"},null,{"$error":"#DIV/0!"},null,{"$error":"#DIV/0!"},"",null,null,"80-120"]
[null,4,{"$f":"IF(ISBLANK('10. Load Forecast'!D31),\"\",'10. Load Forecast'!D31)","v":"General Service > 50 to 4999 kW"},null,null,{"$f":"'9. Rev_Reqt'!$J$31*G53","v":{"$error":"#DIV/0!"}},{"$error":"#DIV/0!"},null,{"$error":"#DIV/0!"},null,{"$error":"#DIV/0!"},"",null,null,"80-120"]
[null,5,{"$f":"IF(ISBLANK('10. Load Forecast'!D32),\"\",'10. Load Forecast'!D32)","v":"Unmetered Scattered Load"},null,null,{"$f":"'9. Rev_Reqt'!$J$31*G54","v":{"$error":"#DIV/0!"}},{"$error":"#DIV/0!"},null,{"$error":"#DIV/0!"},null,{"$error":"#DIV/0!"},"",null,null,"80-120"]
[null,6,{"$f":"IF(ISBLANK('10. Load Forecast'!D33),\"\",'10. Load Forecast'!D33)","v":"Sentinel"},null,null,{"$f":"'9. Rev_Reqt'!$J$31*G55","v":{"$error":"#DIV/0!"}},{"$error":"#DIV/0!"},null,{"$error":"#DIV/0!"},null,{"$error":"#DIV/0!"},{"$f":"IF(ISBLANK(H55),\"\",(H55+J55)/K55)","v":""},null,null,"80-120"]
[null,7,{"$f":"IF(ISBLANK('10. Load Forecast'!D34),\"\",'10. Load Forecast'!D34)","v":"StreetLights"},null,null,{"$f":"'9. Rev_Reqt'!$J$31*G56","v":0},{"$f":"(E56-J56)/($E$43-$J$43)","v":0},null,{"$error":"#DIV/0!"},null,0,"","","","80-120"]
[null,8,{"$f":"IF(ISBLANK('10. Load Forecast'!D35),\"\",'10. Load Forecast'!D35)","v":""},null,null,{"$f":"'9. Rev_Reqt'!$J$31*G57","v":0},0,null,{"$error":"#DIV/0!"},null,0,"","","","80-120"]
[null,9,{"$f":"IF(ISBLANK('10. Load Forecast'!D36),\"\",'10. Load Forecast'!D36)","v":""},null,null,{"$f":"'9. Rev_Reqt'!$J$31*G58","v":0},0,null,{"$error":"#DIV/0!"},null,0,"","","","80-120"]
[null,10,{"$f":"IF(ISBLANK('10. Load Forecast'!D37),\"\",'10. Load Forecast'!D37)","v":""},null,null,{"$f":"'9. Rev_Reqt'!$J$31*G59","v":0},0,null,{"$error":"#DIV/0!"},null,0,"","","","80-120"]
[null,11,{"$f":"IF(ISBLANK('10. Load Forecast'!D38),\"\",'10. Load Forecast'!D38)","v":""},null,null,{"$f":"'9. Rev_Reqt'!$J$31*G60","v":0},0,null,{"$error":"#DIV/0!"},null,0,"","","","80-120"]
[null,12,{"$f":"IF(ISBLANK('10. Load Forecast'!D39),\"\",'10. Load Forecast'!D39)","v":""},null,null,{"$f":"'9. Rev_Reqt'!$J$31*G61","v":0},0,null,{"$error":"#DIV/0!"},null,0,"","","","80-120"]
[null,13,{"$f":"IF(ISBLANK('10. Load Forecast'!D40),\"\",'10. Load Forecast'!D40)","v":""},null,null,{"$f":"'9. Rev_Reqt'!$J$31*G62","v":0},0,null,{"$error":"#DIV/0!"},null,0,"","","","80-120"]
[null,14,{"$f":"IF(ISBLANK('10. Load Forecast'!D41),\"\",'10. Load Forecast'!D41)","v":""},null,null,{"$f":"'9. Rev_Reqt'!$J$31*G63","v":0},0,null,{"$error":"#DIV/0!"},null,0,"","","","80-120"]
[null,15,{"$f":"IF(ISBLANK('10. Load Forecast'!D42),\"\",'10. Load Forecast'!D42)","v":""},null,null,{"$f":"'9. Rev_Reqt'!$J$31*G64","v":0},0,null,{"$error":"#DIV/0!"},null,0,"","","","80-120"]
[null,16,{"$f":"IF(ISBLANK('10. Load Forecast'!D43),\"\",'10. Load Forecast'!D43)","v":""},null,null,{"$f":"'9. Rev_Reqt'!$J$31*G65","v":0},0,null,{"$error":"#DIV/0!"},null,0,"","","","80-120"]
[null,17,{"$f":"IF(ISBLANK('10. Load Forecast'!D44),\"\",'10. Load Forecast'!D44)","v":""},null,null,{"$f":"'9. Rev_Reqt'!$J$31*G66","v":0},0,null,{"$error":"#DIV/0!"},null,0,"","","","80-120"]
[null,18,{"$f":"IF(ISBLANK('10. Load Forecast'!D45),\"\",'10. Load Forecast'!D45)","v":""},null,null,{"$f":"'9. Rev_Reqt'!$J$31*G67","v":0},0,null,{"$error":"#DIV/0!"},null,0,"","","","80-120"]
[null,19,{"$f":"IF(ISBLANK('10. Load Forecast'!D46),\"\",'10. Load Forecast'!D46)","v":""},null,null,{"$f":"'9. Rev_Reqt'!$J$31*G68","v":0},0,null,{"$error":"#DIV/0!"},null,0,"","","","80-120"]
[null,20,{"$f":"IF(ISBLANK('10. Load Forecast'!D47),\"\",'10. Load Forecast'!D47)","v":""},null,null,{"$f":"'9. Rev_Reqt'!$J$31*G69","v":0},0,null,{"$error":"#DIV/0!"},null,0,"","","","80-120"]
[]
[null,null,"Total",null,{"$f":"SUM(E50:E69)","v":0},{"$error":"#DIV/0!"},{"$error":"#DIV/0!"},0,{"$error":"#DIV/0!"},0,{"$f":"SUM(K50:K70)","v":{"$error":"#DIV/0!"}}]
[]
[]
[null,null,null,{"$f":"'3. Data_Input_Sheet'!U12","v":"Settlement Agreement"}]
[null,null,null,null,null,null,null,null,null,null,null,null,"Multi Year Adjustments"]
[null,null,"Name of Customer Class ","Revenue To Expense Status Quo %","Service Rev Req %","Cost Allocation Results (Base Rev Req)",null,"Proposed Allocation (Base Rev Req) ",null,"Misc. Revenues $","Cost Allocation Results (Serv Rev Req)","Prposed Ratios","Test Year +1","Test Year +2","Policy Range"]
[null,null,null,"(CA Row 75)","(CA Row 40)","$","%","$","%","(CA Row 19)","$"," "," "," "]
[]
[null,1,{"$f":"IF(ISBLANK('10. Load Forecast'!D28),\"\",'10. Load Forecast'!D28)","v":""},null,null,{"$f":"'9. Rev_Reqt'!$N$31*G79","v":0},{"$f":"(E79-J79)/($E$43-$J$43)","v":0},null,{"$f":"H79/$H$100","v":{"$error":"#DIV/0!"}},null,{"$f":"F79+J79","v":0},{"$f":"IF(ISBLANK(H79),\"\",(H79+J79)/E79)","v":""},null,null,"85-115"]
[null,2,{"$f":"IF(ISBLANK('10. Load Forecast'!D29),\"\",'10. Load Forecast'!D29)","v":"Residential"},null,null,{"$f":"'9. Rev_Reqt'!$N$31*G80","v":0},0,null,{"$f":"H80/$H$100","v":{"$error":"#DIV/0!"}},null,{"$f":"F80+J80","v":0},{"$f":"IF(ISBLANK(H80),\"\",(H80+J80)/E80)","v":""},null,null,"80-120"]
[null,3,{"$f":"IF(ISBLANK('10. Load Forecast'!D30),\"\",'10. Load Forecast'!D30)","v":"General Service < 50 kW"},null,null,{"$f":"'9. Rev_Reqt'!$N$31*G81","v":0},0,null,{"$error":"#DIV/0!"},null,0,"",null,null,"80-120"]
[null,4,{"$f":"IF(ISBLANK('10. Load Forecast'!D31),\"\",'10. Load Forecast'!D31)","v":"General Service > 50 to 4999 kW"},null,null,{"$f":"'9. Rev_Reqt'!$N$31*G82","v":0},0,null,{"$error":"#DIV/0!"},null,0,"",null,null,"80-120"]
[null,5,{"$f":"IF(ISBLANK('10. Load Forecast'!D32),\"\",'10. Load Forecast'!D32)","v":"Unmetered Scattered Load"},null,null,{"$f":"'9. Rev_Reqt'!$N$31*G83","v":0},0,null,{"$error":"#DIV/0!"},null,0,"",null,null,"80-120"]
[null,6,{"$f":"IF(ISBLANK('10. Load Forecast'!D33),\"\",'10. Load Forecast'!D33)","v":"Sentinel"},null,null,{"$f":"'9. Rev_Reqt'!$N$31*G84","v":0},0,null,{"$error":"#DIV/0!"},null,0,{"$f":"IF(ISBLANK(H84),\"\",(H84+J84)/K84)","v":""},null,null,"80-120"]
[null,7,{"$f":"IF(ISBLANK('10. Load Forecast'!D34),\"\",'10. Load Forecast'!D34)","v":"StreetLights"},null,null,{"$f":"'9. Rev_Reqt'!$N$31*G85","v":0},0,null,{"$error":"#DIV/0!"},null,0,"","","","80-120"]
[null,8,{"$f":"IF(ISBLANK('10. Load Forecast'!D35),\"\",'10. Load Forecast'!D35)","v":""},null,null,{"$f":"'9. Rev_Reqt'!$N$31*G86","v":0},0,null,{"$error":"#DIV/0!"},null,0,"","","","80-120"]
[null,9,{"$f":"IF(ISBLANK('10. Load Forecast'!D36),\"\",'10. Load Forecast'!D36)","v":""},null,null,{"$f":"'9. Rev_Reqt'!$N$31*G87","v":0},0,null,{"$error":"#DIV/0!"},null,0,"","","","80-120"]
[null,10,{"$f":"IF(ISBLANK('10. Load Forecast'!D37),\"\",'10. Load Forecast'!D37)","v":""},null,null,{"$f":"'9. Rev_Reqt'!$N$31*G88","v":0},0,null,{"$error":"#DIV/0!"},null,0,"","","","80-120"]
[null,11,{"$f":"IF(ISBLANK('10. Load Forecast'!D38),\"\",'10. Load Forecast'!D38)","v":""},null,null,{"$f":"'9. Rev_Reqt'!$N$31*G89","v":0},0,null,{"$error":"#DIV/0!"},null,0,"","","","80-120"]
[null,12,{"$f":"IF(ISBLANK('10. Load Forecast'!D39),\"\",'10. Load Forecast'!D39)","v":""},null,null,{"$f":"'9. Rev_Reqt'!$N$31*G90","v":0},0,null,{"$error":"#DIV/0!"},null,0,"","","","80-120"]
[null,13,{"$f":"IF(ISBLANK('10. Load Forecast'!D40),\"\",'10. Load Forecast'!D40)","v":""},null,null,{"$f":"'9. Rev_Reqt'!$N$31*G91","v":0},0,null,{"$error":"#DIV/0!"},null,0,"","","","80-120"]
[null,14,{"$f":"IF(ISBLANK('10. Load Forecast'!D41),\"\",'10. Load Forecast'!D41)","v":""},null,null,{"$f":"'9. Rev_Reqt'!$N$31*G92","v":0},0,null,{"$error":"#DIV/0!"},null,0,"","","","80-120"]
[null,15,{"$f":"IF(ISBLANK('10. Load Forecast'!D42),\"\",'10. Load Forecast'!D42)","v":""},null,null,{"$f":"'9. Rev_Reqt'!$N$31*G93","v":0},0,null,{"$error":"#DIV/0!"},null,0,"","","","80-120"]
[null,16,{"$f":"IF(ISBLANK('10. Load Forecast'!D43),\"\",'10. Load Forecast'!D43)","v":""},null,null,{"$f":"'9. Rev_Reqt'!$N$31*G94","v":0},0,null,{"$error":"#DIV/0!"},null,0,"","","","80-120"]
[null,17,{"$f":"IF(ISBLANK('10. Load Forecast'!D44),\"\",'10. Load Forecast'!D44)","v":""},null,null,{"$f":"'9. Rev_Reqt'!$N$31*G95","v":0},0,null,{"$error":"#DIV/0!"},null,0,"","","","80-120"]
[null,18,{"$f":"IF(ISBLANK('10. Load Forecast'!D45),\"\",'10. Load Forecast'!D45)","v":""},null,null,{"$f":"'9. Rev_Reqt'!$N$31*G96","v":0},0,null,{"$error":"#DIV/0!"},null,0,"","","","80-120"]
[null,19,{"$f":"IF(ISBLANK('10. Load Forecast'!D46),\"\",'10. Load Forecast'!D46)","v":""},null,null,{"$f":"'9. Rev_Reqt'!$N$31*G97","v":0},0,null,{"$error":"#DIV/0!"},null,0,"","","","80-120"]
[null,20,{"$f":"IF(ISBLANK('10. Load Forecast'!D47),\"\",'10. Load Forecast'!D47)","v":""},null,null,{"$f":"'9. Rev_Reqt'!$N$31*G98","v":0},0,null,{"$error":"#DIV/0!"},null,0,"","","","80-120"]
[]
[null,null,"Total",null,{"$f":"SUM(E79:E98)","v":0},0,0,0,{"$error":"#DIV/0!"},0,{"$f":"SUM(K79:K99)","v":0}]
[]
[]
[null,null,null,{"$f":"'3. Data_Input_Sheet'!AC12","v":"Per Board Decision"}]
[null,null,null,null,null,null,null,null,null,null,null,null,"Multi Year Adjustments"]
[null,null,"Name of Customer Class ","Revenue To Expense Status Quo %","Service Rev Req %","Cost Allocation Results (Base Rev Req)",null,"Proposed Allocation (Base Rev Req) ",null,"Misc. Revenues $","Cost Allocation Results (Serv Rev Req)","Prposed Ratios %","Test Year +1","Test Year +2","Policy Range"]
[null,null,null,"(CA Row 75)","(CA Row 40)","$","%","$","%","(CA Row 19)","$"," "," "," "]
[]
[null,1,{"$f":"IF(ISBLANK('10. Load Forecast'!D28),\"\",'10. Load Forecast'!D28)","v":""},null,null,{"$f":"'9. Rev_Reqt'!$R$31*G108","v":0},{"$f":"(E108-J108)/($E$43-$J$43)","v":0},null,{"$f":"H108/$H$129","v":{"$error":"#DIV/0!"}},null,{"$f":"F108+J108","v":0},{"$f":"IF(ISBLANK(H108),\"\",(H108+J108)/K108)","v":""},null,null,"85-115"]
[null,2,{"$f":"IF(ISBLANK('10. Load Forecast'!D29),\"\",'10. Load Forecast'!D29)","v":"Residential"},null,null,{"$f":"'9. Rev_Reqt'!$R$31*G109","v":0},0,null,{"$f":"H109/$H$129","v":{"$error":"#DIV/0!"}},null,{"$f":"F109+J109","v":0},"",null,null,"80-120"]
[null,3,{"$f":"IF(ISBLANK('10. Load Forecast'!D30),\"\",'10. Load Forecast'!D30)","v":"General Service < 50 kW"},null,null,{"$f":"'9. Rev_Reqt'!$R$31*G110","v":0},0,null,{"$error":"#DIV/0!"},null,0,"",null,null,"80-120"]
[null,4,{"$f":"IF(ISBLANK('10. Load Forecast'!D31),\"\",'10. Load Forecast'!D31)","v":"General Service > 50 to 4999 kW"},null,null,{"$f":"'9. Rev_Reqt'!$R$31*G111","v":0},0,null,{"$error":"#DIV/0!"},null,0,"",null,null,"80-120"]
[null,5,{"$f":"IF(ISBLANK('10. Load Forecast'!D32),\"\",'10. Load Forecast'!D32)","v":"Unmetered Scattered Load"},null,null,{"$f":"'9. Rev_Reqt'!$R$31*G112","v":0},0,null,{"$error":"#DIV/0!"},null,0,"",null,null,"80-120"]
[null,6,{"$f":"IF(ISBLANK('10. Load Forecast'!D33),\"\",'10. Load Forecast'!D33)","v":"Sentinel"},null,null,{"$f":"'9. Rev_Reqt'!$R$31*G113","v":0},{"$f":"(E113-J113)/($E$43-$J$43)","v":0},null,{"$error":"#DIV/0!"},null,0,"",null,null,"80-120"]
[null,7,{"$f":"IF(ISBLANK('10. Load Forecast'!D34),\"\",'10. Load Forecast'!D34)","v":"StreetLights"},null,null,{"$f":"'9. Rev_Reqt'!$R$31*G114","v":0},{"$f":"(E114-J114)/($E$43-$J$43)","v":0},null,{"$error":"#DIV/0!"},null,0,"",null,null,"80-120"]
[null,8,{"$f":"IF(ISBLANK('10. Load Forecast'!D35),\"\",'10. Load Forecast'!D35)","v":""},null,null,{"$f":"'9. Rev_Reqt'!$R$31*G115","v":0},0,null,{"$error":"#DIV/0!"},null,0,"","","","80-120"]
[null,9,{"$f":"IF(ISBLANK('10. Load Forecast'!D36),\"\",'10. Load Forecast'!D36)","v":""},null,null,{"$f":"'9. Rev_Reqt'!$R$31*G116","v":0},0,null,{"$error":"#DIV/0!"},null,0,"","","","80-120"]
[null,10,{"$f":"IF(ISBLANK('10. Load Forecast'!D37),\"\",'10. Load Forecast'!D37)","v":""},null,null,{"$f":"'9. Rev_Reqt'!$R$31*G117","v":0},0,null,{"$error":"#DIV/0!"},null,0,"","","","80-120"]
[null,11,{"$f":"IF(ISBLANK('10. Load Forecast'!D38),\"\",'10. Load Forecast'!D38)","v":""},null,null,{"$f":"'9. Rev_Reqt'!$R$31*G118","v":0},0,null,{"$error":"#DIV/0!"},null,0,"","","","80-120"]
[null,12,{"$f":"IF(ISBLANK('10. Load Forecast'!D39),\"\",'10. Load Forecast'!D39)","v":""},null,null,{"$f":"'9. Rev_Reqt'!$R$31*G119","v":0},0,null,{"$error":"#DIV/0!"},null,0,"","","","80-120"]
[null,13,{"$f":"IF(ISBLANK('10. Load Forecast'!D40),\"\",'10. Load Forecast'!D40)","v":""},null,null,{"$f":"'9. Rev_Reqt'!$R$31*G120","v":0},0,null,{"$error":"#DIV/0!"},null,0,"","","","80-120"]
[null,14,{"$f":"IF(ISBLANK('10. Load Forecast'!D41),\"\",'10. Load Forecast'!D41)","v":""},null,null,{"$f":"'9. Rev_Reqt'!$R$31*G121","v":0},0,null,{"$error":"#DIV/0!"},null,0,"","","","80-120"]
[null,15,{"$f":"IF(ISBLANK('10. Load Forecast'!D42),\"\",'10. Load Forecast'!D42)","v":""},null,null,{"$f":"'9. Rev_Reqt'!$R$31*G122","v":0},0,null,{"$error":"#DIV/0!"},null,0,"","","","80-120"]
[null,16,{"$f":"IF(ISBLANK('10. Load Forecast'!D43),\"\",'10. Load Forecast'!D43)","v":""},null,null,{"$f":"'9. Rev_Reqt'!$R$31*G123","v":0},0,null,{"$error":"#DIV/0!"},null,0,"","","","80-120"]
[null,17,{"$f":"IF(ISBLANK('10. Load Forecast'!D44),\"\",'10. Load Forecast'!D44)","v":""},null,null,{"$f":"'9. Rev_Reqt'!$R$31*G124","v":0},0,null,{"$error":"#DIV/0!"},null,0,"","","","80-120"]
[null,18,{"$f":"IF(ISBLANK('10. Load Forecast'!D45),\"\",'10. Load Forecast'!D45)","v":""},null,null,{"$f":"'9. Rev_Reqt'!$R$31*G125","v":0},0,null,{"$error":"#DIV/0!"},null,0,"","","","80-120"]
[null,19,{"$f":"IF(ISBLANK('10. Load Forecast'!D46),\"\",'10. Load Forecast'!D46)","v":""},null,null,{"$f":"'9. Rev_Reqt'!$R$31*G126","v":0},0,null,{"$error":"#DIV/0!"},null,0,"","","","80-120"]
[null,20,{"$f":"IF(ISBLANK('10. Load Forecast'!D47),\"\",'10. Load Forecast'!D47)","v":""},null,null,{"$f":"'9. Rev_Reqt'!$R$31*G127","v":0},0,null,{"$error":"#DIV/0!"},null,0,"","","","80-120"]
[]
[null,null,"Total",null,{"$f":"SUM(E108:E127)","v":0},0,0,0,{"$error":"#DIV/0!"},0,{"$f":"SUM(K108:K128)","v":0}]

{"sheet":"13. Rate Design RSL","index":17,"n_rows":119,"n_cols":19,"rows_kept":119,"cut":false,"hidden":false,"merged":[[94,3,94,14],[96,16,96,18],[16,3,16,14],[18,16,18,18],[42,3,42,14],[44,16,44,18],[68,3,68,14],[70,16,70,18]]}
[]
[]
[]
[null,null,null,null,null,null,null,null,null,null,null,"F"]
[null,null,null,null,null,null,null,null,null,null,null,"L"]
[null,null,null,null,null,null,null,null,null,null,null,"R"]
[]
[]
[]
[]
[]
[]
[]
[]
[null,"Rate Design and Revenue Reconciliation"]
[]
[null,null,null,{"$f":"'3. Data_Input_Sheet'!E12","v":"Initial Application"}]
[]
[null,"Customer Class",null,"Billing Determinant","Total Class Revenue Requirement ($)","MSC Revenues (S)","Volumetric revenues (S)","Fixed (%)","Variable (%)","Transformer Ownership Allowance 1 ($)","Monthly Service Charge ($)","Volumetric Rate  ($)","MSC Revenues (S)","Volumetric revenues (S)","Distribution Revenues less Transformer Ownership Allowance",null,"Integrity Check"]
[]
[1,{"$f":"'10. Load Forecast'!D29","v":"Residential"},null,"kWh",{"$f":"IF(ISBLANK('11. Cost_Allocation RSL'!H22),\"\",'11. Cost_Allocation RSL'!H22)","v":2903639.5465671774},{"$f":"IF(ISBLANK(H21),\"\",E21*H21)","v":2903639.5465671769},{"$f":"IF(F21=\"\",\"\",E21-F21)","v":4.6566128730773926E-10},{"$f":"'13. Rate Design'!U28","v":0.99999999999999989},{"$f":"IF(ISBLANK(H21),\"\",1-H21)","v":1.1102230246251565E-16},{"$f":"'13. Rate Design'!Y28","v":0},{"$f":"(F21/'10. Load Forecast'!F29)/12","v":45.007180040821474},{"$f":"IF(G21=\"\",\"\",ROUND(IF(D21=\"kWh\",(G21+J21)/'10. Load Forecast'!H29,(G21+J21)/'10. Load Forecast'!J29),4))","v":0},{"$f":"IF(K21=\"\",0,K21*'10. Load Forecast'!F29*12)","v":2903639.5465671774},{"$f":"ROUND(IF(L21=\"\",0,IF(D21=\"kWh\",'10. Load Forecast'!H29*L21,IF(D21=\"kW\",IF(L21=\"\",0,L21*'10. Load Forecast'!J29)))),4)","v":0},{"$f":"ROUND(M21+N21-J21,2)","v":2903639.55}]
[2,{"$f":"'10. Load Forecast'!D30","v":"General Service < 50 kW"},null,"kWh",{"$f":"IF(ISBLANK('11. Cost_Allocation RSL'!H23),\"\",'11. Cost_Allocation RSL'!H23)","v":918478.97061500885},333644.48448359931,584834.48613140953,{"$f":"'13. Rate Design'!U29","v":0.36325761956225594},0.63674238043774412,{"$f":"'13. Rate Design'!Y29","v":0},{"$f":"(F22/'10. Load Forecast'!F30)/12","v":37.49},{"$f":"IF(G22=\"\",\"\",ROUND(IF(D22=\"kWh\",(G22+J22)/'10. Load Forecast'!H30,(G22+J22)/'10. Load Forecast'!J30),4))","v":2.58E-2},{"$f":"IF(K22=\"\",0,K22*'10. Load Forecast'!F30*12)","v":333644.48448359931},{"$f":"ROUND(IF(L22=\"\",0,IF(D22=\"kWh\",'10. Load Forecast'!H30*L22,IF(D22=\"kW\",IF(L22=\"\",0,L22*'10. Load Forecast'!J30)))),4)","v":585313.68389999995},{"$f":"ROUND(M22+N22-J22,2)","v":918958.17},null,"Total Distribution Revenues",null,{"$f":"SUM(O21:O40)","v":4959656.1500000004}]
[3,{"$f":"'10. Load Forecast'!D31","v":"General Service > 50 to 4999 kW"},null,"kW",{"$f":"IF(ISBLANK('11. Cost_Allocation RSL'!H24),\"\",'11. Cost_Allocation RSL'!H24)","v":919706.63578035403},282718.45041231182,636988.18536804221,{"$f":"'13. Rate Design'!U30","v":0.30740068562453121},0.69259931437546873,{"$f":"'13. Rate Design'!Y30","v":-33513.291035699702},{"$f":"(F23/'10. Load Forecast'!F31)/12","v":357.29},{"$f":"IF(G23=\"\",\"\",ROUND(IF(D23=\"kWh\",(G23+J23)/'10. Load Forecast'!H31,(G23+J23)/'10. Load Forecast'!J31),4))","v":4.9528999999999996},{"$f":"IF(K23=\"\",0,K23*'10. Load Forecast'!F31*12)","v":282718.45041231182},{"$f":"ROUND(IF(L23=\"\",0,IF(D23=\"kWh\",'10. Load Forecast'!H31*L23,IF(D23=\"kW\",IF(L23=\"\",0,L23*'10. Load Forecast'!J31)))),4)","v":603480.58689999999},919712.33]
[4,{"$f":"'10. Load Forecast'!D32","v":"Unmetered Scattered Load"},null,"kWh",{"$f":"IF(ISBLANK('11. Cost_Allocation RSL'!H25),\"\",'11. Cost_Allocation RSL'!H25)","v":21931.00905574132},4358.9105229670522,17572.098532774267,{"$f":"'13. Rate Design'!U31","v":0.19875558447348016},0.80124441552651982,{"$f":"'13. Rate Design'!Y31","v":0},{"$f":"(F24/'10. Load Forecast'!F32)/12","v":6.0086045580325367},{"$f":"IF(G24=\"\",\"\",ROUND(IF(D24=\"kWh\",(G24+J24)/'10. Load Forecast'!H32,(G24+J24)/'10. Load Forecast'!J32),4))","v":2.75E-2},{"$f":"IF(K24=\"\",0,K24*'10. Load Forecast'!F32*12)","v":4358.9105229670531},{"$f":"ROUND(IF(L24=\"\",0,IF(D24=\"kWh\",'10. Load Forecast'!H32*L24,IF(D24=\"kW\",IF(L24=\"\",0,L24*'10. Load Forecast'!J32)))),4)","v":17552.065299999998},21910.98,null,"Base Revenue Requirement",null,{"$f":"'9. Rev_Reqt'!F28","v":4959191.3521111663}]
[5,{"$f":"'10. Load Forecast'!D33","v":"Sentinel"},null,"kW",{"$f":"IF(ISBLANK('11. Cost_Allocation RSL'!H26),\"\",'11. Cost_Allocation RSL'!H26)","v":19319.248970267603},3595.1173655823727,15724.13160468523,{"$f":"'13. Rate Design'!U32","v":0.18608991328365154},0.81391008671634846,{"$f":"'13. Rate Design'!Y32","v":0},{"$f":"(F25/'10. Load Forecast'!F33)/12","v":4.32},{"$f":"IF(G25=\"\",\"\",ROUND(IF(D25=\"kWh\",(G25+J25)/'10. Load Forecast'!H33,(G25+J25)/'10. Load Forecast'!J33),4))","v":103.1801},{"$f":"IF(K25=\"\",0,K25*'10. Load Forecast'!F33*12)","v":3595.1173655823732},{"$f":"ROUND(IF(L25=\"\",0,IF(D25=\"kWh\",'10. Load Forecast'!H33*L25,IF(D25=\"kW\",IF(L25=\"\",0,L25*'10. Load Forecast'!J33)))),4)","v":15724.134400000001},19319.25]
[6,{"$f":"'10. Load Forecast'!D34","v":"StreetLights"},null,"kW",{"$f":"IF(ISBLANK('11. Cost_Allocation RSL'!H27),\"\",'11. Cost_Allocation RSL'!H27)","v":176115.94112261728},99722.485138460281,76393.455984157001,{"$f":"'13. Rate Design'!U33","v":0.56623202024074837},0.43376797975925163,{"$f":"'13. Rate Design'!Y33","v":0},{"$f":"(F26/'10. Load Forecast'!F34)/12","v":4.8499999999999996},{"$f":"IF(G26=\"\",\"\",ROUND(IF(D26=\"kWh\",(G26+J26)/'10. Load Forecast'!H34,(G26+J26)/'10. Load Forecast'!J34),4))","v":47.132399999999997},{"$f":"IF(K26=\"\",0,K26*'10. Load Forecast'!F34*12)","v":99722.485138460281},{"$f":"ROUND(IF(L26=\"\",0,IF(D26=\"kWh\",'10. Load Forecast'!H34*L26,IF(D26=\"kW\",IF(L26=\"\",0,L26*'10. Load Forecast'!J34)))),4)","v":76393.384600000005},176115.87,null,"Difference",null,{"$f":"S22-S24","v":464.79788883402944}]
[7,{"$f":"IF(ISBLANK('10. Load Forecast'!D34),\"\",'10. Load Forecast'!D34)","v":"StreetLights"},null,null,{"$f":"IF(ISBLANK('11. Cost_Allocation RSL'!H28),\"\",'11. Cost_Allocation RSL'!H28)","v":""},"","",null,"",null,{"$f":"IF(E27=\"\",\"\",IF('10. Load Forecast'!F34=0,0,IF(H27=0,0,ROUND(F27/('10. Load Forecast'!F34*12),#REF!))))","v":""},{"$f":"IF(G27=\"\",\"\",ROUND(IF(D27=\"kWh\",(G27+J27)/'10. Load Forecast'!H34,(G27+J27)/'10. Load Forecast'!J34),#REF!))","v":""},{"$f":"IF(K27=\"\",0,K27*'10. Load Forecast'!F34*12)","v":0},{"$f":"ROUND(IF(L27=\"\",0,IF(D27=\"kWh\",'10. Load Forecast'!H34*L27,IF(D27=\"kW\",IF(L27=\"\",0,L27*'10. Load Forecast'!J34)))),4)","v":0},0,null,"% Difference",null,{"$f":"IF(S24=0,\"\",S26/S24)","v":9.3724532052218823E-5}]
[8,{"$f":"IF(ISBLANK('10. Load Forecast'!D35),\"\",'10. Load Forecast'!D35)","v":""},null,null,{"$f":"IF(ISBLANK('11. Cost_Allocation RSL'!H29),\"\",'11. Cost_Allocation RSL'!H29)","v":""},"","",null,"",null,{"$f":"IF(E28=\"\",\"\",IF('10. Load Forecast'!F35=0,0,IF(H28=0,0,ROUND(F28/('10. Load Forecast'!F35*12),#REF!))))","v":""},{"$f":"IF(G28=\"\",\"\",ROUND(IF(D28=\"kWh\",(G28+J28)/'10. Load Forecast'!H35,(G28+J28)/'10. Load Forecast'!J35),#REF!))","v":""},{"$f":"IF(K28=\"\",0,K28*'10. Load Forecast'!F35*12)","v":0},{"$f":"ROUND(IF(L28=\"\",0,IF(D28=\"kWh\",'10. Load Forecast'!H35*L28,IF(D28=\"kW\",IF(L28=\"\",0,L28*'10. Load Forecast'!J35)))),4)","v":0},0]
[9,{"$f":"IF(ISBLANK('10. Load Forecast'!D36),\"\",'10. Load Forecast'!D36)","v":""},null,null,{"$f":"IF(ISBLANK('11. Cost_Allocation RSL'!H30),\"\",'11. Cost_Allocation RSL'!H30)","v":""},"","",null,"",null,{"$f":"IF(E29=\"\",\"\",IF('10. Load Forecast'!F36=0,0,IF(H29=0,0,ROUND(F29/('10. Load Forecast'!F36*12),#REF!))))","v":""},{"$f":"IF(G29=\"\",\"\",ROUND(IF(D29=\"kWh\",(G29+J29)/'10. Load Forecast'!H36,(G29+J29)/'10. Load Forecast'!J36),#REF!))","v":""},{"$f":"IF(K29=\"\",0,K29*'10. Load Forecast'!F36*12)","v":0},{"$f":"ROUND(IF(L29=\"\",0,IF(D29=\"kWh\",'10. Load Forecast'!H36*L29,IF(D29=\"kW\",IF(L29=\"\",0,L29*'10. Load Forecast'!J36)))),4)","v":0},0]
[10,{"$f":"IF(ISBLANK('10. Load Forecast'!D37),\"\",'10. Load Forecast'!D37)","v":""},null,null,{"$f":"IF(ISBLANK('11. Cost_Allocation RSL'!H31),\"\",'11. Cost_Allocation RSL'!H31)","v":""},"","",null,"",null,{"$f":"IF(E30=\"\",\"\",IF('10. Load Forecast'!F37=0,0,IF(H30=0,0,ROUND(F30/('10. Load Forecast'!F37*12),#REF!))))","v":""},{"$f":"IF(G30=\"\",\"\",ROUND(IF(D30=\"kWh\",(G30+J30)/'10. Load Forecast'!H37,(G30+J30)/'10. Load Forecast'!J37),#REF!))","v":""},{"$f":"IF(K30=\"\",0,K30*'10. Load Forecast'!F37*12)","v":0},{"$f":"ROUND(IF(L30=\"\",0,IF(D30=\"kWh\",'10. Load Forecast'!H37*L30,IF(D30=\"kW\",IF(L30=\"\",0,L30*'10. Load Forecast'!J37)))),4)","v":0},0]
[11,{"$f":"IF(ISBLANK('10. Load Forecast'!D38),\"\",'10. Load Forecast'!D38)","v":""},null,null,{"$f":"IF(ISBLANK('11. Cost_Allocation RSL'!H32),\"\",'11. Cost_Allocation RSL'!H32)","v":""},"","",null,"",null,{"$f":"IF(E31=\"\",\"\",IF('10. Load Forecast'!F38=0,0,IF(H31=0,0,ROUND(F31/('10. Load Forecast'!F38*12),#REF!))))","v":""},{"$f":"IF(G31=\"\",\"\",ROUND(IF(D31=\"kWh\",(G31+J31)/'10. Load Forecast'!H38,(G31+J31)/'10. Load Forecast'!J38),#REF!))","v":""},{"$f":"IF(K31=\"\",0,K31*'10. Load Forecast'!F38*12)","v":0},{"$f":"ROUND(IF(L31=\"\",0,IF(D31=\"kWh\",'10. Load Forecast'!H38*L31,IF(D31=\"kW\",IF(L31=\"\",0,L31*'10. Load Forecast'!J38)))),4)","v":0},0]
[12,{"$f":"IF(ISBLANK('10. Load Forecast'!D39),\"\",'10. Load Forecast'!D39)","v":""},null,null,{"$f":"IF(ISBLANK('11. Cost_Allocation RSL'!H33),\"\",'11. Cost_Allocation RSL'!H33)","v":""},"","",null,"",null,{"$f":"IF(E32=\"\",\"\",IF('10. Load Forecast'!F39=0,0,IF(H32=0,0,ROUND(F32/('10. Load Forecast'!F39*12),#REF!))))","v":""},{"$f":"IF(G32=\"\",\"\",ROUND(IF(D32=\"kWh\",(G32+J32)/'10. Load Forecast'!H39,(G32+J32)/'10. Load Forecast'!J39),#REF!))","v":""},{"$f":"IF(K32=\"\",0,K32*'10. Load Forecast'!F39*12)","v":0},{"$f":"ROUND(IF(L32=\"\",0,IF(D32=\"kWh\",'10. Load Forecast'!H39*L32,IF(D32=\"kW\",IF(L32=\"\",0,L32*'10. Load Forecast'!J39)))),4)","v":0},0]
[13,{"$f":"IF(ISBLANK('10. Load Forecast'!D40),\"\",'10. Load Forecast'!D40)","v":""},null,null,{"$f":"IF(ISBLANK('11. Cost_Allocation RSL'!H34),\"\",'11. Cost_Allocation RSL'!H34)","v":""},"","",null,"",null,{"$f":"IF(E33=\"\",\"\",IF('10. Load Forecast'!F40=0,0,IF(H33=0,0,ROUND(F33/('10. Load Forecast'!F40*12),#REF!))))","v":""},{"$f":"IF(G33=\"\",\"\",ROUND(IF(D33=\"kWh\",(G33+J33)/'10. Load Forecast'!H40,(G33+J33)/'10. Load Forecast'!J40),#REF!))","v":""},{"$f":"IF(K33=\"\",0,K33*'10. Load Forecast'!F40*12)","v":0},{"$f":"ROUND(IF(L33=\"\",0,IF(D33=\"kWh\",'10. Load Forecast'!H40*L33,IF(D33=\"kW\",IF(L33=\"\",0,L33*'10. Load Forecast'!J40)))),4)","v":0},0]
[14,{"$f":"IF(ISBLANK('10. Load Forecast'!D41),\"\",'10. Load Forecast'!D41)","v":""},null,null,{"$f":"IF(ISBLANK('11. Cost_Allocation RSL'!H35),\"\",'11. Cost_Allocation RSL'!H35)","v":""},"","",null,"",null,{"$f":"IF(E34=\"\",\"\",IF('10. Load Forecast'!F41=0,0,IF(H34=0,0,ROUND(F34/('10. Load Forecast'!F41*12),#REF!))))","v":""},{"$f":"IF(G34=\"\",\"\",ROUND(IF(D34=\"kWh\",(G34+J34)/'10. Load Forecast'!H41,(G34+J34)/'10. Load Forecast'!J41),#REF!))","v":""},{"$f":"IF(K34=\"\",0,K34*'10. Load Forecast'!F41*12)","v":0},{"$f":"ROUND(IF(L34=\"\",0,IF(D34=\"kWh\",'10. Load Forecast'!H41*L34,IF(D34=\"kW\",IF(L34=\"\",0,L34*'10. Load Forecast'!J41)))),4)","v":0},0]
[15,{"$f":"IF(ISBLANK('10. Load Forecast'!D42),\"\",'10. Load Forecast'!D42)","v":""},null,null,{"$f":"IF(ISBLANK('11. Cost_Allocation RSL'!H36),\"\",'11. Cost_Allocation RSL'!H36)","v":""},"","",null,"",null,{"$f":"IF(E35=\"\",\"\",IF('10. Load Forecast'!F42=0,0,IF(H35=0,0,ROUND(F35/('10. Load Forecast'!F42*12),#REF!))))","v":""},{"$f":"IF(G35=\"\",\"\",ROUND(IF(D35=\"kWh\",(G35+J35)/'10. Load Forecast'!H42,(G35+J35)/'10. Load Forecast'!J42),#REF!))","v":""},{"$f":"IF(K35=\"\",0,K35*'10. Load Forecast'!F42*12)","v":0},{"$f":"ROUND(IF(L35=\"\",0,IF(D35=\"kWh\",'10. Load Forecast'!H42*L35,IF(D35=\"kW\",IF(L35=\"\",0,L35*'10. Load Forecast'!J42)))),4)","v":0},0]
[16,{"$f":"IF(ISBLANK('10. Load Forecast'!D43),\"\",'10. Load Forecast'!D43)","v":""},null,null,{"$f":"IF(ISBLANK('11. Cost_Allocation RSL'!H37),\"\",'11. Cost_Allocation RSL'!H37)","v":""},"","",null,"",null,{"$f":"IF(E36=\"\",\"\",IF('10. Load Forecast'!F43=0,0,IF(H36=0,0,ROUND(F36/('10. Load Forecast'!F43*12),#REF!))))","v":""},{"$f":"IF(G36=\"\",\"\",ROUND(IF(D36=\"kWh\",(G36+J36)/'10. Load Forecast'!H43,(G36+J36)/'10. Load Forecast'!J43),#REF!))","v":""},{"$f":"IF(K36=\"\",0,K36*'10. Load Forecast'!F43*12)","v":0},{"$f":"ROUND(IF(L36=\"\",0,IF(D36=\"kWh\",'10. Load Forecast'!H43*L36,IF(D36=\"kW\",IF(L36=\"\",0,L36*'10. Load Forecast'!J43)))),4)","v":0},0]
[17,{"$f":"IF(ISBLANK('10. Load Forecast'!D44),\"\",'10. Load Forecast'!D44)","v":""},null,null,{"$f":"IF(ISBLANK('11. Cost_Allocation RSL'!H38),\"\",'11. Cost_Allocation RSL'!H38)","v":""},"","",null,"",null,{"$f":"IF(E37=\"\",\"\",IF('10. Load Forecast'!F44=0,0,IF(H37=0,0,ROUND(F37/('10. Load Forecast'!F44*12),#REF!))))","v":""},{"$f":"IF(G37=\"\",\"\",ROUND(IF(D37=\"kWh\",(G37+J37)/'10. Load Forecast'!H44,(G37+J37)/'10. Load Forecast'!J44),#REF!))","v":""},{"$f":"IF(K37=\"\",0,K37*'10. Load Forecast'!F44*12)","v":0},{"$f":"ROUND(IF(L37=\"\",0,IF(D37=\"kWh\",'10. Load Forecast'!H44*L37,IF(D37=\"kW\",IF(L37=\"\",0,L37*'10. Load Forecast'!J44)))),4)","v":0},0]
[18,{"$f":"IF(ISBLANK('10. Load Forecast'!D45),\"\",'10. Load Forecast'!D45)","v":""},null,null,{"$f":"IF(ISBLANK('11. Cost_Allocation RSL'!H39),\"\",'11. Cost_Allocation RSL'!H39)","v":""},"","",null,"",null,{"$f":"IF(E38=\"\",\"\",IF('10. Load Forecast'!F45=0,0,IF(H38=0,0,ROUND(F38/('10. Load Forecast'!F45*12),#REF!))))","v":""},{"$f":"IF(G38=\"\",\"\",ROUND(IF(D38=\"kWh\",(G38+J38)/'10. Load Forecast'!H45,(G38+J38)/'10. Load Forecast'!J45),#REF!))","v":""},{"$f":"IF(K38=\"\",0,K38*'10. Load Forecast'!F45*12)","v":0},{"$f":"ROUND(IF(L38=\"\",0,IF(D38=\"kWh\",'10. Load Forecast'!H45*L38,IF(D38=\"kW\",IF(L38=\"\",0,L38*'10. Load Forecast'!J45)))),4)","v":0},0]
[19,{"$f":"IF(ISBLANK('10. Load Forecast'!D46),\"\",'10. Load Forecast'!D46)","v":""},null,null,{"$f":"IF(ISBLANK('11. Cost_Allocation RSL'!H40),\"\",'11. Cost_Allocation RSL'!H40)","v":""},"","",null,"",null,{"$f":"IF(E39=\"\",\"\",IF('10. Load Forecast'!F46=0,0,IF(H39=0,0,ROUND(F39/('10. Load Forecast'!F46*12),#REF!))))","v":""},{"$f":"IF(G39=\"\",\"\",ROUND(IF(D39=\"kWh\",(G39+J39)/'10. Load Forecast'!H46,(G39+J39)/'10. Load Forecast'!J46),#REF!))","v":""},{"$f":"IF(K39=\"\",0,K39*'10. Load Forecast'!F46*12)","v":0},{"$f":"ROUND(IF(L39=\"\",0,IF(D39=\"kWh\",'10. Load Forecast'!H46*L39,IF(D39=\"kW\",IF(L39=\"\",0,L39*'10. Load Forecast'!J46)))),4)","v":0},0]
[20,{"$f":"IF(ISBLANK('10. Load Forecast'!D47),\"\",'10. Load Forecast'!D47)","v":""},null,null,{"$f":"IF(ISBLANK('11. Cost_Allocation RSL'!H41),\"\",'11. Cost_Allocation RSL'!H41)","v":""},"","",null,"",null,{"$f":"IF(E40=\"\",\"\",IF('10. Load Forecast'!F47=0,0,IF(H40=0,0,ROUND(F40/('10. Load Forecast'!F47*12),#REF!))))","v":""},{"$f":"IF(G40=\"\",\"\",ROUND(IF(D40=\"kWh\",(G40+J40)/'10. Load Forecast'!H47,(G40+J40)/'10. Load Forecast'!J47),#REF!))","v":""},{"$f":"IF(K40=\"\",0,K40*'10. Load Forecast'!F47*12)","v":0},{"$f":"ROUND(IF(L40=\"\",0,IF(D40=\"kWh\",'10. Load Forecast'!H47*L40,IF(D40=\"kW\",IF(L40=\"\",0,L40*'10. Load Forecast'!J47)))),4)","v":0},0]
[null,null,null,"Total",{"$f":"SUM(E21:E40)","v":4959191.3521111663},{"$f":"SUM(F21:F40)","v":3627678.9944900973},{"$f":"SUM(G21:G40)","v":1331512.3576210686},null,null,null," "," ",{"$f":"SUM(M21:M40)","v":3627678.9944900982},{"$f":"SUM(N21:N40)","v":1298463.8551},{"$f":"SUM(O21:O40)","v":4959656.1500000004}]
[]
[null,null,null,{"$f":"'3. Data_Input_Sheet'!M12","v":"Interrogatory Responses"}]
[]
[null,"Customer Class",null,"Billing Determinant","Total Class Revenue Requirement","MSC Revenues (S)","Volumetric revenues (S)","Fixed","Variable","Transformer Ownership Allowance 1 ($)","Monthly Service Charge ","Volumetric Rate  ($)","MSC Revenues (S)","Volumetric revenues (S)","Distribution Revenues less Transformer Ownership Allowance",null,"Integrity Check"]
[]
[1,{"$f":"B21","v":"Residential"},null,{"$f":"D21","v":"kWh"},{"$f":"IF(ISBLANK('11. Cost_Allocation RSL'!H50),\"\",'11. Cost_Allocation RSL'!H50)","v":""},{"$f":"IF(ISBLANK(H47),\"\",E47*H47)","v":""},{"$f":"IF(F47=\"\",\"\",E47-F47)","v":""},null,{"$f":"IF(ISBLANK(H47),\"\",1-H47)","v":""},null,{"$f":"IF(E47=\"\",\"\",IF('10. Load Forecast'!L28=0,0,IF(H47=0,0,ROUND(F47/('10. Load Forecast'!L28*12),2))))","v":""},{"$f":"IF(G47=\"\",\"\",ROUND(IF(D47=\"kWh\",(G47+J47)/'10. Load Forecast'!N28,(G47+J47)/'10. Load Forecast'!P28),4))","v":""},{"$f":"IF(K47=\"\",0,K47*'10. Load Forecast'!L28*12)","v":0},{"$f":"ROUND(IF(L47=\"\",0,IF(D47=\"kWh\",'10. Load Forecast'!N28*L47,IF(D47=\"kW\",IF(L47=\"\",0,L47*'10. Load Forecast'!P28)))),2)","v":0},{"$f":"ROUND(M47+N47-J47,2)","v":0}]
[2,{"$f":"B22","v":"General Service < 50 kW"},null,{"$f":"D22","v":"kWh"},{"$f":"IF(ISBLANK('11. Cost_Allocation RSL'!H51),\"\",'11. Cost_Allocation RSL'!H51)","v":""},"",{"$f":"IF(F48=\"\",\"\",E48-F48)","v":""},null,"",null,{"$f":"IF(E48=\"\",\"\",IF('10. Load Forecast'!L29=0,0,IF(H48=0,0,ROUND(F48/('10. Load Forecast'!L29*12),2))))","v":""},{"$f":"IF(G48=\"\",\"\",ROUND(IF(D48=\"kWh\",(G48+J48)/'10. Load Forecast'!N29,(G48+J48)/'10. Load Forecast'!P29),4))","v":""},{"$f":"IF(K48=\"\",0,K48*'10. Load Forecast'!L29*12)","v":0},{"$f":"ROUND(IF(L48=\"\",0,IF(D48=\"kWh\",'10. Load Forecast'!N29*L48,IF(D48=\"kW\",IF(L48=\"\",0,L48*'10. Load Forecast'!P29)))),2)","v":0},0,null,"Total Distribution Revenues",null,{"$f":"SUM(O47:O66)","v":0}]
[3,"General Service > 50 to 4999 kW",null,"kW",{"$f":"IF(ISBLANK('11. Cost_Allocation RSL'!H52),\"\",'11. Cost_Allocation RSL'!H52)","v":""},"","",null,"",null,{"$f":"IF(E49=\"\",\"\",IF('10. Load Forecast'!L30=0,0,IF(H49=0,0,ROUND(F49/('10. Load Forecast'!L30*12),2))))","v":""},{"$f":"IF(G49=\"\",\"\",ROUND(IF(D49=\"kWh\",(G49+J49)/'10. Load Forecast'!N30,(G49+J49)/'10. Load Forecast'!P30),4))","v":""},{"$f":"IF(K49=\"\",0,K49*'10. Load Forecast'!L30*12)","v":0},{"$f":"ROUND(IF(L49=\"\",0,IF(D49=\"kWh\",'10. Load Forecast'!N30*L49,IF(D49=\"kW\",IF(L49=\"\",0,L49*'10. Load Forecast'!P30)))),2)","v":0},0]
[4,"Unmetered Scattered Load",null,"kWh",{"$f":"IF(ISBLANK('11. Cost_Allocation RSL'!H53),\"\",'11. Cost_Allocation RSL'!H53)","v":""},"","",null,"",null,{"$f":"IF(E50=\"\",\"\",IF('10. Load Forecast'!L31=0,0,IF(H50=0,0,ROUND(F50/('10. Load Forecast'!L31*12),2))))","v":""},{"$f":"IF(G50=\"\",\"\",ROUND(IF(D50=\"kWh\",(G50+J50)/'10. Load Forecast'!N31,(G50+J50)/'10. Load Forecast'!P31),4))","v":""},{"$f":"IF(K50=\"\",0,K50*'10. Load Forecast'!L31*12)","v":0},{"$f":"ROUND(IF(L50=\"\",0,IF(D50=\"kWh\",'10. Load Forecast'!N31*L50,IF(D50=\"kW\",IF(L50=\"\",0,L50*'10. Load Forecast'!P31)))),2)","v":0},0,null,"Base Revenue Requirement",null,{"$f":"'9. Rev_Reqt'!J28","v":0}]
[5,"Sentinel",null,"kW",{"$f":"IF(ISBLANK('11. Cost_Allocation RSL'!H54),\"\",'11. Cost_Allocation RSL'!H54)","v":""},"","",null,"",null,{"$f":"IF(E51=\"\",\"\",IF('10. Load Forecast'!L32=0,0,IF(H51=0,0,ROUND(F51/('10. Load Forecast'!L32*12),2))))","v":""},{"$f":"IF(G51=\"\",\"\",ROUND(IF(D51=\"kWh\",(G51+J51)/'10. Load Forecast'!N32,(G51+J51)/'10. Load Forecast'!P32),4))","v":""},{"$f":"IF(K51=\"\",0,K51*'10. Load Forecast'!L32*12)","v":0},{"$f":"ROUND(IF(L51=\"\",0,IF(D51=\"kWh\",'10. Load Forecast'!N32*L51,IF(D51=\"kW\",IF(L51=\"\",0,L51*'10. Load Forecast'!P32)))),2)","v":0},0]
[6,"StreetLights",null,"kW",{"$f":"IF(ISBLANK('11. Cost_Allocation RSL'!H55),\"\",'11. Cost_Allocation RSL'!H55)","v":""},"","",null,"",null,{"$f":"IF(E52=\"\",\"\",IF('10. Load Forecast'!L33=0,0,IF(H52=0,0,ROUND(F52/('10. Load Forecast'!L33*12),2))))","v":""},{"$f":"IF(G52=\"\",\"\",ROUND(IF(D52=\"kWh\",(G52+J52)/'10. Load Forecast'!N33,(G52+J52)/'10. Load Forecast'!P33),4))","v":""},{"$f":"IF(K52=\"\",0,K52*'10. Load Forecast'!L33*12)","v":0},{"$f":"ROUND(IF(L52=\"\",0,IF(D52=\"kWh\",'10. Load Forecast'!N33*L52,IF(D52=\"kW\",IF(L52=\"\",0,L52*'10. Load Forecast'!P33)))),2)","v":0},0,null,"Difference",null,{"$f":"S48-S50","v":0}]
[7,{"$f":"IF(ISBLANK('10. Load Forecast'!D34),\"\",'10. Load Forecast'!D34)","v":"StreetLights"},null,{"$f":"IF(ISBLANK(D27), \"\",(D27))","v":""},{"$f":"IF(ISBLANK('11. Cost_Allocation RSL'!H28),\"\",'11. Cost_Allocation RSL'!H28)","v":""},{"$f":"IF(ISBLANK(H27),\"\",E27*H27)","v":""},"",null,"",null,{"$f":"IF(E53=\"\",\"\",IF('10. Load Forecast'!L34=0,0,IF(H53=0,0,ROUND(F53/('10. Load Forecast'!L34*12),2))))","v":""},{"$f":"IF(G53=\"\",\"\",ROUND(IF(D53=\"kWh\",(G53+J53)/'10. Load Forecast'!N34,(G53+J53)/'10. Load Forecast'!P34),4))","v":""},{"$f":"IF(K53=\"\",0,K27*'10. Load Forecast'!L34*12)","v":0},{"$f":"ROUND(IF(L53=\"\",0,IF(D53=\"kWh\",'10. Load Forecast'!N34*L53,IF(D53=\"kW\",IF(L53=\"\",0,L53*'10. Load Forecast'!P34)))),2)","v":0},{"$f":"ROUND(M27+N27-J27,2)","v":0},null,"% Difference",null,{"$f":"IF(S50=0,\"\",S52/S50)","v":""}]
[8,{"$f":"IF(ISBLANK('10. Load Forecast'!D35),\"\",'10. Load Forecast'!D35)","v":""},null,{"$f":"IF(ISBLANK(D28), \"\",(D28))","v":""},{"$f":"IF(ISBLANK('11. Cost_Allocation RSL'!H29),\"\",'11. Cost_Allocation RSL'!H29)","v":""},"","",null,"",null,{"$f":"IF(E54=\"\",\"\",IF('10. Load Forecast'!L35=0,0,IF(H54=0,0,ROUND(F54/('10. Load Forecast'!L35*12),2))))","v":""},{"$f":"IF(G54=\"\",\"\",ROUND(IF(D54=\"kWh\",(G54+J54)/'10. Load Forecast'!N35,(G54+J54)/'10. Load Forecast'!P35),4))","v":""},{"$f":"IF(K54=\"\",0,K28*'10. Load Forecast'!L35*12)","v":0},{"$f":"ROUND(IF(L54=\"\",0,IF(D54=\"kWh\",'10. Load Forecast'!N35*L54,IF(D54=\"kW\",IF(L54=\"\",0,L54*'10. Load Forecast'!P35)))),2)","v":0},0]
[9,{"$f":"IF(ISBLANK('10. Load Forecast'!D36),\"\",'10. Load Forecast'!D36)","v":""},null,"",{"$f":"IF(ISBLANK('11. Cost_Allocation RSL'!H30),\"\",'11. Cost_Allocation RSL'!H30)","v":""},"","",null,"",null,{"$f":"IF(E55=\"\",\"\",IF('10. Load Forecast'!L36=0,0,IF(H55=0,0,ROUND(F55/('10. Load Forecast'!L36*12),2))))","v":""},{"$f":"IF(G55=\"\",\"\",ROUND(IF(D55=\"kWh\",(G55+J55)/'10. Load Forecast'!N36,(G55+J55)/'10. Load Forecast'!P36),4))","v":""},{"$f":"IF(K55=\"\",0,K29*'10. Load Forecast'!L36*12)","v":0},{"$f":"ROUND(IF(L55=\"\",0,IF(D55=\"kWh\",'10. Load Forecast'!N36*L55,IF(D55=\"kW\",IF(L55=\"\",0,L55*'10. Load Forecast'!P36)))),2)","v":0},0]
[10,{"$f":"IF(ISBLANK('10. Load Forecast'!D37),\"\",'10. Load Forecast'!D37)","v":""},null,"",{"$f":"IF(ISBLANK('11. Cost_Allocation RSL'!H31),\"\",'11. Cost_Allocation RSL'!H31)","v":""},"","",null,"",null,{"$f":"IF(E56=\"\",\"\",IF('10. Load Forecast'!L37=0,0,IF(H56=0,0,ROUND(F56/('10. Load Forecast'!L37*12),2))))","v":""},{"$f":"IF(G56=\"\",\"\",ROUND(IF(D56=\"kWh\",(G56+J56)/'10. Load Forecast'!N37,(G56+J56)/'10. Load Forecast'!P37),4))","v":""},{"$f":"IF(K56=\"\",0,K30*'10. Load Forecast'!L37*12)","v":0},{"$f":"ROUND(IF(L56=\"\",0,IF(D56=\"kWh\",'10. Load Forecast'!N37*L56,IF(D56=\"kW\",IF(L56=\"\",0,L56*'10. Load Forecast'!P37)))),2)","v":0},0]
[11,{"$f":"IF(ISBLANK('10. Load Forecast'!D38),\"\",'10. Load Forecast'!D38)","v":""},null,"",{"$f":"IF(ISBLANK('11. Cost_Allocation RSL'!H32),\"\",'11. Cost_Allocation RSL'!H32)","v":""},"","",null,"",null,{"$f":"IF(E57=\"\",\"\",IF('10. Load Forecast'!L38=0,0,IF(H57=0,0,ROUND(F57/('10. Load Forecast'!L38*12),2))))","v":""},{"$f":"IF(G57=\"\",\"\",ROUND(IF(D57=\"kWh\",(G57+J57)/'10. Load Forecast'!N38,(G57+J57)/'10. Load Forecast'!P38),4))","v":""},{"$f":"IF(K57=\"\",0,K31*'10. Load Forecast'!L38*12)","v":0},{"$f":"ROUND(IF(L57=\"\",0,IF(D57=\"kWh\",'10. Load Forecast'!N38*L57,IF(D57=\"kW\",IF(L57=\"\",0,L57*'10. Load Forecast'!P38)))),2)","v":0},0]
[12,{"$f":"IF(ISBLANK('10. Load Forecast'!D39),\"\",'10. Load Forecast'!D39)","v":""},null,"",{"$f":"IF(ISBLANK('11. Cost_Allocation RSL'!H33),\"\",'11. Cost_Allocation RSL'!H33)","v":""},"","",null,"",null,{"$f":"IF(E58=\"\",\"\",IF('10. Load Forecast'!L39=0,0,IF(H58=0,0,ROUND(F58/('10. Load Forecast'!L39*12),2))))","v":""},{"$f":"IF(G58=\"\",\"\",ROUND(IF(D58=\"kWh\",(G58+J58)/'10. Load Forecast'!N39,(G58+J58)/'10. Load Forecast'!P39),4))","v":""},{"$f":"IF(K58=\"\",0,K32*'10. Load Forecast'!L39*12)","v":0},{"$f":"ROUND(IF(L58=\"\",0,IF(D58=\"kWh\",'10. Load Forecast'!N39*L58,IF(D58=\"kW\",IF(L58=\"\",0,L58*'10. Load Forecast'!P39)))),2)","v":0},0]
[13,{"$f":"IF(ISBLANK('10. Load Forecast'!D40),\"\",'10. Load Forecast'!D40)","v":""},null,"",{"$f":"IF(ISBLANK('11. Cost_Allocation RSL'!H34),\"\",'11. Cost_Allocation RSL'!H34)","v":""},"","",null,"",null,{"$f":"IF(E59=\"\",\"\",IF('10. Load Forecast'!L40=0,0,IF(H59=0,0,ROUND(F59/('10. Load Forecast'!L40*12),2))))","v":""},{"$f":"IF(G59=\"\",\"\",ROUND(IF(D59=\"kWh\",(G59+J59)/'10. Load Forecast'!N40,(G59+J59)/'10. Load Forecast'!P40),4))","v":""},{"$f":"IF(K59=\"\",0,K33*'10. Load Forecast'!L40*12)","v":0},{"$f":"ROUND(IF(L59=\"\",0,IF(D59=\"kWh\",'10. Load Forecast'!N40*L59,IF(D59=\"kW\",IF(L59=\"\",0,L59*'10. Load Forecast'!P40)))),2)","v":0},0]
[14,{"$f":"IF(ISBLANK('10. Load Forecast'!D41),\"\",'10. Load Forecast'!D41)","v":""},null,"",{"$f":"IF(ISBLANK('11. Cost_Allocation RSL'!H35),\"\",'11. Cost_Allocation RSL'!H35)","v":""},"","",null,"",null,{"$f":"IF(E60=\"\",\"\",IF('10. Load Forecast'!L41=0,0,IF(H60=0,0,ROUND(F60/('10. Load Forecast'!L41*12),2))))","v":""},{"$f":"IF(G60=\"\",\"\",ROUND(IF(D60=\"kWh\",(G60+J60)/'10. Load Forecast'!N41,(G60+J60)/'10. Load Forecast'!P41),4))","v":""},{"$f":"IF(K60=\"\",0,K34*'10. Load Forecast'!L41*12)","v":0},{"$f":"ROUND(IF(L60=\"\",0,IF(D60=\"kWh\",'10. Load Forecast'!N41*L60,IF(D60=\"kW\",IF(L60=\"\",0,L60*'10. Load Forecast'!P41)))),2)","v":0},0]
[15,{"$f":"IF(ISBLANK('10. Load Forecast'!D42),\"\",'10. Load Forecast'!D42)","v":""},null,"",{"$f":"IF(ISBLANK('11. Cost_Allocation RSL'!H36),\"\",'11. Cost_Allocation RSL'!H36)","v":""},"","",null,"",null,{"$f":"IF(E61=\"\",\"\",IF('10. Load Forecast'!L42=0,0,IF(H61=0,0,ROUND(F61/('10. Load Forecast'!L42*12),2))))","v":""},{"$f":"IF(G61=\"\",\"\",ROUND(IF(D61=\"kWh\",(G61+J61)/'10. Load Forecast'!N42,(G61+J61)/'10. Load Forecast'!P42),4))","v":""},{"$f":"IF(K61=\"\",0,K35*'10. Load Forecast'!L42*12)","v":0},{"$f":"ROUND(IF(L61=\"\",0,IF(D61=\"kWh\",'10. Load Forecast'!N42*L61,IF(D61=\"kW\",IF(L61=\"\",0,L61*'10. Load Forecast'!P42)))),2)","v":0},0]
[16,{"$f":"IF(ISBLANK('10. Load Forecast'!D43),\"\",'10. Load Forecast'!D43)","v":""},null,"",{"$f":"IF(ISBLANK('11. Cost_Allocation RSL'!H37),\"\",'11. Cost_Allocation RSL'!H37)","v":""},"","",null,"",null,{"$f":"IF(E62=\"\",\"\",IF('10. Load Forecast'!L43=0,0,IF(H62=0,0,ROUND(F62/('10. Load Forecast'!L43*12),2))))","v":""},{"$f":"IF(G62=\"\",\"\",ROUND(IF(D62=\"kWh\",(G62+J62)/'10. Load Forecast'!N43,(G62+J62)/'10. Load Forecast'!P43),4))","v":""},{"$f":"IF(K62=\"\",0,K36*'10. Load Forecast'!L43*12)","v":0},{"$f":"ROUND(IF(L62=\"\",0,IF(D62=\"kWh\",'10. Load Forecast'!N43*L62,IF(D62=\"kW\",IF(L62=\"\",0,L62*'10. Load Forecast'!P43)))),2)","v":0},0]
[17,{"$f":"IF(ISBLANK('10. Load Forecast'!D44),\"\",'10. Load Forecast'!D44)","v":""},null,"",{"$f":"IF(ISBLANK('11. Cost_Allocation RSL'!H38),\"\",'11. Cost_Allocation RSL'!H38)","v":""},"","",null,"",null,{"$f":"IF(E63=\"\",\"\",IF('10. Load Forecast'!L44=0,0,IF(H63=0,0,ROUND(F63/('10. Load Forecast'!L44*12),2))))","v":""},{"$f":"IF(G63=\"\",\"\",ROUND(IF(D63=\"kWh\",(G63+J63)/'10. Load Forecast'!N44,(G63+J63)/'10. Load Forecast'!P44),4))","v":""},{"$f":"IF(K63=\"\",0,K37*'10. Load Forecast'!L44*12)","v":0},{"$f":"ROUND(IF(L63=\"\",0,IF(D63=\"kWh\",'10. Load Forecast'!N44*L63,IF(D63=\"kW\",IF(L63=\"\",0,L63*'10. Load Forecast'!P44)))),2)","v":0},0]
[18,{"$f":"IF(ISBLANK('10. Load Forecast'!D45),\"\",'10. Load Forecast'!D45)","v":""},null,"",{"$f":"IF(ISBLANK('11. Cost_Allocation RSL'!H39),\"\",'11. Cost_Allocation RSL'!H39)","v":""},"","",null,"",null,{"$f":"IF(E64=\"\",\"\",IF('10. Load Forecast'!L45=0,0,IF(H64=0,0,ROUND(F64/('10. Load Forecast'!L45*12),2))))","v":""},{"$f":"IF(G64=\"\",\"\",ROUND(IF(D64=\"kWh\",(G64+J64)/'10. Load Forecast'!N45,(G64+J64)/'10. Load Forecast'!P45),4))","v":""},{"$f":"IF(K64=\"\",0,K38*'10. Load Forecast'!L45*12)","v":0},{"$f":"ROUND(IF(L64=\"\",0,IF(D64=\"kWh\",'10. Load Forecast'!N45*L64,IF(D64=\"kW\",IF(L64=\"\",0,L64*'10. Load Forecast'!P45)))),2)","v":0},0]
[19,{"$f":"IF(ISBLANK('10. Load Forecast'!D46),\"\",'10. Load Forecast'!D46)","v":""},null,"",{"$f":"IF(ISBLANK('11. Cost_Allocation RSL'!H40),\"\",'11. Cost_Allocation RSL'!H40)","v":""},"","",null,"",null,{"$f":"IF(E65=\"\",\"\",IF('10. Load Forecast'!L46=0,0,IF(H65=0,0,ROUND(F65/('10. Load Forecast'!L46*12),2))))","v":""},{"$f":"IF(G65=\"\",\"\",ROUND(IF(D65=\"kWh\",(G65+J65)/'10. Load Forecast'!N46,(G65+J65)/'10. Load Forecast'!P46),4))","v":""},{"$f":"IF(K65=\"\",0,K39*'10. Load Forecast'!L46*12)","v":0},{"$f":"ROUND(IF(L65=\"\",0,IF(D65=\"kWh\",'10. Load Forecast'!N46*L65,IF(D65=\"kW\",IF(L65=\"\",0,L65*'10. Load Forecast'!P46)))),2)","v":0},0]
[20,{"$f":"IF(ISBLANK('10. Load Forecast'!D47),\"\",'10. Load Forecast'!D47)","v":""},null,"",{"$f":"IF(ISBLANK('11. Cost_Allocation RSL'!H41),\"\",'11. Cost_Allocation RSL'!H41)","v":""},"","",null,"",null,{"$f":"IF(E66=\"\",\"\",IF('10. Load Forecast'!L47=0,0,IF(H66=0,0,ROUND(F66/('10. Load Forecast'!L47*12),2))))","v":""},{"$f":"IF(G66=\"\",\"\",ROUND(IF(D66=\"kWh\",(G66+J66)/'10. Load Forecast'!N47,(G66+J66)/'10. Load Forecast'!P47),4))","v":""},{"$f":"IF(K66=\"\",0,K40*'10. Load Forecast'!L47*12)","v":0},{"$f":"ROUND(IF(L66=\"\",0,IF(D66=\"kWh\",'10. Load Forecast'!N47*L66,IF(D66=\"kW\",IF(L66=\"\",0,L66*'10. Load Forecast'!P47)))),2)","v":0},0]
[null,null,null,"Total",{"$f":"SUM(E47:E66)","v":0},{"$f":"SUM(F47:F66)","v":0},{"$f":"SUM(G47:G66)","v":0},null,null,null," "," ",{"$f":"SUM(M47:M66)","v":0},{"$f":"SUM(N47:N66)","v":0},{"$f":"SUM(O47:O66)","v":0}]
[]
[null,null,null,{"$f":"'3. Data_Input_Sheet'!U12","v":"Settlement Agreement"}]
[]
[null,"Customer Class",null,"Billing Determinant","Total Class Revenue Requirement","MSC Revenues (S)","Volumetric revenues (S)","Fixed","Variable","Transformer Ownership Allowance 1 ($)","Monthly Service Charge ","Volumetric Rate  ($)","MSC Revenues (S)","Volumetric revenues (S)","Distribution Revenues less Transformer Ownership Allowance",null,"Integrity Check"]
[]
[1,{"$f":"B21","v":"Residential"},null,{"$f":"D47","v":"kWh"},{"$f":"IF(ISBLANK('11. Cost_Allocation RSL'!H79),\"\",'11. Cost_Allocation RSL'!H79)","v":""},{"$f":"IF(ISBLANK(H73),\"\",E73*H73)","v":""},{"$f":"IF(F73=\"\",\"\",E73-F73)","v":""},null,{"$f":"IF(ISBLANK(H73),\"\",1-H73)","v":""},null,{"$f":"IF(E73=\"\",\"\",IF('10. Load Forecast'!R28=0,0,IF(H73=0,0,ROUND(F73/('10. Load Forecast'!R28*12),2))))","v":""},{"$f":"IF(G73=\"\",\"\",ROUND(IF(D73=\"kWh\",(G73+J73)/'10. Load Forecast'!T28,(G73+J73)/'10. Load Forecast'!V28),4))","v":""},{"$f":"IF(K73=\"\",0,K73*'10. Load Forecast'!R28*12)","v":0},{"$f":"ROUND(IF(L73=\"\",0,IF(D73=\"kWh\",'10. Load Forecast'!T28*L73,IF(D73=\"kW\",IF(L73=\"\",0,L73*'10. Load Forecast'!V28)))),2)","v":0},{"$f":"ROUND(M73+N73-J73,2)","v":0}]
[2,{"$f":"B22","v":"General Service < 50 kW"},null,{"$f":"D48","v":"kWh"},{"$f":"IF(ISBLANK('11. Cost_Allocation RSL'!H80),\"\",'11. Cost_Allocation RSL'!H80)","v":""},{"$f":"IF(ISBLANK(H74),\"\",E74*H74)","v":""},{"$f":"IF(F74=\"\",\"\",E74-F74)","v":""},null,"",null,{"$f":"IF(E74=\"\",\"\",IF('10. Load Forecast'!R29=0,0,IF(H74=0,0,ROUND(F74/('10. Load Forecast'!R29*12),2))))","v":""},{"$f":"IF(G74=\"\",\"\",ROUND(IF(D74=\"kWh\",(G74+J74)/'10. Load Forecast'!T29,(G74+J74)/'10. Load Forecast'!V29),4))","v":""},{"$f":"IF(K74=\"\",0,K74*'10. Load Forecast'!R29*12)","v":0},{"$f":"ROUND(IF(L74=\"\",0,IF(D74=\"kWh\",'10. Load Forecast'!T29*L74,IF(D74=\"kW\",IF(L74=\"\",0,L74*'10. Load Forecast'!V29)))),2)","v":0},0,null,"Total Distribution Revenues",null,{"$f":"SUM(O73:O92)","v":0}]
[3,"General Service > 50 to 4999 kW",null,"kW",{"$f":"IF(ISBLANK('11. Cost_Allocation RSL'!H81),\"\",'11. Cost_Allocation RSL'!H81)","v":""},"","",null,"",null,{"$f":"IF(E75=\"\",\"\",IF('10. Load Forecast'!R30=0,0,IF(H75=0,0,ROUND(F75/('10. Load Forecast'!R30*12),2))))","v":""},{"$f":"IF(G75=\"\",\"\",ROUND(IF(D75=\"kWh\",(G75+J75)/'10. Load Forecast'!T30,(G75+J75)/'10. Load Forecast'!V30),4))","v":""},{"$f":"IF(K75=\"\",0,K75*'10. Load Forecast'!R30*12)","v":0},{"$f":"ROUND(IF(L75=\"\",0,IF(D75=\"kWh\",'10. Load Forecast'!T30*L75,IF(D75=\"kW\",IF(L75=\"\",0,L75*'10. Load Forecast'!V30)))),2)","v":0},0]
[4,"Unmetered Scattered Load",null,"kWh",{"$f":"IF(ISBLANK('11. Cost_Allocation RSL'!H82),\"\",'11. Cost_Allocation RSL'!H82)","v":""},"","",null,"",null,{"$f":"IF(E76=\"\",\"\",IF('10. Load Forecast'!R31=0,0,IF(H76=0,0,ROUND(F76/('10. Load Forecast'!R31*12),2))))","v":""},{"$f":"IF(G76=\"\",\"\",ROUND(IF(D76=\"kWh\",(G76+J76)/'10. Load Forecast'!T31,(G76+J76)/'10. Load Forecast'!V31),4))","v":""},{"$f":"IF(K76=\"\",0,K76*'10. Load Forecast'!R31*12)","v":0},{"$f":"ROUND(IF(L76=\"\",0,IF(D76=\"kWh\",'10. Load Forecast'!T31*L76,IF(D76=\"kW\",IF(L76=\"\",0,L76*'10. Load Forecast'!V31)))),2)","v":0},0,null,"Base Revenue Requirement",null,{"$f":"'9. Rev_Reqt'!N28","v":0}]
[5,"Sentinel",null,"kW",{"$f":"IF(ISBLANK('11. Cost_Allocation RSL'!H83),\"\",'11. Cost_Allocation RSL'!H83)","v":""},"","",null,"",null,{"$f":"IF(E77=\"\",\"\",IF('10. Load Forecast'!R32=0,0,IF(H77=0,0,ROUND(F77/('10. Load Forecast'!R32*12),2))))","v":""},{"$f":"IF(G77=\"\",\"\",ROUND(IF(D77=\"kWh\",(G77+J77)/'10. Load Forecast'!T32,(G77+J77)/'10. Load Forecast'!V32),4))","v":""},{"$f":"IF(K77=\"\",0,K77*'10. Load Forecast'!R32*12)","v":0},{"$f":"ROUND(IF(L77=\"\",0,IF(D77=\"kWh\",'10. Load Forecast'!T32*L77,IF(D77=\"kW\",IF(L77=\"\",0,L77*'10. Load Forecast'!V32)))),2)","v":0},0]
[6,"StreetLights",null,"kW",{"$f":"IF(ISBLANK('11. Cost_Allocation RSL'!H84),\"\",'11. Cost_Allocation RSL'!H84)","v":""},"","",null,"",null,{"$f":"IF(E78=\"\",\"\",IF('10. Load Forecast'!R33=0,0,IF(H78=0,0,ROUND(F78/('10. Load Forecast'!R33*12),2))))","v":""},{"$f":"IF(G78=\"\",\"\",ROUND(IF(D78=\"kWh\",(G78+J78)/'10. Load Forecast'!T33,(G78+J78)/'10. Load Forecast'!V33),4))","v":""},{"$f":"IF(K78=\"\",0,K78*'10. Load Forecast'!R33*12)","v":0},{"$f":"ROUND(IF(L78=\"\",0,IF(D78=\"kWh\",'10. Load Forecast'!T33*L78,IF(D78=\"kW\",IF(L78=\"\",0,L78*'10. Load Forecast'!V33)))),2)","v":0},0,null,"Difference",null,{"$f":"S74-S76","v":0}]
[7,{"$f":"IF(ISBLANK('10. Load Forecast'!D34),\"\",'10. Load Forecast'!D34)","v":"StreetLights"},null,{"$f":"IF(ISBLANK(D53), \"\",(D53))","v":""},{"$f":"IF(ISBLANK('11. Cost_Allocation RSL'!H85),\"\",'11. Cost_Allocation RSL'!H28)","v":""},{"$f":"IF(ISBLANK(H27),\"\",E27*H27)","v":""},{"$f":"IF(F27=\"\",\"\",E27-F27)","v":""},null,{"$f":"IF(ISBLANK(H27),\"\",1-H27)","v":""},null,{"$f":"IF(E79=\"\",\"\",IF('10. Load Forecast'!R34=0,0,IF(H79=0,0,ROUND(F79/('10. Load Forecast'!R34*12),2))))","v":""},{"$f":"IF(G79=\"\",\"\",ROUND(IF(D79=\"kWh\",(G79+J79)/'10. Load Forecast'!T34,(G79+J79)/'10. Load Forecast'!V34),4))","v":""},{"$f":"IF(K79=\"\",0,K79*'10. Load Forecast'!R34*12)","v":0},{"$f":"ROUND(IF(L79=\"\",0,IF(D79=\"kWh\",'10. Load Forecast'!T34*L79,IF(D79=\"kW\",IF(L79=\"\",0,L79*'10. Load Forecast'!V34)))),2)","v":0},0,null,"% Difference",null,{"$f":"IF(S76=0,\"\",S78/S76)","v":""}]
[8,{"$f":"IF(ISBLANK('10. Load Forecast'!D35),\"\",'10. Load Forecast'!D35)","v":""},null,{"$f":"IF(ISBLANK(D54), \"\",(D54))","v":""},{"$f":"IF(ISBLANK('11. Cost_Allocation RSL'!H86),\"\",'11. Cost_Allocation RSL'!H29)","v":""},"","",null,"",null,{"$f":"IF(E80=\"\",\"\",IF('10. Load Forecast'!R35=0,0,IF(H80=0,0,ROUND(F80/('10. Load Forecast'!R35*12),2))))","v":""},{"$f":"IF(G80=\"\",\"\",ROUND(IF(D80=\"kWh\",(G80+J80)/'10. Load Forecast'!T35,(G80+J80)/'10. Load Forecast'!V35),4))","v":""},{"$f":"IF(K80=\"\",0,K80*'10. Load Forecast'!R35*12)","v":0},{"$f":"ROUND(IF(L80=\"\",0,IF(D80=\"kWh\",'10. Load Forecast'!T35*L80,IF(D80=\"kW\",IF(L80=\"\",0,L80*'10. Load Forecast'!V35)))),2)","v":0},0]
[9,{"$f":"IF(ISBLANK('10. Load Forecast'!D36),\"\",'10. Load Forecast'!D36)","v":""},null,"",{"$f":"IF(ISBLANK('11. Cost_Allocation RSL'!H87),\"\",'11. Cost_Allocation RSL'!H30)","v":""},"","",null,"",null,{"$f":"IF(E81=\"\",\"\",IF('10. Load Forecast'!R36=0,0,IF(H81=0,0,ROUND(F81/('10. Load Forecast'!R36*12),2))))","v":""},{"$f":"IF(G81=\"\",\"\",ROUND(IF(D81=\"kWh\",(G81+J81)/'10. Load Forecast'!T36,(G81+J81)/'10. Load Forecast'!V36),4))","v":""},{"$f":"IF(K81=\"\",0,K81*'10. Load Forecast'!R36*12)","v":0},{"$f":"ROUND(IF(L81=\"\",0,IF(D81=\"kWh\",'10. Load Forecast'!T36*L81,IF(D81=\"kW\",IF(L81=\"\",0,L81*'10. Load Forecast'!V36)))),2)","v":0},0]
[10,{"$f":"IF(ISBLANK('10. Load Forecast'!D37),\"\",'10. Load Forecast'!D37)","v":""},null,"",{"$f":"IF(ISBLANK('11. Cost_Allocation RSL'!H88),\"\",'11. Cost_Allocation RSL'!H31)","v":""},"","",null,"",null,{"$f":"IF(E82=\"\",\"\",IF('10. Load Forecast'!R37=0,0,IF(H82=0,0,ROUND(F82/('10. Load Forecast'!R37*12),2))))","v":""},{"$f":"IF(G82=\"\",\"\",ROUND(IF(D82=\"kWh\",(G82+J82)/'10. Load Forecast'!T37,(G82+J82)/'10. Load Forecast'!V37),4))","v":""},{"$f":"IF(K82=\"\",0,K82*'10. Load Forecast'!R37*12)","v":0},{"$f":"ROUND(IF(L82=\"\",0,IF(D82=\"kWh\",'10. Load Forecast'!T37*L82,IF(D82=\"kW\",IF(L82=\"\",0,L82*'10. Load Forecast'!V37)))),2)","v":0},0]
[11,{"$f":"IF(ISBLANK('10. Load Forecast'!D38),\"\",'10. Load Forecast'!D38)","v":""},null,"",{"$f":"IF(ISBLANK('11. Cost_Allocation RSL'!H89),\"\",'11. Cost_Allocation RSL'!H32)","v":""},"","",null,"",null,{"$f":"IF(E83=\"\",\"\",IF('10. Load Forecast'!R38=0,0,IF(H83=0,0,ROUND(F83/('10. Load Forecast'!R38*12),2))))","v":""},{"$f":"IF(G83=\"\",\"\",ROUND(IF(D83=\"kWh\",(G83+J83)/'10. Load Forecast'!T38,(G83+J83)/'10. Load Forecast'!V38),4))","v":""},{"$f":"IF(K83=\"\",0,K83*'10. Load Forecast'!R38*12)","v":0},{"$f":"ROUND(IF(L83=\"\",0,IF(D83=\"kWh\",'10. Load Forecast'!T38*L83,IF(D83=\"kW\",IF(L83=\"\",0,L83*'10. Load Forecast'!V38)))),2)","v":0},0]
[12,{"$f":"IF(ISBLANK('10. Load Forecast'!D39),\"\",'10. Load Forecast'!D39)","v":""},null,"",{"$f":"IF(ISBLANK('11. Cost_Allocation RSL'!H90),\"\",'11. Cost_Allocation RSL'!H33)","v":""},"","",null,"",null,{"$f":"IF(E84=\"\",\"\",IF('10. Load Forecast'!R39=0,0,IF(H84=0,0,ROUND(F84/('10. Load Forecast'!R39*12),2))))","v":""},{"$f":"IF(G84=\"\",\"\",ROUND(IF(D84=\"kWh\",(G84+J84)/'10. Load Forecast'!T39,(G84+J84)/'10. Load Forecast'!V39),4))","v":""},{"$f":"IF(K84=\"\",0,K84*'10. Load Forecast'!R39*12)","v":0},{"$f":"ROUND(IF(L84=\"\",0,IF(D84=\"kWh\",'10. Load Forecast'!T39*L84,IF(D84=\"kW\",IF(L84=\"\",0,L84*'10. Load Forecast'!V39)))),2)","v":0},0]
[13,{"$f":"IF(ISBLANK('10. Load Forecast'!D40),\"\",'10. Load Forecast'!D40)","v":""},null,"",{"$f":"IF(ISBLANK('11. Cost_Allocation RSL'!H91),\"\",'11. Cost_Allocation RSL'!H34)","v":""},"","",null,"",null,{"$f":"IF(E85=\"\",\"\",IF('10. Load Forecast'!R40=0,0,IF(H85=0,0,ROUND(F85/('10. Load Forecast'!R40*12),2))))","v":""},{"$f":"IF(G85=\"\",\"\",ROUND(IF(D85=\"kWh\",(G85+J85)/'10. Load Forecast'!T40,(G85+J85)/'10. Load Forecast'!V40),4))","v":""},{"$f":"IF(K85=\"\",0,K85*'10. Load Forecast'!R40*12)","v":0},{"$f":"ROUND(IF(L85=\"\",0,IF(D85=\"kWh\",'10. Load Forecast'!T40*L85,IF(D85=\"kW\",IF(L85=\"\",0,L85*'10. Load Forecast'!V40)))),2)","v":0},0]
[14,{"$f":"IF(ISBLANK('10. Load Forecast'!D41),\"\",'10. Load Forecast'!D41)","v":""},null,"",{"$f":"IF(ISBLANK('11. Cost_Allocation RSL'!H92),\"\",'11. Cost_Allocation RSL'!H35)","v":""},"","",null,"",null,{"$f":"IF(E86=\"\",\"\",IF('10. Load Forecast'!R41=0,0,IF(H86=0,0,ROUND(F86/('10. Load Forecast'!R41*12),2))))","v":""},{"$f":"IF(G86=\"\",\"\",ROUND(IF(D86=\"kWh\",(G86+J86)/'10. Load Forecast'!T41,(G86+J86)/'10. Load Forecast'!V41),4))","v":""},{"$f":"IF(K86=\"\",0,K86*'10. Load Forecast'!R41*12)","v":0},{"$f":"ROUND(IF(L86=\"\",0,IF(D86=\"kWh\",'10. Load Forecast'!T41*L86,IF(D86=\"kW\",IF(L86=\"\",0,L86*'10. Load Forecast'!V41)))),2)","v":0},0]
[15,{"$f":"IF(ISBLANK('10. Load Forecast'!D42),\"\",'10. Load Forecast'!D42)","v":""},null,"",{"$f":"IF(ISBLANK('11. Cost_Allocation RSL'!H93),\"\",'11. Cost_Allocation RSL'!H36)","v":""},"","",null,"",null,{"$f":"IF(E87=\"\",\"\",IF('10. Load Forecast'!R42=0,0,IF(H87=0,0,ROUND(F87/('10. Load Forecast'!R42*12),2))))","v":""},{"$f":"IF(G87=\"\",\"\",ROUND(IF(D87=\"kWh\",(G87+J87)/'10. Load Forecast'!T42,(G87+J87)/'10. Load Forecast'!V42),4))","v":""},{"$f":"IF(K87=\"\",0,K87*'10. Load Forecast'!R42*12)","v":0},{"$f":"ROUND(IF(L87=\"\",0,IF(D87=\"kWh\",'10. Load Forecast'!T42*L87,IF(D87=\"kW\",IF(L87=\"\",0,L87*'10. Load Forecast'!V42)))),2)","v":0},0]
[16,{"$f":"IF(ISBLANK('10. Load Forecast'!D43),\"\",'10. Load Forecast'!D43)","v":""},null,"",{"$f":"IF(ISBLANK('11. Cost_Allocation RSL'!H94),\"\",'11. Cost_Allocation RSL'!H37)","v":""},"","",null,"",null,{"$f":"IF(E88=\"\",\"\",IF('10. Load Forecast'!R43=0,0,IF(H88=0,0,ROUND(F88/('10. Load Forecast'!R43*12),2))))","v":""},{"$f":"IF(G88=\"\",\"\",ROUND(IF(D88=\"kWh\",(G88+J88)/'10. Load Forecast'!T43,(G88+J88)/'10. Load Forecast'!V43),4))","v":""},{"$f":"IF(K88=\"\",0,K88*'10. Load Forecast'!R43*12)","v":0},{"$f":"ROUND(IF(L88=\"\",0,IF(D88=\"kWh\",'10. Load Forecast'!T43*L88,IF(D88=\"kW\",IF(L88=\"\",0,L88*'10. Load Forecast'!V43)))),2)","v":0},0]
[17,{"$f":"IF(ISBLANK('10. Load Forecast'!D44),\"\",'10. Load Forecast'!D44)","v":""},null,"",{"$f":"IF(ISBLANK('11. Cost_Allocation RSL'!H95),\"\",'11. Cost_Allocation RSL'!H38)","v":""},"","",null,"",null,{"$f":"IF(E89=\"\",\"\",IF('10. Load Forecast'!R44=0,0,IF(H89=0,0,ROUND(F89/('10. Load Forecast'!R44*12),2))))","v":""},{"$f":"IF(G89=\"\",\"\",ROUND(IF(D89=\"kWh\",(G89+J89)/'10. Load Forecast'!T44,(G89+J89)/'10. Load Forecast'!V44),4))","v":""},{"$f":"IF(K89=\"\",0,K89*'10. Load Forecast'!R44*12)","v":0},{"$f":"ROUND(IF(L89=\"\",0,IF(D89=\"kWh\",'10. Load Forecast'!T44*L89,IF(D89=\"kW\",IF(L89=\"\",0,L89*'10. Load Forecast'!V44)))),2)","v":0},0]
[18,{"$f":"IF(ISBLANK('10. Load Forecast'!D45),\"\",'10. Load Forecast'!D45)","v":""},null,"",{"$f":"IF(ISBLANK('11. Cost_Allocation RSL'!H96),\"\",'11. Cost_Allocation RSL'!H39)","v":""},"","",null,"",null,{"$f":"IF(E90=\"\",\"\",IF('10. Load Forecast'!R45=0,0,IF(H90=0,0,ROUND(F90/('10. Load Forecast'!R45*12),2))))","v":""},{"$f":"IF(G90=\"\",\"\",ROUND(IF(D90=\"kWh\",(G90+J90)/'10. Load Forecast'!T45,(G90+J90)/'10. Load Forecast'!V45),4))","v":""},{"$f":"IF(K90=\"\",0,K90*'10. Load Forecast'!R45*12)","v":0},{"$f":"ROUND(IF(L90=\"\",0,IF(D90=\"kWh\",'10. Load Forecast'!T45*L90,IF(D90=\"kW\",IF(L90=\"\",0,L90*'10. Load Forecast'!V45)))),2)","v":0},0]
[19,{"$f":"IF(ISBLANK('10. Load Forecast'!D46),\"\",'10. Load Forecast'!D46)","v":""},null,"",{"$f":"IF(ISBLANK('11. Cost_Allocation RSL'!H97),\"\",'11. Cost_Allocation RSL'!H40)","v":""},"","",null,"",null,{"$f":"IF(E91=\"\",\"\",IF('10. Load Forecast'!R46=0,0,IF(H91=0,0,ROUND(F91/('10. Load Forecast'!R46*12),2))))","v":""},{"$f":"IF(G91=\"\",\"\",ROUND(IF(D91=\"kWh\",(G91+J91)/'10. Load Forecast'!T46,(G91+J91)/'10. Load Forecast'!V46),4))","v":""},{"$f":"IF(K91=\"\",0,K91*'10. Load Forecast'!R46*12)","v":0},{"$f":"ROUND(IF(L91=\"\",0,IF(D91=\"kWh\",'10. Load Forecast'!T46*L91,IF(D91=\"kW\",IF(L91=\"\",0,L91*'10. Load Forecast'!V46)))),2)","v":0},0]
[20,{"$f":"IF(ISBLANK('10. Load Forecast'!D47),\"\",'10. Load Forecast'!D47)","v":""},null,"",{"$f":"IF(ISBLANK('11. Cost_Allocation RSL'!H98),\"\",'11. Cost_Allocation RSL'!H41)","v":""},"","",null,"",null,{"$f":"IF(E92=\"\",\"\",IF('10. Load Forecast'!R47=0,0,IF(H92=0,0,ROUND(F92/('10. Load Forecast'!R47*12),2))))","v":""},{"$f":"IF(G92=\"\",\"\",ROUND(IF(D92=\"kWh\",(G92+J92)/'10. Load Forecast'!T47,(G92+J92)/'10. Load Forecast'!V47),4))","v":""},{"$f":"IF(K92=\"\",0,K92*'10. Load Forecast'!R47*12)","v":0},{"$f":"ROUND(IF(L92=\"\",0,IF(D92=\"kWh\",'10. Load Forecast'!T47*L92,IF(D92=\"kW\",IF(L92=\"\",0,L92*'10. Load Forecast'!V47)))),2)","v":0},0]
[null,null,null,"Total",{"$f":"SUM(E73:E92)","v":0},{"$f":"SUM(F73:F92)","v":0},{"$f":"SUM(G73:G92)","v":0},null,null,null," "," ",{"$f":"SUM(M73:M92)","v":0},{"$f":"SUM(N73:N92)","v":0},{"$f":"SUM(O73:O92)","v":0}]
[]
[null,null,null,{"$f":"'3. Data_Input_Sheet'!AC12","v":"Per Board Decision"}]
[]
[null,"Customer Class",null,"Billing Determinant","Total Class Revenue Requirement","MSC Revenues (S)","Volumetric revenues (S)","Fixed","Variable","Transformer Ownership Allowance 1 ($)","Monthly Service Charge ","Volumetric Rate  ($)","MSC Revenues (S)","Volumetric revenues (S)","Distribution Revenues less Transformer Ownership Allowance",null,"Integrity Check"]
[]
[1,{"$f":"B73","v":"Residential"},null,{"$f":"D73","v":"kWh"},{"$f":"IF(ISBLANK('11. Cost_Allocation RSL'!H108),\"\",'11. Cost_Allocation RSL'!H108)","v":""},{"$f":"IF(ISBLANK(H99),\"\",E99*H99)","v":""},{"$f":"IF(F99=\"\",\"\",E99-F99)","v":""},null,{"$f":"IF(ISBLANK(H99),\"\",1-H99)","v":""},null,{"$f":"IF(E99=\"\",\"\",IF('10. Load Forecast'!X28=0,0,IF(H99=0,0,ROUND(F99/('10. Load Forecast'!X28*12),2))))","v":""},{"$f":"IF(G99=\"\",\"\",ROUND(IF(D99=\"kWh\",(G99+J99)/'10. Load Forecast'!T28,(G99+J99)/'10. Load Forecast'!V28),4))","v":""},{"$f":"IF(K99=\"\",0,K99*'10. Load Forecast'!X28*12)","v":0},{"$f":"ROUND(IF(L99=\"\",0,IF(D99=\"kWh\",'10. Load Forecast'!Z28*L99,IF(D73=\"kW\",IF(L99=\"\",0,L99*'10. Load Forecast'!AB28)))),2)","v":0},{"$f":"ROUND(M99+N99-J99,2)","v":0}]
[2,{"$f":"B74","v":"General Service < 50 kW"},null,{"$f":"D74","v":"kWh"},{"$f":"IF(ISBLANK('11. Cost_Allocation RSL'!H109),\"\",'11. Cost_Allocation RSL'!H109)","v":""},{"$f":"IF(ISBLANK(H100),\"\",E100*H100)","v":""},{"$f":"IF(F100=\"\",\"\",E100-F100)","v":""},null,"",null,{"$f":"IF(E100=\"\",\"\",IF('10. Load Forecast'!X29=0,0,IF(H100=0,0,ROUND(F100/('10. Load Forecast'!X29*12),2))))","v":""},{"$f":"IF(G100=\"\",\"\",ROUND(IF(D100=\"kWh\",(G100+J100)/'10. Load Forecast'!T29,(G100+J100)/'10. Load Forecast'!V29),4))","v":""},{"$f":"IF(K100=\"\",0,K100*'10. Load Forecast'!X29*12)","v":0},{"$f":"ROUND(IF(L100=\"\",0,IF(D100=\"kWh\",'10. Load Forecast'!Z29*L100,IF(D74=\"kW\",IF(L100=\"\",0,L100*'10. Load Forecast'!AB29)))),2)","v":0},0,null,"Total Distribution Revenues",null,{"$f":"SUM(O99:O118)","v":0}]
[3,"General Service > 50 to 4999 kW",null,"kW",{"$f":"IF(ISBLANK('11. Cost_Allocation RSL'!H110),\"\",'11. Cost_Allocation RSL'!H110)","v":""},"","",null,"",null,{"$f":"IF(E101=\"\",\"\",IF('10. Load Forecast'!X30=0,0,IF(H101=0,0,ROUND(F101/('10. Load Forecast'!X30*12),2))))","v":""},{"$f":"IF(G101=\"\",\"\",ROUND(IF(D101=\"kWh\",(G101+J101)/'10. Load Forecast'!T30,(G101+J101)/'10. Load Forecast'!V30),4))","v":""},{"$f":"IF(K101=\"\",0,K101*'10. Load Forecast'!X30*12)","v":0},{"$f":"ROUND(IF(L101=\"\",0,IF(D101=\"kWh\",'10. Load Forecast'!Z30*L101,IF(D75=\"kW\",IF(L101=\"\",0,L101*'10. Load Forecast'!AB30)))),2)","v":0},0]
[4,"Unmetered Scattered Load",null,"kWh",{"$f":"IF(ISBLANK('11. Cost_Allocation RSL'!H111),\"\",'11. Cost_Allocation RSL'!H111)","v":""},"","",null,"",null,{"$f":"IF(E102=\"\",\"\",IF('10. Load Forecast'!X31=0,0,IF(H102=0,0,ROUND(F102/('10. Load Forecast'!X31*12),2))))","v":""},{"$f":"IF(G102=\"\",\"\",ROUND(IF(D102=\"kWh\",(G102+J102)/'10. Load Forecast'!T31,(G102+J102)/'10. Load Forecast'!V31),4))","v":""},{"$f":"IF(K102=\"\",0,K102*'10. Load Forecast'!X31*12)","v":0},{"$f":"ROUND(IF(L102=\"\",0,IF(D102=\"kWh\",'10. Load Forecast'!Z31*L102,IF(D76=\"kW\",IF(L102=\"\",0,L102*'10. Load Forecast'!AB31)))),2)","v":0},0,null,"Base Revenue Requirement",null,{"$f":"'9. Rev_Reqt'!R28","v":0}]
[5,"Sentinel",null,"kW",{"$f":"IF(ISBLANK('11. Cost_Allocation RSL'!H112),\"\",'11. Cost_Allocation RSL'!H112)","v":""},"","",null,"",null,{"$f":"IF(E103=\"\",\"\",IF('10. Load Forecast'!X32=0,0,IF(H103=0,0,ROUND(F103/('10. Load Forecast'!X32*12),2))))","v":""},{"$f":"IF(G103=\"\",\"\",ROUND(IF(D103=\"kWh\",(G103+J103)/'10. Load Forecast'!T32,(G103+J103)/'10. Load Forecast'!V32),4))","v":""},{"$f":"IF(K103=\"\",0,K103*'10. Load Forecast'!X32*12)","v":0},{"$f":"ROUND(IF(L103=\"\",0,IF(D103=\"kWh\",'10. Load Forecast'!Z32*L103,IF(D77=\"kW\",IF(L103=\"\",0,L103*'10. Load Forecast'!AB32)))),2)","v":0},0]
[6,"StreetLights",null,"kW",{"$f":"IF(ISBLANK('11. Cost_Allocation RSL'!H113),\"\",'11. Cost_Allocation RSL'!H113)","v":""},"","",null,"",null,{"$f":"IF(E104=\"\",\"\",IF('10. Load Forecast'!X33=0,0,IF(H104=0,0,ROUND(F104/('10. Load Forecast'!X33*12),2))))","v":""},{"$f":"IF(G104=\"\",\"\",ROUND(IF(D104=\"kWh\",(G104+J104)/'10. Load Forecast'!T33,(G104+J104)/'10. Load Forecast'!V33),4))","v":""},{"$f":"IF(K104=\"\",0,K104*'10. Load Forecast'!X33*12)","v":0},{"$f":"ROUND(IF(L104=\"\",0,IF(D104=\"kWh\",'10. Load Forecast'!Z33*L104,IF(D78=\"kW\",IF(L104=\"\",0,L104*'10. Load Forecast'!AB33)))),2)","v":0},0,null,"Difference",null,{"$f":"S100-S102","v":0}]
[7,{"$f":"IF(ISBLANK('10. Load Forecast'!D34),\"\",'10. Load Forecast'!D34)","v":"StreetLights"},null,{"$f":"IF(ISBLANK(D79), \"\",(D79))","v":""},{"$f":"IF(ISBLANK('11. Cost_Allocation RSL'!H28),\"\",'11. Cost_Allocation RSL'!H28)","v":""},{"$f":"IF(ISBLANK(H27),\"\",E27*H27)","v":""},{"$f":"IF(F27=\"\",\"\",E27-F27)","v":""},null,{"$f":"IF(ISBLANK(H27),\"\",1-H27)","v":""},null,{"$f":"IF(E105=\"\",\"\",IF('10. Load Forecast'!X34=0,0,IF(H105=0,0,ROUND(F105/('10. Load Forecast'!X34*12),2))))","v":""},{"$f":"IF(G105=\"\",\"\",ROUND(IF(D105=\"kWh\",(G105+J105)/'10. Load Forecast'!T34,(G105+J105)/'10. Load Forecast'!V34),4))","v":""},{"$f":"IF(K105=\"\",0,K105*'10. Load Forecast'!X34*12)","v":0},{"$f":"ROUND(IF(L105=\"\",0,IF(D105=\"kWh\",'10. Load Forecast'!Z34*L105,IF(D79=\"kW\",IF(L105=\"\",0,L105*'10. Load Forecast'!AB34)))),2)","v":0},0,null,"% Difference",null,{"$f":"IF(S102=0,\"\",S104/S102)","v":""}]
[8,{"$f":"IF(ISBLANK('10. Load Forecast'!D35),\"\",'10. Load Forecast'!D35)","v":""},null,{"$f":"IF(ISBLANK(D80), \"\",(D80))","v":""},{"$f":"IF(ISBLANK('11. Cost_Allocation RSL'!H29),\"\",'11. Cost_Allocation RSL'!H29)","v":""},"","",null,"",null,{"$f":"IF(E106=\"\",\"\",IF('10. Load Forecast'!X35=0,0,IF(H106=0,0,ROUND(F106/('10. Load Forecast'!X35*12),2))))","v":""},{"$f":"IF(G106=\"\",\"\",ROUND(IF(D106=\"kWh\",(G106+J106)/'10. Load Forecast'!T35,(G106+J106)/'10. Load Forecast'!V35),4))","v":""},{"$f":"IF(K106=\"\",0,K106*'10. Load Forecast'!X35*12)","v":0},{"$f":"ROUND(IF(L106=\"\",0,IF(D106=\"kWh\",'10. Load Forecast'!Z35*L106,IF(D80=\"kW\",IF(L106=\"\",0,L106*'10. Load Forecast'!AB35)))),2)","v":0},0]
[9,{"$f":"IF(ISBLANK('10. Load Forecast'!D36),\"\",'10. Load Forecast'!D36)","v":""},null,"",{"$f":"IF(ISBLANK('11. Cost_Allocation RSL'!H30),\"\",'11. Cost_Allocation RSL'!H30)","v":""},"","",null,"",null,{"$f":"IF(E107=\"\",\"\",IF('10. Load Forecast'!X36=0,0,IF(H107=0,0,ROUND(F107/('10. Load Forecast'!X36*12),2))))","v":""},{"$f":"IF(G107=\"\",\"\",ROUND(IF(D107=\"kWh\",(G107+J107)/'10. Load Forecast'!T36,(G107+J107)/'10. Load Forecast'!V36),4))","v":""},{"$f":"IF(K107=\"\",0,K107*'10. Load Forecast'!X36*12)","v":0},{"$f":"ROUND(IF(L107=\"\",0,IF(D107=\"kWh\",'10. Load Forecast'!Z36*L107,IF(D81=\"kW\",IF(L107=\"\",0,L107*'10. Load Forecast'!AB36)))),2)","v":0},0]
[10,{"$f":"IF(ISBLANK('10. Load Forecast'!D37),\"\",'10. Load Forecast'!D37)","v":""},null,"",{"$f":"IF(ISBLANK('11. Cost_Allocation RSL'!H31),\"\",'11. Cost_Allocation RSL'!H31)","v":""},"","",null,"",null,{"$f":"IF(E108=\"\",\"\",IF('10. Load Forecast'!X37=0,0,IF(H108=0,0,ROUND(F108/('10. Load Forecast'!X37*12),2))))","v":""},{"$f":"IF(G108=\"\",\"\",ROUND(IF(D108=\"kWh\",(G108+J108)/'10. Load Forecast'!T37,(G108+J108)/'10. Load Forecast'!V37),4))","v":""},{"$f":"IF(K108=\"\",0,K108*'10. Load Forecast'!X37*12)","v":0},{"$f":"ROUND(IF(L108=\"\",0,IF(D108=\"kWh\",'10. Load Forecast'!Z37*L108,IF(D82=\"kW\",IF(L108=\"\",0,L108*'10. Load Forecast'!AB37)))),2)","v":0},0]
[11,{"$f":"IF(ISBLANK('10. Load Forecast'!D38),\"\",'10. Load Forecast'!D38)","v":""},null,"",{"$f":"IF(ISBLANK('11. Cost_Allocation RSL'!H32),\"\",'11. Cost_Allocation RSL'!H32)","v":""},"","",null,"",null,{"$f":"IF(E109=\"\",\"\",IF('10. Load Forecast'!X38=0,0,IF(H109=0,0,ROUND(F109/('10. Load Forecast'!X38*12),2))))","v":""},{"$f":"IF(G109=\"\",\"\",ROUND(IF(D109=\"kWh\",(G109+J109)/'10. Load Forecast'!T38,(G109+J109)/'10. Load Forecast'!V38),4))","v":""},{"$f":"IF(K109=\"\",0,K109*'10. Load Forecast'!X38*12)","v":0},{"$f":"ROUND(IF(L109=\"\",0,IF(D109=\"kWh\",'10. Load Forecast'!Z38*L109,IF(D83=\"kW\",IF(L109=\"\",0,L109*'10. Load Forecast'!AB38)))),2)","v":0},0]
[12,{"$f":"IF(ISBLANK('10. Load Forecast'!D39),\"\",'10. Load Forecast'!D39)","v":""},null,"",{"$f":"IF(ISBLANK('11. Cost_Allocation RSL'!H33),\"\",'11. Cost_Allocation RSL'!H33)","v":""},"","",null,"",null,{"$f":"IF(E110=\"\",\"\",IF('10. Load Forecast'!X39=0,0,IF(H110=0,0,ROUND(F110/('10. Load Forecast'!X39*12),2))))","v":""},{"$f":"IF(G110=\"\",\"\",ROUND(IF(D110=\"kWh\",(G110+J110)/'10. Load Forecast'!T39,(G110+J110)/'10. Load Forecast'!V39),4))","v":""},{"$f":"IF(K110=\"\",0,K110*'10. Load Forecast'!X39*12)","v":0},{"$f":"ROUND(IF(L110=\"\",0,IF(D110=\"kWh\",'10. Load Forecast'!Z39*L110,IF(D84=\"kW\",IF(L110=\"\",0,L110*'10. Load Forecast'!AB39)))),2)","v":0},0]
[13,{"$f":"IF(ISBLANK('10. Load Forecast'!D40),\"\",'10. Load Forecast'!D40)","v":""},null,"",{"$f":"IF(ISBLANK('11. Cost_Allocation RSL'!H34),\"\",'11. Cost_Allocation RSL'!H34)","v":""},"","",null,"",null,{"$f":"IF(E111=\"\",\"\",IF('10. Load Forecast'!X40=0,0,IF(H111=0,0,ROUND(F111/('10. Load Forecast'!X40*12),2))))","v":""},{"$f":"IF(G111=\"\",\"\",ROUND(IF(D111=\"kWh\",(G111+J111)/'10. Load Forecast'!T40,(G111+J111)/'10. Load Forecast'!V40),4))","v":""},{"$f":"IF(K111=\"\",0,K111*'10. Load Forecast'!X40*12)","v":0},{"$f":"ROUND(IF(L111=\"\",0,IF(D111=\"kWh\",'10. Load Forecast'!Z40*L111,IF(D85=\"kW\",IF(L111=\"\",0,L111*'10. Load Forecast'!AB40)))),2)","v":0},0]
[14,{"$f":"IF(ISBLANK('10. Load Forecast'!D41),\"\",'10. Load Forecast'!D41)","v":""},null,"",{"$f":"IF(ISBLANK('11. Cost_Allocation RSL'!H35),\"\",'11. Cost_Allocation RSL'!H35)","v":""},"","",null,"",null,{"$f":"IF(E112=\"\",\"\",IF('10. Load Forecast'!X41=0,0,IF(H112=0,0,ROUND(F112/('10. Load Forecast'!X41*12),2))))","v":""},{"$f":"IF(G112=\"\",\"\",ROUND(IF(D112=\"kWh\",(G112+J112)/'10. Load Forecast'!T41,(G112+J112)/'10. Load Forecast'!V41),4))","v":""},{"$f":"IF(K112=\"\",0,K112*'10. Load Forecast'!X41*12)","v":0},{"$f":"ROUND(IF(L112=\"\",0,IF(D112=\"kWh\",'10. Load Forecast'!Z41*L112,IF(D86=\"kW\",IF(L112=\"\",0,L112*'10. Load Forecast'!AB41)))),2)","v":0},0]
[15,{"$f":"IF(ISBLANK('10. Load Forecast'!D42),\"\",'10. Load Forecast'!D42)","v":""},null,"",{"$f":"IF(ISBLANK('11. Cost_Allocation RSL'!H36),\"\",'11. Cost_Allocation RSL'!H36)","v":""},"","",null,"",null,{"$f":"IF(E113=\"\",\"\",IF('10. Load Forecast'!X42=0,0,IF(H113=0,0,ROUND(F113/('10. Load Forecast'!X42*12),2))))","v":""},{"$f":"IF(G113=\"\",\"\",ROUND(IF(D113=\"kWh\",(G113+J113)/'10. Load Forecast'!T42,(G113+J113)/'10. Load Forecast'!V42),4))","v":""},{"$f":"IF(K113=\"\",0,K113*'10. Load Forecast'!X42*12)","v":0},{"$f":"ROUND(IF(L113=\"\",0,IF(D113=\"kWh\",'10. Load Forecast'!Z42*L113,IF(D87=\"kW\",IF(L113=\"\",0,L113*'10. Load Forecast'!AB42)))),2)","v":0},0]
[16,{"$f":"IF(ISBLANK('10. Load Forecast'!D43),\"\",'10. Load Forecast'!D43)","v":""},null,"",{"$f":"IF(ISBLANK('11. Cost_Allocation RSL'!H37),\"\",'11. Cost_Allocation RSL'!H37)","v":""},"","",null,"",null,{"$f":"IF(E114=\"\",\"\",IF('10. Load Forecast'!X43=0,0,IF(H114=0,0,ROUND(F114/('10. Load Forecast'!X43*12),2))))","v":""},{"$f":"IF(G114=\"\",\"\",ROUND(IF(D114=\"kWh\",(G114+J114)/'10. Load Forecast'!T43,(G114+J114)/'10. Load Forecast'!V43),4))","v":""},{"$f":"IF(K114=\"\",0,K114*'10. Load Forecast'!X43*12)","v":0},{"$f":"ROUND(IF(L114=\"\",0,IF(D114=\"kWh\",'10. Load Forecast'!Z43*L114,IF(D88=\"kW\",IF(L114=\"\",0,L114*'10. Load Forecast'!AB43)))),2)","v":0},0]
[17,{"$f":"IF(ISBLANK('10. Load Forecast'!D44),\"\",'10. Load Forecast'!D44)","v":""},null,"",{"$f":"IF(ISBLANK('11. Cost_Allocation RSL'!H38),\"\",'11. Cost_Allocation RSL'!H38)","v":""},"","",null,"",null,{"$f":"IF(E115=\"\",\"\",IF('10. Load Forecast'!X44=0,0,IF(H115=0,0,ROUND(F115/('10. Load Forecast'!X44*12),2))))","v":""},{"$f":"IF(G115=\"\",\"\",ROUND(IF(D115=\"kWh\",(G115+J115)/'10. Load Forecast'!T44,(G115+J115)/'10. Load Forecast'!V44),4))","v":""},{"$f":"IF(K115=\"\",0,K115*'10. Load Forecast'!X44*12)","v":0},{"$f":"ROUND(IF(L115=\"\",0,IF(D115=\"kWh\",'10. Load Forecast'!Z44*L115,IF(D89=\"kW\",IF(L115=\"\",0,L115*'10. Load Forecast'!AB44)))),2)","v":0},0]
[18,{"$f":"IF(ISBLANK('10. Load Forecast'!D45),\"\",'10. Load Forecast'!D45)","v":""},null,"",{"$f":"IF(ISBLANK('11. Cost_Allocation RSL'!H39),\"\",'11. Cost_Allocation RSL'!H39)","v":""},"","",null,"",null,{"$f":"IF(E116=\"\",\"\",IF('10. Load Forecast'!X45=0,0,IF(H116=0,0,ROUND(F116/('10. Load Forecast'!X45*12),2))))","v":""},{"$f":"IF(G116=\"\",\"\",ROUND(IF(D116=\"kWh\",(G116+J116)/'10. Load Forecast'!T45,(G116+J116)/'10. Load Forecast'!V45),4))","v":""},{"$f":"IF(K116=\"\",0,K116*'10. Load Forecast'!X45*12)","v":0},{"$f":"ROUND(IF(L116=\"\",0,IF(D116=\"kWh\",'10. Load Forecast'!Z45*L116,IF(D90=\"kW\",IF(L116=\"\",0,L116*'10. Load Forecast'!AB45)))),2)","v":0},0]
[19,{"$f":"IF(ISBLANK('10. Load Forecast'!D46),\"\",'10. Load Forecast'!D46)","v":""},null,"",{"$f":"IF(ISBLANK('11. Cost_Allocation RSL'!H40),\"\",'11. Cost_Allocation RSL'!H40)","v":""},"","",null,"",null,{"$f":"IF(E117=\"\",\"\",IF('10. Load Forecast'!X46=0,0,IF(H117=0,0,ROUND(F117/('10. Load Forecast'!X46*12),2))))","v":""},{"$f":"IF(G117=\"\",\"\",ROUND(IF(D117=\"kWh\",(G117+J117)/'10. Load Forecast'!T46,(G117+J117)/'10. Load Forecast'!V46),4))","v":""},{"$f":"IF(K117=\"\",0,K117*'10. Load Forecast'!X46*12)","v":0},{"$f":"ROUND(IF(L117=\"\",0,IF(D117=\"kWh\",'10. Load Forecast'!Z46*L117,IF(D91=\"kW\",IF(L117=\"\",0,L117*'10. Load Forecast'!AB46)))),2)","v":0},0]
[20,{"$f":"IF(ISBLANK('10. Load Forecast'!D47),\"\",'10. Load Forecast'!D47)","v":""},null,"",{"$f":"IF(ISBLANK('11. Cost_Allocation RSL'!H41),\"\",'11. Cost_Allocation RSL'!H41)","v":""},"","",null,"",null,{"$f":"IF(E118=\"\",\"\",IF('10. Load Forecast'!X47=0,0,IF(H118=0,0,ROUND(F118/('10. Load Forecast'!X47*12),2))))","v":""},{"$f":"IF(G118=\"\",\"\",ROUND(IF(D118=\"kWh\",(G118+J118)/'10. Load Forecast'!T47,(G118+J118)/'10. Load Forecast'!V47),4))","v":""},{"$f":"IF(K118=\"\",0,K118*'10. Load Forecast'!X47*12)","v":0},{"$f":"ROUND(IF(L118=\"\",0,IF(D118=\"kWh\",'10. Load Forecast'!Z47*L118,IF(D92=\"kW\",IF(L118=\"\",0,L118*'10. Load Forecast'!AB47)))),2)","v":0},0]
[null,null,null,"Total",{"$f":"SUM(E99:E118)","v":0},{"$f":"SUM(F99:F118)","v":0},{"$f":"SUM(G99:G118)","v":0},null,null,null," "," ",{"$f":"SUM(M99:M118)","v":0},{"$f":"SUM(N99:N118)","v":0},{"$f":"SUM(O99:O118)","v":0}]

{"sheet":"15. Variance Tracking Sheet RSL","index":18,"n_rows":231,"n_cols":11,"rows_kept":231,"cut":false,"hidden":false,"merged":[[212,3,212,4],[212,5,212,6],[212,7,212,8],[212,9,212,10],[168,7,168,8],[168,9,168,10],[190,3,190,4],[190,5,190,6],[190,7,190,8],[190,9,190,10],[168,3,168,4],[168,5,168,6],[0,2,0,3],[1,2,1,3],[2,2,2,3],[3,2,3,3],[7,3,7,6]]}
[null,null,null,null,null,null,{"$f":"CONCATENATE('2. Table of Contents'!$F$6,\" \",'2. Table of Contents'!$G$6)","v":" "}]
[]
[]
[]
[]
[]
[]
[]
[]
[null,"Variance Tracking Sheet and Settlement Tables"]
[]
[null,null,null,"Initial Application",{"$f":"'3. Data_Input_Sheet'!M12","v":"Interrogatory Responses"},"Variance",{"$f":"'3. Data_Input_Sheet'!U12","v":"Settlement Agreement"},"Variance",{"$f":"'3. Data_Input_Sheet'!AC12","v":"Per Board Decision"},"Variance"]
[]
[null,"Table X","Rate Base"]
[null,null,"Gross Fixed Assets (average)",{"$f":"'4. Rate_Base'!G13","v":18899363.297337506},{"$f":"'4. Rate_Base'!O13","v":0},{"$f":"E15-D15","v":-18899363.297337506},{"$f":"'4. Rate_Base'!W13","v":0},{"$f":"G15-E15","v":0},{"$f":"'4. Rate_Base'!AC13","v":0},{"$f":"I15-G15","v":0}]
[null,null,"Accumulated Depreciation (average)",{"$f":"'4. Rate_Base'!G14","v":-4826714.3137500016},{"$f":"'4. Rate_Base'!O14","v":0},{"$f":"E16-D16","v":4826714.3137500016},{"$f":"'4. Rate_Base'!W14","v":0},{"$f":"G16-E16","v":0},{"$f":"'4. Rate_Base'!AC14","v":0},{"$f":"I16-G16","v":0}]
[null,null,"Net Fixed Assets",{"$f":"'4. Rate_Base'!G15","v":14072648.983587503},{"$f":"'4. Rate_Base'!O15","v":0},-14072648.983587503,{"$f":"'4. Rate_Base'!W15","v":0},0,{"$f":"'4. Rate_Base'!AC15","v":0},0]
[]
[null,null,"Allowance for Working Capital:"]
[null,null,"Controllable Expenses",{"$f":"'3. Data_Input_Sheet'!E19","v":3753312.9155929578},{"$f":"'3. Data_Input_Sheet'!M19","v":0},{"$f":"E20-D20","v":-3753312.9155929578},{"$f":"'3. Data_Input_Sheet'!U19","v":0},{"$f":"G20-E20","v":0},{"$f":"'3. Data_Input_Sheet'!AC19","v":0},0]
[null,null,"Cost of Power",{"$f":"'3. Data_Input_Sheet'!E20","v":15887077.360779226},{"$f":"'3. Data_Input_Sheet'!M20","v":0},-15887077.360779226,{"$f":"'3. Data_Input_Sheet'!U20","v":0},0,{"$f":"'3. Data_Input_Sheet'!AC20","v":0},0]
[null,null,"Working Capital Base",{"$f":"SUM(D20:D21)","v":19640390.276372183},{"$f":"SUM(E20:E21)","v":0},-19640390.276372183,0,0,0,0]
[null,null,"Working Capital Rate (%)",{"$f":"'3. Data_Input_Sheet'!E21","v":7.4999999999999997E-2},{"$f":"'3. Data_Input_Sheet'!M21","v":0},-7.4999999999999997E-2,{"$f":"'3. Data_Input_Sheet'!U21","v":0},0,{"$f":"'3. Data_Input_Sheet'!AC21","v":0},0]
[null,null,"Working Capital Allowance",{"$f":"D22*D23","v":1473029.2707279136},{"$f":"E22*E23","v":0},-1473029.2707279136,0,{"$f":"G24-E24","v":0},0,0]
[]
[null,null,{"$f":"'4. Rate_Base'!D19","v":"Total Rate Base"},{"$f":"'4. Rate_Base'!G19","v":15545678.254315417},{"$f":"'4. Rate_Base'!O19","v":0},{"$f":"E26-D26","v":-15545678.254315417},{"$f":"'4. Rate_Base'!W19","v":0},{"$f":"G26-E26","v":0},{"$f":"'4. Rate_Base'!AC19","v":0},{"$f":"I26-G26","v":0}]
[]
[]
[null,"Table X","Capitalization/Cost of Capital","Initial Application","Interrogatory Responses","Variance","Settlement Agreement","Variance","Per Board Decision","Variance"]
[null,null,"Capital Structure:"]
[null,null,"Long-term debt Capitalization Ratio (%)",{"$f":"'3. Data_Input_Sheet'!E55","v":0.15033514679669099},{"$f":"'3. Data_Input_Sheet'!M55","v":0},-0.15033514679669099,{"$f":"'3. Data_Input_Sheet'!U55","v":0},0,{"$f":"'3. Data_Input_Sheet'!AC55","v":0},0]
[null,null,"Short-term debt Capitalization Ratio (%)",{"$f":"'3. Data_Input_Sheet'!E56","v":0.40966485320330909},{"$f":"'3. Data_Input_Sheet'!M56","v":0},-0.40966485320330909,{"$f":"'3. Data_Input_Sheet'!U56","v":0},0,{"$f":"'3. Data_Input_Sheet'!AC56","v":0},0]
[null,null,"Common Equity Capitalization Ratio (%)",{"$f":"'3. Data_Input_Sheet'!E57","v":0.04},{"$f":"'3. Data_Input_Sheet'!M57","v":0},-0.04,{"$f":"'3. Data_Input_Sheet'!U57","v":0},0,{"$f":"'3. Data_Input_Sheet'!AC57","v":0},0]
[null,null,"Prefered Shares Capitalization Ratio (%)",{"$f":"'3. Data_Input_Sheet'!E58","v":0.4},{"$f":"'3. Data_Input_Sheet'!M58","v":0},-0.4,{"$f":"'3. Data_Input_Sheet'!U58","v":0},0,{"$f":"'3. Data_Input_Sheet'!AC58","v":0},0]
[null,null,null,{"$f":"'3. Data_Input_Sheet'!E59","v":0},{"$f":"'3. Data_Input_Sheet'!M59","v":0},0,{"$f":"'3. Data_Input_Sheet'!U59","v":0},0,{"$f":"'3. Data_Input_Sheet'!AC59","v":0},0]
[null,null,"Cost of Capital"]
[null,null,"Long-term debt Cost Rate (%)",{"$f":"'3. Data_Input_Sheet'!E62","v":0},{"$f":"'3. Data_Input_Sheet'!M62","v":0},0,{"$f":"'3. Data_Input_Sheet'!U62","v":0},0,{"$f":"'3. Data_Input_Sheet'!AC61","v":""},{"$error":"#VALUE!"}]
[null,null,"Short-term debt Cost Rate (%)",{"$f":"'3. Data_Input_Sheet'!E63","v":3.8799792196551851E-2},{"$f":"'3. Data_Input_Sheet'!M63","v":0},-3.8799792196551851E-2,{"$f":"'3. Data_Input_Sheet'!U63","v":0},0,{"$f":"'3. Data_Input_Sheet'!AC62","v":0},0]
[null,null,"Common Equity Cost Rate (%)",{"$f":"'3. Data_Input_Sheet'!E64","v":3.8799792196551851E-2},{"$f":"'3. Data_Input_Sheet'!M64","v":0},-3.8799792196551851E-2,{"$f":"'3. Data_Input_Sheet'!U64","v":0},0,{"$f":"'3. Data_Input_Sheet'!AC64","v":0},0]
[null,null,"Prefered Shares Cost Rate (%)",{"$f":"'3. Data_Input_Sheet'!E65","v":2.7199999999999998E-2},{"$f":"'3. Data_Input_Sheet'!M65","v":0},-2.7199999999999998E-2,{"$f":"'3. Data_Input_Sheet'!U65","v":0},0,{"$f":"'3. Data_Input_Sheet'!AC65","v":0},0]
[]
[null,null,{"$f":"'9. Rev_Reqt'!D22","v":"Deemed Interest Expense"},{"$f":"'9. Rev_Reqt'!F22","v":354688.38600095536},{"$f":"'9. Rev_Reqt'!J22","v":0},-354688.38600095536,{"$f":"'9. Rev_Reqt'!N22","v":0},{"$f":"G42-E42","v":0},{"$f":"'9. Rev_Reqt'!R22","v":0},{"$f":"I42-G42","v":0}]
[null,null,{"$f":"'9. Rev_Reqt'!D23","v":"Return on Deemed Equity"},{"$f":"'9. Rev_Reqt'!F23","v":566484.51558725385},{"$f":"'9. Rev_Reqt'!J23","v":0},-566484.51558725385,{"$f":"'9. Rev_Reqt'!N23","v":0},{"$f":"G43-E43","v":0},{"$f":"'9. Rev_Reqt'!R23","v":0},{"$f":"I43-G43","v":0}]
[]
[null,null,"Cost of Capital ",{"$f":"SUM(D42:D43)","v":921172.90158820921},{"$f":"SUM(E42:E43)","v":0},-921172.90158820921,0,0,0,0]
[]
[]
[null,"Table X","Operating Revenues:","Initial Application","Interrogatory Responses","Variance","Settlement Agreement","Variance","Per Board Decision","Variance"]
[null,null,"Operating Revenues:"]
[null,null,"Distribution Revenue at Current Rates",{"$f":"'3. Data_Input_Sheet'!E25","v":4026602.8760559652},{"$f":"'3. Data_Input_Sheet'!M25","v":0},-4026602.8760559652,{"$f":"'3. Data_Input_Sheet'!U25","v":0},0,{"$f":"'3. Data_Input_Sheet'!AC25","v":0},0]
[null,null,"Distribution Revenue at Proposed Rates",{"$f":"'3. Data_Input_Sheet'!E26","v":4959191.3521111663},{"$f":"'3. Data_Input_Sheet'!M26","v":0},-4959191.3521111663,{"$f":"'3. Data_Input_Sheet'!U26","v":0},0,{"$f":"'3. Data_Input_Sheet'!AC26","v":0},0]
[]
[null,null,"Other Revenue:"]
[null,null,"Specific Service Charges",{"$f":"'3. Data_Input_Sheet'!E28","v":92845.201881000001},{"$f":"'3. Data_Input_Sheet'!M28","v":0},-92845.201881000001,{"$f":"'3. Data_Input_Sheet'!U28","v":0},0,{"$f":"'3. Data_Input_Sheet'!AC28","v":0},0]
[null,null,"Late Payment Charges",{"$f":"'3. Data_Input_Sheet'!E29","v":77582.036258999986},{"$f":"'3. Data_Input_Sheet'!M29","v":0},-77582.036258999986,{"$f":"'3. Data_Input_Sheet'!U29","v":0},0,{"$f":"'3. Data_Input_Sheet'!AC29","v":0},0]
[null,null,"Other Distribution Revenue",{"$f":"'3. Data_Input_Sheet'!E30","v":196225.91315800001},{"$f":"'3. Data_Input_Sheet'!M30","v":0},-196225.91315800001,{"$f":"'3. Data_Input_Sheet'!U30","v":0},0,{"$f":"'3. Data_Input_Sheet'!AC30","v":0},0]
[null,null,"Other Income and Deductions",{"$f":"'3. Data_Input_Sheet'!E31","v":33652.893772000003},{"$f":"'3. Data_Input_Sheet'!M31","v":0},-33652.893772000003,{"$f":"'3. Data_Input_Sheet'!U31","v":0},0,{"$f":"'3. Data_Input_Sheet'!AC31","v":0},0]
[]
[null,null,"Total Revenue Offsets",{"$f":"'3. Data_Input_Sheet'!E33","v":400306.04506999999},{"$f":"'3. Data_Input_Sheet'!M33","v":0},-400306.04506999999,{"$f":"'3. Data_Input_Sheet'!U33","v":0},0,{"$f":"'3. Data_Input_Sheet'!AC33","v":0},0]
[]
[]
[null,"Table X","Operating Expenses:","Initial Application","Interrogatory Responses","Variance","Settlement Agreement","Variance","Per Board Decision","Variance"]
[null,null,"OM+A Expenses",{"$f":"'3. Data_Input_Sheet'!E36","v":3718936.3182769576},{"$f":"'3. Data_Input_Sheet'!M36","v":0},-3718936.3182769576,{"$f":"'3. Data_Input_Sheet'!U36","v":0},0,{"$f":"'3. Data_Input_Sheet'!AC36","v":0},0]
[null,null,"Depreciation/Amortization",{"$f":"'3. Data_Input_Sheet'!E37","v":685011.58},{"$f":"'3. Data_Input_Sheet'!M37","v":0},-685011.58,{"$f":"'3. Data_Input_Sheet'!U37","v":0},0,{"$f":"'3. Data_Input_Sheet'!AC37","v":0},0]
[null,null,"Property taxes",{"$f":"'3. Data_Input_Sheet'!E38","v":34376.597315999999},{"$f":"'3. Data_Input_Sheet'!M38","v":0},-34376.597315999999,{"$f":"'3. Data_Input_Sheet'!U38","v":0},0,{"$f":"'3. Data_Input_Sheet'!AC38","v":0},0]
[null,null,"Other expenses",{"$f":"'3. Data_Input_Sheet'!E39","v":0},{"$f":"'3. Data_Input_Sheet'!M39","v":0},0,{"$f":"'3. Data_Input_Sheet'!U39","v":0},0,{"$f":"'3. Data_Input_Sheet'!AC39","v":0},0]
[]
[null,null,"Total Expenses",{"$f":"SUM(D63:D67)","v":4438324.4955929574},{"$f":"SUM(E63:E67)","v":0},-4438324.4955929574,{"$f":"SUM(G63:G67)","v":0},0,{"$f":"SUM(I63:I67)","v":0},0]
[]
[]
[null,"Table X","Taxes/PILs","Initial Application","Interrogatory Responses","Variance","Settlement Agreement","Variance","Per Board Decision","Variance"]
[null,null,"Taxable Income:"]
[null,null,"Adjustments required to arrive at taxable income",{"$f":"'3. Data_Input_Sheet'!E44","v":-619053.18719999993},{"$f":"'3. Data_Input_Sheet'!M44","v":0},619053.18719999993,{"$f":"'3. Data_Input_Sheet'!U44","v":0},0,{"$f":"'3. Data_Input_Sheet'!AC44","v":0},0]
[null,null,"Utility Income Taxes and Rates:"]
[null,null,"Income taxes (not grossed up)",{"$f":"'3. Data_Input_Sheet'!E46","v":0},{"$f":"'3. Data_Input_Sheet'!M46","v":0},0,{"$f":"'3. Data_Input_Sheet'!U46","v":0},0,{"$f":"'3. Data_Input_Sheet'!AC46","v":0},0]
[null,null,"Income taxes (grossed up)",{"$f":"'3. Data_Input_Sheet'!E47","v":0},{"$f":"'3. Data_Input_Sheet'!M47","v":""},{"$f":"E76-D76","v":{"$error":"#VALUE!"}},{"$f":"'3. Data_Input_Sheet'!U47","v":""},{"$error":"#VALUE!"},{"$f":"'3. Data_Input_Sheet'!AC47","v":""},{"$f":"I76-G76","v":{"$error":"#VALUE!"}}]
[]
[null,null,"Federal tax (%)",{"$f":"'3. Data_Input_Sheet'!E49","v":0.15000000000000002},{"$f":"'3. Data_Input_Sheet'!M49","v":0},-0.15000000000000002,{"$f":"'3. Data_Input_Sheet'!U49","v":0},0,{"$f":"'3. Data_Input_Sheet'!AC49","v":0},0]
[null,null,"Provincial tax (%)",{"$f":"'3. Data_Input_Sheet'!E50","v":0.115},{"$f":"'3. Data_Input_Sheet'!M50","v":0},-0.115,{"$f":"'3. Data_Input_Sheet'!U50","v":0},0,{"$f":"'3. Data_Input_Sheet'!AC50","v":0},0]
[null,null,"Income Tax Credits",{"$f":"'3. Data_Input_Sheet'!E51","v":0},{"$f":"'3. Data_Input_Sheet'!M51","v":0},0,{"$f":"'3. Data_Input_Sheet'!U51","v":0},0,{"$f":"'3. Data_Input_Sheet'!AC51","v":0},0]
[]
[]
[null,"Table X","Revenue Requirement","Initial Application","Interrogatory Responses","Variance","Settlement Agreement","Variance","Per Board Decision","Variance"]
[null,null,{"$f":"'9. Rev_Reqt'!D15","v":"OM&A Expenses"},{"$f":"'9. Rev_Reqt'!F15","v":3718936.3182769576},{"$f":"'9. Rev_Reqt'!J15","v":0},-3718936.3182769576,{"$f":"'9. Rev_Reqt'!N15","v":0},0,{"$f":"'9. Rev_Reqt'!R15","v":0},0]
[null,null,{"$f":"'9. Rev_Reqt'!D16","v":"Amortization/Depreciation"},{"$f":"'9. Rev_Reqt'!F16","v":685011.58},{"$f":"'9. Rev_Reqt'!J16","v":0},-685011.58,{"$f":"'9. Rev_Reqt'!N16","v":0},0,{"$f":"'9. Rev_Reqt'!R16","v":0},0]
[null,null,{"$f":"'9. Rev_Reqt'!D17","v":"Property Taxes"},{"$f":"'9. Rev_Reqt'!F17","v":34376.597315999999},{"$f":"'9. Rev_Reqt'!J17","v":0},-34376.597315999999,{"$f":"'9. Rev_Reqt'!N17","v":0},0,{"$f":"'9. Rev_Reqt'!R17","v":0},0]
[null,null,{"$f":"'9. Rev_Reqt'!D18","v":"Capital Taxes"},{"$f":"'9. Rev_Reqt'!F18","v":0},{"$f":"'9. Rev_Reqt'!J18","v":0},0,{"$f":"'9. Rev_Reqt'!N18","v":0},0,{"$f":"'9. Rev_Reqt'!R18","v":0},0]
[null,null,{"$f":"'9. Rev_Reqt'!D19","v":"Income Taxes (Grossed up)"},{"$f":"'9. Rev_Reqt'!F19","v":0},{"$f":"'9. Rev_Reqt'!J19","v":0},0,{"$f":"'9. Rev_Reqt'!N19","v":0},0,{"$f":"'9. Rev_Reqt'!R19","v":0},0]
[null,null,{"$f":"'9. Rev_Reqt'!D22","v":"Deemed Interest Expense"},{"$f":"'9. Rev_Reqt'!F22","v":354688.38600095536},{"$f":"'9. Rev_Reqt'!J22","v":0},-354688.38600095536,{"$f":"'9. Rev_Reqt'!N22","v":0},0,{"$f":"'9. Rev_Reqt'!R22","v":0},0]
[null,null,{"$f":"'9. Rev_Reqt'!D23","v":"Return on Deemed Equity"},{"$f":"'9. Rev_Reqt'!F23","v":566484.51558725385},{"$f":"'9. Rev_Reqt'!J23","v":0},-566484.51558725385,{"$f":"'9. Rev_Reqt'!N23","v":0},0,{"$f":"'9. Rev_Reqt'!R23","v":0},0]
[null,null," "]
[null,null,{"$f":"'9. Rev_Reqt'!D25","v":"Service Revenue Requirement (before Revenues)"},{"$f":"'9. Rev_Reqt'!F25","v":5359497.3971811663},{"$f":"'9. Rev_Reqt'!J25","v":0},{"$f":"E92-D92","v":-5359497.3971811663},{"$f":"'9. Rev_Reqt'!N25","v":0},{"$f":"G92-E92","v":0},{"$f":"'9. Rev_Reqt'!R25","v":0},0]
[null,null," "]
[null,null,{"$f":"'9. Rev_Reqt'!D27","v":"Revenue Offsets"},{"$f":"'9. Rev_Reqt'!F27","v":400306.04506999999},{"$f":"'9. Rev_Reqt'!J27","v":0},-400306.04506999999,{"$f":"'9. Rev_Reqt'!N27","v":0},0,{"$f":"'9. Rev_Reqt'!R27","v":0},0]
[null,null,{"$f":"'9. Rev_Reqt'!D28","v":"Base Revenue Requirement"},{"$f":"'9. Rev_Reqt'!F28","v":4959191.3521111663},{"$f":"'9. Rev_Reqt'!J28","v":0},-4959191.3521111663,{"$f":"'9. Rev_Reqt'!N28","v":0},0,{"$f":"'9. Rev_Reqt'!R28","v":0},0]
[]
[null,null,{"$f":"'9. Rev_Reqt'!D43","v":"Grossed-Up Revenue Deficiency/(Sufficiency)"},{"$f":"'9. Rev_Reqt'!F43","v":1268827.8585785055},{"$f":"'8. Rev_Def_Suff'!J52","v":0},-1268827.8585785055,{"$f":"'8. Rev_Def_Suff'!N52","v":0},0,{"$f":"'8. Rev_Def_Suff'!R52","v":0},0]
[null,null,null,null,null,null,null,null,{"$f":"I95-D95","v":-4959191.3521111663}]
[]
[null,null,"Load Forecast"]
[null,"Table X","Customer Count","Initial Application","Interrogatory Responses","Variance","Settlement Agreement","Variance","Per Board Decision","Variance"]
[null,null,{"$f":"'10. Load Forecast'!D28","v":0},{"$f":"'10. Load Forecast'!F28","v":0},{"$f":"'10. Load Forecast'!L28","v":0},{"$f":"E102-D102","v":0},{"$f":"'10. Load Forecast'!R28","v":0},{"$f":"G102-E102","v":0},{"$f":"'10. Load Forecast'!X28","v":0},{"$f":"I102-G102","v":0}]
[null,null,{"$f":"'10. Load Forecast'!D29","v":"Residential"},{"$f":"'10. Load Forecast'!F29","v":5376.2524555963046},{"$f":"'10. Load Forecast'!L29","v":0},{"$f":"E103-D103","v":-5376.2524555963046},{"$f":"'10. Load Forecast'!R29","v":0},{"$f":"G103-E103","v":0},{"$f":"'10. Load Forecast'!X29","v":0},0]
[null,null,{"$f":"'10. Load Forecast'!D30","v":"General Service < 50 kW"},{"$f":"'10. Load Forecast'!F30","v":741.62995572952639},{"$f":"'10. Load Forecast'!L30","v":0},-741.62995572952639,{"$f":"'10. Load Forecast'!R30","v":0},0,{"$f":"'10. Load Forecast'!X30","v":0},0]
[null,null,{"$f":"'10. Load Forecast'!D31","v":"General Service > 50 to 4999 kW"},{"$f":"'10. Load Forecast'!F31","v":65.940470955505745},{"$f":"'10. Load Forecast'!L31","v":0},-65.940470955505745,{"$f":"'10. Load Forecast'!R31","v":0},0,{"$f":"'10. Load Forecast'!X31","v":0},0]
[null,null,{"$f":"'10. Load Forecast'!D32","v":"Unmetered Scattered Load"},{"$f":"'10. Load Forecast'!F32","v":60.45372766210599},{"$f":"'10. Load Forecast'!L32","v":0},-60.45372766210599,{"$f":"'10. Load Forecast'!R32","v":0},0,{"$f":"'10. Load Forecast'!X32","v":0},0]
[null,null,{"$f":"'10. Load Forecast'!D33","v":"Sentinel"},{"$f":"'10. Load Forecast'!F33","v":69.35025782373404},{"$f":"'10. Load Forecast'!L33","v":0},-69.35025782373404,{"$f":"'10. Load Forecast'!R33","v":0},0,{"$f":"'10. Load Forecast'!X33","v":0},{"$f":"I107-G107","v":0}]
[null,null,{"$f":"'10. Load Forecast'!D34","v":"StreetLights"},{"$f":"'10. Load Forecast'!F34","v":1713.4447618292145},{"$f":"'10. Load Forecast'!L34","v":0},-1713.4447618292145,{"$f":"'10. Load Forecast'!R34","v":0},0,{"$f":"'10. Load Forecast'!X34","v":0},0]
[null,null,{"$f":"'10. Load Forecast'!D35","v":0},{"$f":"'10. Load Forecast'!F35","v":0},{"$f":"'10. Load Forecast'!L35","v":0},0,{"$f":"'10. Load Forecast'!R35","v":0},0,{"$f":"'10. Load Forecast'!X35","v":0},0]
[null,null,{"$f":"'10. Load Forecast'!D36","v":0},{"$f":"'10. Load Forecast'!F36","v":0},{"$f":"'10. Load Forecast'!L36","v":0},0,{"$f":"'10. Load Forecast'!R36","v":0},0,{"$f":"'10. Load Forecast'!X36","v":0},0]
[null,null,{"$f":"'10. Load Forecast'!D37","v":0},{"$f":"'10. Load Forecast'!F37","v":0},{"$f":"'10. Load Forecast'!L37","v":0},0,{"$f":"'10. Load Forecast'!R37","v":0},0,{"$f":"'10. Load Forecast'!X37","v":0},0]
[null,null,{"$f":"'10. Load Forecast'!D38","v":0},{"$f":"'10. Load Forecast'!F38","v":0},{"$f":"'10. Load Forecast'!L38","v":0},0,{"$f":"'10. Load Forecast'!R38","v":0},0,{"$f":"'10. Load Forecast'!X38","v":0},0]
[null,null,{"$f":"'10. Load Forecast'!D39","v":0},{"$f":"'10. Load Forecast'!F39","v":0},{"$f":"'10. Load Forecast'!L39","v":0},0,{"$f":"'10. Load Forecast'!R39","v":0},0,{"$f":"'10. Load Forecast'!X39","v":0},0]
[null,null,{"$f":"'10. Load Forecast'!D40","v":0},{"$f":"'10. Load Forecast'!F40","v":0},{"$f":"'10. Load Forecast'!L40","v":0},0,{"$f":"'10. Load Forecast'!R40","v":0},0,{"$f":"'10. Load Forecast'!X40","v":0},0]
[null,null,{"$f":"'10. Load Forecast'!D41","v":0},{"$f":"'10. Load Forecast'!F41","v":0},{"$f":"'10. Load Forecast'!L41","v":0},0,{"$f":"'10. Load Forecast'!R41","v":0},0,{"$f":"'10. Load Forecast'!X41","v":0},0]
[null,null,{"$f":"'10. Load Forecast'!D42","v":0},{"$f":"'10. Load Forecast'!F42","v":0},{"$f":"'10. Load Forecast'!L42","v":0},0,{"$f":"'10. Load Forecast'!R42","v":0},0,{"$f":"'10. Load Forecast'!X42","v":0},0]
[null,null,{"$f":"'10. Load Forecast'!D43","v":0},{"$f":"'10. Load Forecast'!F43","v":0},{"$f":"'10. Load Forecast'!L43","v":0},0,{"$f":"'10. Load Forecast'!R43","v":0},0,{"$f":"'10. Load Forecast'!X43","v":0},0]
[null,null,{"$f":"'10. Load Forecast'!D44","v":0},{"$f":"'10. Load Forecast'!F44","v":0},{"$f":"'10. Load Forecast'!L44","v":0},0,{"$f":"'10. Load Forecast'!R44","v":0},0,{"$f":"'10. Load Forecast'!X44","v":0},0]
[null,null,{"$f":"'10. Load Forecast'!D45","v":0},{"$f":"'10. Load Forecast'!F45","v":0},{"$f":"'10. Load Forecast'!L45","v":0},0,{"$f":"'10. Load Forecast'!R45","v":0},{"$f":"G119-E119","v":0},{"$f":"'10. Load Forecast'!X45","v":0},{"$f":"I119-G119","v":0}]
[null,null,"Total ",{"$f":"SUM(D102:D109)","v":8027.0716295963903},{"$f":"SUM(E102:E109)","v":0},-8027.0716295963903,0,0,0,0]
[]
[null,"Table X","Load Forecast"]
[null,null,"Consumption","Initial Application","Interrogatory Responses","Variance","Settlement Agreement","Variance","Per Board Decision","Variance"]
[null,null,{"$f":"'10. Load Forecast'!D28","v":0},{"$f":"'10. Load Forecast'!H28","v":0},{"$f":"'10. Load Forecast'!N28","v":0},{"$f":"E124-D124","v":0},{"$f":"'10. Load Forecast'!T28","v":0},{"$f":"G124-E124","v":0},{"$f":"'10. Load Forecast'!Z28","v":0},{"$f":"I124-G124","v":0}]
[null,null,{"$f":"'10. Load Forecast'!D29","v":"Residential"},{"$f":"'10. Load Forecast'!H29","v":50042036.118735202},{"$f":"'10. Load Forecast'!N29","v":0},{"$f":"E125-D125","v":-50042036.118735202},{"$f":"'10. Load Forecast'!T29","v":0},{"$f":"G125-E125","v":0},{"$f":"'10. Load Forecast'!Z29","v":0},0]
[null,null,{"$f":"'10. Load Forecast'!D30","v":"General Service < 50 kW"},{"$f":"'10. Load Forecast'!H30","v":22686576.893522337},{"$f":"'10. Load Forecast'!N30","v":0},-22686576.893522337,{"$f":"'10. Load Forecast'!T30","v":0},0,{"$f":"'10. Load Forecast'!Z30","v":0},0]
[null,null,{"$f":"'10. Load Forecast'!D31","v":"General Service > 50 to 4999 kW"},{"$f":"'10. Load Forecast'!H31","v":44638220.485632457},{"$f":"'10. Load Forecast'!N31","v":0},-44638220.485632457,{"$f":"'10. Load Forecast'!T31","v":0},0,{"$f":"'10. Load Forecast'!Z31","v":0},0]
[null,null,{"$f":"'10. Load Forecast'!D32","v":"Unmetered Scattered Load"},{"$f":"'10. Load Forecast'!H32","v":638256.91924484563},{"$f":"'10. Load Forecast'!N32","v":0},-638256.91924484563,{"$f":"'10. Load Forecast'!T32","v":0},0,{"$f":"'10. Load Forecast'!Z32","v":0},0]
[null,null,{"$f":"'10. Load Forecast'!D33","v":"Sentinel"},{"$f":"'10. Load Forecast'!H33","v":137576.67902799696},{"$f":"'10. Load Forecast'!N33","v":0},-137576.67902799696,{"$f":"'10. Load Forecast'!T33","v":0},0,{"$f":"'10. Load Forecast'!Z33","v":0},0]
[null,null,{"$f":"'10. Load Forecast'!D34","v":"StreetLights"},{"$f":"'10. Load Forecast'!H34","v":647807.3303502202},{"$f":"'10. Load Forecast'!N34","v":0},-647807.3303502202,{"$f":"'10. Load Forecast'!T34","v":0},0,{"$f":"'10. Load Forecast'!Z34","v":0},0]
[null,null,{"$f":"'10. Load Forecast'!D35","v":0},{"$f":"'10. Load Forecast'!H35","v":0},{"$f":"'10. Load Forecast'!N35","v":0},0,{"$f":"'10. Load Forecast'!T35","v":0},0,{"$f":"'10. Load Forecast'!Z35","v":0},0]
[null,null,{"$f":"'10. Load Forecast'!D36","v":0},{"$f":"'10. Load Forecast'!H36","v":0},{"$f":"'10. Load Forecast'!N36","v":0},0,{"$f":"'10. Load Forecast'!T36","v":0},0,{"$f":"'10. Load Forecast'!Z36","v":0},0]
[null,null,{"$f":"'10. Load Forecast'!D37","v":0},{"$f":"'10. Load Forecast'!H37","v":0},{"$f":"'10. Load Forecast'!N37","v":0},0,{"$f":"'10. Load Forecast'!T37","v":0},0,{"$f":"'10. Load Forecast'!Z37","v":0},0]
[null,null,{"$f":"'10. Load Forecast'!D38","v":0},{"$f":"'10. Load Forecast'!H38","v":0},{"$f":"'10. Load Forecast'!N38","v":0},0,{"$f":"'10. Load Forecast'!T38","v":0},0,{"$f":"'10. Load Forecast'!Z38","v":0},0]
[null,null,{"$f":"'10. Load Forecast'!D39","v":0},{"$f":"'10. Load Forecast'!H39","v":0},{"$f":"'10. Load Forecast'!N39","v":0},0,{"$f":"'10. Load Forecast'!T39","v":0},0,{"$f":"'10. Load Forecast'!Z39","v":0},0]
[null,null,{"$f":"'10. Load Forecast'!D40","v":0},{"$f":"'10. Load Forecast'!H40","v":0},{"$f":"'10. Load Forecast'!N40","v":0},0,{"$f":"'10. Load Forecast'!T40","v":0},0,{"$f":"'10. Load Forecast'!Z40","v":0},0]
[null,null,{"$f":"'10. Load Forecast'!D41","v":0},{"$f":"'10. Load Forecast'!H41","v":0},{"$f":"'10. Load Forecast'!N41","v":0},0,{"$f":"'10. Load Forecast'!T41","v":0},0,{"$f":"'10. Load Forecast'!Z41","v":0},0]
[null,null,{"$f":"'10. Load Forecast'!D42","v":0},{"$f":"'10. Load Forecast'!H42","v":0},{"$f":"'10. Load Forecast'!N42","v":0},0,{"$f":"'10. Load Forecast'!T42","v":0},0,{"$f":"'10. Load Forecast'!Z42","v":0},0]
[null,null,{"$f":"'10. Load Forecast'!D43","v":0},{"$f":"'10. Load Forecast'!H43","v":0},{"$f":"'10. Load Forecast'!N43","v":0},0,{"$f":"'10. Load Forecast'!T43","v":0},0,{"$f":"'10. Load Forecast'!Z43","v":0},0]
[null,null,{"$f":"'10. Load Forecast'!D44","v":0},{"$f":"'10. Load Forecast'!H44","v":0},{"$f":"'10. Load Forecast'!N44","v":0},0,{"$f":"'10. Load Forecast'!T44","v":0},0,{"$f":"'10. Load Forecast'!Z44","v":0},0]
[null,null,{"$f":"'10. Load Forecast'!D45","v":0},{"$f":"'10. Load Forecast'!H45","v":0},{"$f":"'10. Load Forecast'!N45","v":0},0,{"$f":"'10. Load Forecast'!T45","v":0},{"$f":"G141-E141","v":0},{"$f":"'10. Load Forecast'!Z45","v":0},{"$f":"I141-G141","v":0}]
[null,null,"Total ",{"$f":"SUM(D124:D131)","v":118790474.42651305},0,-118790474.42651305,0,0,0,0]
[]
[null,"Table X","Load Forecast"]
[null,null,"Demand","Initial Application","Interrogatory Responses","Variance","Settlement Agreement","Variance","Per Board Decision","Variance"]
[null,null,{"$f":"'10. Load Forecast'!D28","v":0},{"$f":"'10. Load Forecast'!J28","v":0},{"$f":"'10. Load Forecast'!P28","v":0},{"$f":"E146-D146","v":0},{"$f":"'10. Load Forecast'!V28","v":0},{"$f":"G146-E146","v":0},{"$f":"'10. Load Forecast'!AB28","v":0},{"$f":"I146-G146","v":0}]
[null,null,{"$f":"'10. Load Forecast'!D29","v":"Residential"},{"$f":"'10. Load Forecast'!J29","v":0},{"$f":"'10. Load Forecast'!P29","v":0},{"$f":"E147-D147","v":0},{"$f":"'10. Load Forecast'!V29","v":0},{"$f":"G147-E147","v":0},{"$f":"'10. Load Forecast'!AB29","v":0},0]
[null,null,{"$f":"'10. Load Forecast'!D30","v":"General Service < 50 kW"},{"$f":"'10. Load Forecast'!J30","v":0},{"$f":"'10. Load Forecast'!P30","v":0},0,{"$f":"'10. Load Forecast'!V30","v":0},0,{"$f":"'10. Load Forecast'!AB30","v":0},0]
[null,null,{"$f":"'10. Load Forecast'!D31","v":"General Service > 50 to 4999 kW"},{"$f":"'10. Load Forecast'!J31","v":121843.8867897208},{"$f":"'10. Load Forecast'!P31","v":0},-121843.8867897208,{"$f":"'10. Load Forecast'!V31","v":0},0,{"$f":"'10. Load Forecast'!AB31","v":0},0]
[null,null,{"$f":"'10. Load Forecast'!D32","v":"Unmetered Scattered Load"},{"$f":"'10. Load Forecast'!J32","v":0},{"$f":"'10. Load Forecast'!P32","v":0},0,{"$f":"'10. Load Forecast'!V32","v":0},0,{"$f":"'10. Load Forecast'!AB32","v":0},0]
[null,null,{"$f":"'10. Load Forecast'!D33","v":"Sentinel"},{"$f":"'10. Load Forecast'!J33","v":152.39502934968934},{"$f":"'10. Load Forecast'!P33","v":0},-152.39502934968934,{"$f":"'10. Load Forecast'!V33","v":0},0,{"$f":"'10. Load Forecast'!AB33","v":0},0]
[null,null,{"$f":"'10. Load Forecast'!D34","v":"StreetLights"},{"$f":"'10. Load Forecast'!J34","v":1620.8252626261246},{"$f":"'10. Load Forecast'!P34","v":0},-1620.8252626261246,{"$f":"'10. Load Forecast'!V34","v":0},0,{"$f":"'10. Load Forecast'!AB34","v":0},0]
[null,null,{"$f":"'10. Load Forecast'!D35","v":0},{"$f":"'10. Load Forecast'!J35","v":0},{"$f":"'10. Load Forecast'!P35","v":0},0,{"$f":"'10. Load Forecast'!V35","v":0},0,{"$f":"'10. Load Forecast'!AB35","v":0},0]
[null,null,{"$f":"'10. Load Forecast'!D36","v":0},{"$f":"'10. Load Forecast'!J36","v":0},{"$f":"'10. Load Forecast'!P36","v":0},0,{"$f":"'10. Load Forecast'!V36","v":0},0,{"$f":"'10. Load Forecast'!AB36","v":0},0]
[null,null,{"$f":"'10. Load Forecast'!D37","v":0},{"$f":"'10. Load Forecast'!J37","v":0},{"$f":"'10. Load Forecast'!P37","v":0},0,{"$f":"'10. Load Forecast'!V37","v":0},0,{"$f":"'10. Load Forecast'!AB37","v":0},0]
[null,null,{"$f":"'10. Load Forecast'!D38","v":0},{"$f":"'10. Load Forecast'!J38","v":0},{"$f":"'10. Load Forecast'!P38","v":0},0,{"$f":"'10. Load Forecast'!V38","v":0},0,{"$f":"'10. Load Forecast'!AB38","v":0},0]
[null,null,{"$f":"'10. Load Forecast'!D39","v":0},{"$f":"'10. Load Forecast'!J39","v":0},{"$f":"'10. Load Forecast'!P39","v":0},0,{"$f":"'10. Load Forecast'!V39","v":0},0,{"$f":"'10. Load Forecast'!AB39","v":0},0]
[null,null,{"$f":"'10. Load Forecast'!D40","v":0},{"$f":"'10. Load Forecast'!J40","v":0},{"$f":"'10. Load Forecast'!P40","v":0},0,{"$f":"'10. Load Forecast'!V40","v":0},0,{"$f":"'10. Load Forecast'!AB40","v":0},0]
[null,null,{"$f":"'10. Load Forecast'!D41","v":0},{"$f":"'10. Load Forecast'!J41","v":0},{"$f":"'10. Load Forecast'!P41","v":0},0,{"$f":"'10. Load Forecast'!V41","v":0},0,{"$f":"'10. Load Forecast'!AB41","v":0},0]
[null,null,{"$f":"'10. Load Forecast'!D42","v":0},{"$f":"'10. Load Forecast'!J42","v":0},{"$f":"'10. Load Forecast'!P42","v":0},0,{"$f":"'10. Load Forecast'!V42","v":0},0,{"$f":"'10. Load Forecast'!AB42","v":0},0]
[null,null,{"$f":"'10. Load Forecast'!D43","v":0},{"$f":"'10. Load Forecast'!J43","v":0},{"$f":"'10. Load Forecast'!P43","v":0},0,{"$f":"'10. Load Forecast'!V43","v":0},0,{"$f":"'10. Load Forecast'!AB43","v":0},0]
[null,null,{"$f":"'10. Load Forecast'!D44","v":0},{"$f":"'10. Load Forecast'!J44","v":0},{"$f":"'10. Load Forecast'!P44","v":0},0,{"$f":"'10. Load Forecast'!V44","v":0},0,{"$f":"'10. Load Forecast'!AB44","v":0},0]
[null,null,{"$f":"'10. Load Forecast'!D45","v":0},{"$f":"'10. Load Forecast'!J45","v":0},{"$f":"'10. Load Forecast'!P45","v":0},0,{"$f":"'10. Load Forecast'!V45","v":0},{"$f":"G163-E163","v":0},{"$f":"'10. Load Forecast'!AB45","v":0},{"$f":"I163-G163","v":0}]
[null,null,{"$f":"'10. Load Forecast'!D45","v":0},{"$f":"'10. Load Forecast'!J45","v":0},{"$f":"'10. Load Forecast'!P45","v":0},0,{"$f":"'10. Load Forecast'!V45","v":0},0,{"$f":"'10. Load Forecast'!AB45","v":0},0]
[null,null,"Total ",{"$f":"SUM(D146:D164)","v":123617.10708169661},{"$f":"SUM(E146:E164)","v":0},-123617.10708169661,0,0,0,0]
[]
[]
[null,"Table X","Rate Design"]
[null,null,"Revenue to Cost Ratios","Initial Application",null,"Interrogatory Responses",null,"Settlement Agreement",null,"Per Board Decision"]
[null,null,null,"Calculated R/C Ratio ","Proposed R/C Ratio ","Calculated R/C Ratio ","Proposed R/C Ratio ","Calculated R/C Ratio ","Proposed R/C Ratio ","Calculated R/C Ratio ","Proposed R/C Ratio "]
[null,null,{"$f":"C146","v":0},{"$f":"'11. Cost_Allocation RSL'!D22","v":1.0034163760402985},{"$f":"'11. Cost_Allocation RSL'!L22","v":1.0029999999999997},{"$f":"'11. Cost_Allocation RSL'!D50","v":0},{"$f":"'11. Cost_Allocation RSL'!L50","v":""},{"$f":"'11. Cost_Allocation RSL'!D79","v":0},{"$f":"'11. Cost_Allocation RSL'!L79","v":""},{"$f":"'11. Cost_Allocation RSL'!D108","v":0},{"$f":"'11. Cost_Allocation RSL'!L108","v":""}]
[null,null,"Residential",{"$f":"'11. Cost_Allocation RSL'!D23","v":1.151430136913101},{"$f":"'11. Cost_Allocation RSL'!L23","v":1.1309318470544274},{"$f":"'11. Cost_Allocation RSL'!D51","v":0},{"$f":"'11. Cost_Allocation RSL'!L51","v":""},{"$f":"'11. Cost_Allocation RSL'!D80","v":0},{"$f":"'11. Cost_Allocation RSL'!L80","v":""},{"$f":"'11. Cost_Allocation RSL'!D109","v":0},{"$f":"'11. Cost_Allocation RSL'!L109","v":""}]
[null,null,"General Service < 50 kW",{"$f":"'11. Cost_Allocation RSL'!D24","v":0.93337965400076017},{"$f":"'11. Cost_Allocation RSL'!L24","v":0.93300000000000016},{"$f":"'11. Cost_Allocation RSL'!D52","v":0},{"$f":"'11. Cost_Allocation RSL'!L52","v":""},{"$f":"'11. Cost_Allocation RSL'!D81","v":0},{"$f":"'11. Cost_Allocation RSL'!L81","v":""},{"$f":"'11. Cost_Allocation RSL'!D110","v":0},{"$f":"'11. Cost_Allocation RSL'!L110","v":""}]
[null,null,"General Service > 50 to 4999 kW",{"$f":"'11. Cost_Allocation RSL'!D25","v":1.507059132973956},{"$f":"'11. Cost_Allocation RSL'!L25","v":1.2},{"$f":"'11. Cost_Allocation RSL'!D53","v":0},{"$f":"'11. Cost_Allocation RSL'!L53","v":""},{"$f":"'11. Cost_Allocation RSL'!D82","v":0},{"$f":"'11. Cost_Allocation RSL'!L82","v":""},{"$f":"'11. Cost_Allocation RSL'!D111","v":0},{"$f":"'11. Cost_Allocation RSL'!L111","v":""}]
[null,null,"Unmetered Scattered Load",{"$f":"'11. Cost_Allocation RSL'!D26","v":0.46341753251487183},{"$f":"'11. Cost_Allocation RSL'!L26","v":0.79999999999999982},{"$f":"'11. Cost_Allocation RSL'!D54","v":0},{"$f":"'11. Cost_Allocation RSL'!L54","v":""},{"$f":"'11. Cost_Allocation RSL'!D83","v":0},{"$f":"'11. Cost_Allocation RSL'!L83","v":""},{"$f":"'11. Cost_Allocation RSL'!D112","v":0},{"$f":"'11. Cost_Allocation RSL'!L112","v":""}]
[null,null,"Sentinel",{"$f":"'11. Cost_Allocation RSL'!D27","v":0.73672185515637079},{"$f":"'11. Cost_Allocation RSL'!L27","v":0.79999999999999982},{"$f":"'11. Cost_Allocation RSL'!D55","v":0},{"$f":"'11. Cost_Allocation RSL'!L55","v":""},{"$f":"'11. Cost_Allocation RSL'!D84","v":0},{"$f":"'11. Cost_Allocation RSL'!L84","v":""},{"$f":"'11. Cost_Allocation RSL'!D113","v":0},{"$f":"'11. Cost_Allocation RSL'!L113","v":""}]
[null,null,"StreetLights",{"$f":"'11. Cost_Allocation RSL'!D28","v":0},{"$f":"'11. Cost_Allocation RSL'!L28","v":""},{"$f":"'11. Cost_Allocation RSL'!D56","v":0},{"$f":"'11. Cost_Allocation RSL'!L56","v":""},{"$f":"'11. Cost_Allocation RSL'!D85","v":0},{"$f":"'11. Cost_Allocation RSL'!L85","v":""},{"$f":"'11. Cost_Allocation RSL'!D114","v":0},{"$f":"'11. Cost_Allocation RSL'!L114","v":""}]
[null,null,0,{"$f":"'11. Cost_Allocation RSL'!D29","v":0},{"$f":"'11. Cost_Allocation RSL'!L29","v":""},{"$f":"'11. Cost_Allocation RSL'!D57","v":0},{"$f":"'11. Cost_Allocation RSL'!L57","v":""},{"$f":"'11. Cost_Allocation RSL'!D86","v":0},{"$f":"'11. Cost_Allocation RSL'!L86","v":""},{"$f":"'11. Cost_Allocation RSL'!D115","v":0},{"$f":"'11. Cost_Allocation RSL'!L115","v":""}]
[null,null,0,{"$f":"'11. Cost_Allocation RSL'!D30","v":0},{"$f":"'11. Cost_Allocation RSL'!L30","v":""},{"$f":"'11. Cost_Allocation RSL'!D58","v":0},{"$f":"'11. Cost_Allocation RSL'!L58","v":""},{"$f":"'11. Cost_Allocation RSL'!D87","v":0},{"$f":"'11. Cost_Allocation RSL'!L87","v":""},{"$f":"'11. Cost_Allocation RSL'!D116","v":0},{"$f":"'11. Cost_Allocation RSL'!L116","v":""}]
[null,null,0,{"$f":"'11. Cost_Allocation RSL'!D31","v":0},{"$f":"'11. Cost_Allocation RSL'!L31","v":""},{"$f":"'11. Cost_Allocation RSL'!D59","v":0},{"$f":"'11. Cost_Allocation RSL'!L59","v":""},{"$f":"'11. Cost_Allocation RSL'!D88","v":0},{"$f":"'11. Cost_Allocation RSL'!L88","v":""},{"$f":"'11. Cost_Allocation RSL'!D117","v":0},{"$f":"'11. Cost_Allocation RSL'!L117","v":""}]
[null,null,0,{"$f":"'11. Cost_Allocation RSL'!D32","v":0},{"$f":"'11. Cost_Allocation RSL'!L32","v":""},{"$f":"'11. Cost_Allocation RSL'!D60","v":0},{"$f":"'11. Cost_Allocation RSL'!L60","v":""},{"$f":"'11. Cost_Allocation RSL'!D89","v":0},{"$f":"'11. Cost_Allocation RSL'!L89","v":""},{"$f":"'11. Cost_Allocation RSL'!D118","v":0},{"$f":"'11. Cost_Allocation RSL'!L118","v":""}]
[null,null,0,{"$f":"'11. Cost_Allocation RSL'!D33","v":0},{"$f":"'11. Cost_Allocation RSL'!L33","v":""},{"$f":"'11. Cost_Allocation RSL'!D61","v":0},{"$f":"'11. Cost_Allocation RSL'!L61","v":""},{"$f":"'11. Cost_Allocation RSL'!D90","v":0},{"$f":"'11. Cost_Allocation RSL'!L90","v":""},{"$f":"'11. Cost_Allocation RSL'!D119","v":0},{"$f":"'11. Cost_Allocation RSL'!L119","v":""}]
[null,null,0,{"$f":"'11. Cost_Allocation RSL'!D34","v":0},{"$f":"'11. Cost_Allocation RSL'!L34","v":""},{"$f":"'11. Cost_Allocation RSL'!D62","v":0},{"$f":"'11. Cost_Allocation RSL'!L62","v":""},{"$f":"'11. Cost_Allocation RSL'!D91","v":0},{"$f":"'11. Cost_Allocation RSL'!L91","v":""},{"$f":"'11. Cost_Allocation RSL'!D120","v":0},{"$f":"'11. Cost_Allocation RSL'!L120","v":""}]
[null,null,0,{"$f":"'11. Cost_Allocation RSL'!D35","v":0},{"$f":"'11. Cost_Allocation RSL'!L35","v":""},{"$f":"'11. Cost_Allocation RSL'!D63","v":0},{"$f":"'11. Cost_Allocation RSL'!L63","v":""},{"$f":"'11. Cost_Allocation RSL'!D92","v":0},{"$f":"'11. Cost_Allocation RSL'!L92","v":""},{"$f":"'11. Cost_Allocation RSL'!D121","v":0},{"$f":"'11. Cost_Allocation RSL'!L121","v":""}]
[null,null,0,{"$f":"'11. Cost_Allocation RSL'!D36","v":0},{"$f":"'11. Cost_Allocation RSL'!L36","v":""},{"$f":"'11. Cost_Allocation RSL'!D64","v":0},{"$f":"'11. Cost_Allocation RSL'!L64","v":""},{"$f":"'11. Cost_Allocation RSL'!D93","v":0},{"$f":"'11. Cost_Allocation RSL'!L93","v":""},{"$f":"'11. Cost_Allocation RSL'!D122","v":0},{"$f":"'11. Cost_Allocation RSL'!L122","v":""}]
[null,null,0,{"$f":"'11. Cost_Allocation RSL'!D37","v":0},{"$f":"'11. Cost_Allocation RSL'!L37","v":""},{"$f":"'11. Cost_Allocation RSL'!D65","v":0},{"$f":"'11. Cost_Allocation RSL'!L65","v":""},{"$f":"'11. Cost_Allocation RSL'!D94","v":0},{"$f":"'11. Cost_Allocation RSL'!L94","v":""},{"$f":"'11. Cost_Allocation RSL'!D123","v":0},{"$f":"'11. Cost_Allocation RSL'!L123","v":""}]
[null,null,0,{"$f":"'11. Cost_Allocation RSL'!D38","v":0},{"$f":"'11. Cost_Allocation RSL'!L38","v":""},{"$f":"'11. Cost_Allocation RSL'!D66","v":0},{"$f":"'11. Cost_Allocation RSL'!L66","v":""},{"$f":"'11. Cost_Allocation RSL'!D95","v":0},{"$f":"'11. Cost_Allocation RSL'!L95","v":""},{"$f":"'11. Cost_Allocation RSL'!D124","v":0},{"$f":"'11. Cost_Allocation RSL'!L124","v":""}]
[]
[]
[null,"Table X","Rate Design"]
[null,null,"Fixed to Variable Split","Initial Application",null,"Interrogatory Responses",null,"Settlement Agreement",null,"Per Board Decision"]
[null,null,null,"Fixed","Variable","Fixed","Variable","Fixed","Variable","Fixed","Variable"]
[null,null,{"$f":"C171","v":0},{"$f":"'13. Rate Design RSL'!H21","v":0.99999999999999989},{"$f":"'13. Rate Design RSL'!I21","v":1.1102230246251565E-16},{"$f":"'13. Rate Design RSL'!H47","v":0},{"$f":"'13. Rate Design RSL'!I47","v":""},{"$f":"'13. Rate Design RSL'!H73","v":0},{"$f":"'13. Rate Design RSL'!I73","v":""},{"$f":"'13. Rate Design RSL'!H99","v":0},{"$f":"'13. Rate Design RSL'!I99","v":""}]
[null,null,"Residential",{"$f":"'13. Rate Design RSL'!H22","v":0.36325761956225594},{"$f":"'13. Rate Design RSL'!I22","v":0.63674238043774412},{"$f":"'13. Rate Design RSL'!H48","v":0},{"$f":"'13. Rate Design RSL'!I48","v":""},{"$f":"'13. Rate Design RSL'!H74","v":0},{"$f":"'13. Rate Design RSL'!I74","v":""},{"$f":"'13. Rate Design RSL'!H100","v":0},{"$f":"'13. Rate Design RSL'!I100","v":""}]
[null,null,"General Service < 50 kW",{"$f":"'13. Rate Design RSL'!H23","v":0.30740068562453121},{"$f":"'13. Rate Design RSL'!I23","v":0.69259931437546873},{"$f":"'13. Rate Design RSL'!H49","v":0},{"$f":"'13. Rate Design RSL'!I49","v":""},{"$f":"'13. Rate Design RSL'!H75","v":0},{"$f":"'13. Rate Design RSL'!I75","v":""},{"$f":"'13. Rate Design RSL'!H101","v":0},{"$f":"'13. Rate Design RSL'!I101","v":""}]
[null,null,"General Service > 50 to 4999 kW",{"$f":"'13. Rate Design RSL'!H24","v":0.19875558447348016},{"$f":"'13. Rate Design RSL'!I24","v":0.80124441552651982},{"$f":"'13. Rate Design RSL'!H50","v":0},{"$f":"'13. Rate Design RSL'!I50","v":""},{"$f":"'13. Rate Design RSL'!H76","v":0},{"$f":"'13. Rate Design RSL'!I76","v":""},{"$f":"'13. Rate Design RSL'!H102","v":0},{"$f":"'13. Rate Design RSL'!I102","v":""}]
[null,null,"Unmetered Scattered Load",{"$f":"'13. Rate Design RSL'!H25","v":0.18608991328365154},{"$f":"'13. Rate Design RSL'!I25","v":0.81391008671634846},{"$f":"'13. Rate Design RSL'!H51","v":0},{"$f":"'13. Rate Design RSL'!I51","v":""},{"$f":"'13. Rate Design RSL'!H77","v":0},{"$f":"'13. Rate Design RSL'!I77","v":""},{"$f":"'13. Rate Design RSL'!H103","v":0},{"$f":"'13. Rate Design RSL'!I103","v":""}]
[null,null,"Sentinel",{"$f":"'13. Rate Design RSL'!H26","v":0.56623202024074837},{"$f":"'13. Rate Design RSL'!I26","v":0.43376797975925163},{"$f":"'13. Rate Design RSL'!H52","v":0},{"$f":"'13. Rate Design RSL'!I52","v":""},{"$f":"'13. Rate Design RSL'!H78","v":0},{"$f":"'13. Rate Design RSL'!I78","v":""},{"$f":"'13. Rate Design RSL'!H104","v":0},{"$f":"'13. Rate Design RSL'!I104","v":""}]
[null,null,"StreetLights",{"$f":"'13. Rate Design RSL'!H27","v":0},{"$f":"'13. Rate Design RSL'!I27","v":""},{"$f":"'13. Rate Design RSL'!H53","v":0},{"$f":"'13. Rate Design RSL'!I53","v":""},{"$f":"'13. Rate Design RSL'!H79","v":0},{"$f":"'13. Rate Design RSL'!I79","v":""},{"$f":"'13. Rate Design RSL'!H105","v":0},{"$f":"'13. Rate Design RSL'!I105","v":""}]
[null,null,0,{"$f":"'13. Rate Design RSL'!H28","v":0},{"$f":"'13. Rate Design RSL'!I28","v":""},{"$f":"'13. Rate Design RSL'!H54","v":0},{"$f":"'13. Rate Design RSL'!I54","v":""},{"$f":"'13. Rate Design RSL'!H80","v":0},{"$f":"'13. Rate Design RSL'!I80","v":""},{"$f":"'13. Rate Design RSL'!H106","v":0},{"$f":"'13. Rate Design RSL'!I106","v":""}]
[null,null,0,{"$f":"'13. Rate Design RSL'!H29","v":0},{"$f":"'13. Rate Design RSL'!I29","v":""},{"$f":"'13. Rate Design RSL'!H55","v":0},{"$f":"'13. Rate Design RSL'!I55","v":""},{"$f":"'13. Rate Design RSL'!H81","v":0},{"$f":"'13. Rate Design RSL'!I81","v":""},{"$f":"'13. Rate Design RSL'!H107","v":0},{"$f":"'13. Rate Design RSL'!I107","v":""}]
[null,null,0,{"$f":"'13. Rate Design RSL'!H30","v":0},{"$f":"'13. Rate Design RSL'!I30","v":""},{"$f":"'13. Rate Design RSL'!H56","v":0},{"$f":"'13. Rate Design RSL'!I56","v":""},{"$f":"'13. Rate Design RSL'!H82","v":0},{"$f":"'13. Rate Design RSL'!I82","v":""},{"$f":"'13. Rate Design RSL'!H108","v":0},{"$f":"'13. Rate Design RSL'!I108","v":""}]
[null,null,0,{"$f":"'13. Rate Design RSL'!H31","v":0},{"$f":"'13. Rate Design RSL'!I31","v":""},{"$f":"'13. Rate Design RSL'!H57","v":0},{"$f":"'13. Rate Design RSL'!I57","v":""},{"$f":"'13. Rate Design RSL'!H83","v":0},{"$f":"'13. Rate Design RSL'!I83","v":""},{"$f":"'13. Rate Design RSL'!H109","v":0},{"$f":"'13. Rate Design RSL'!I109","v":""}]
[null,null,0,{"$f":"'13. Rate Design RSL'!H32","v":0},{"$f":"'13. Rate Design RSL'!I32","v":""},{"$f":"'13. Rate Design RSL'!H58","v":0},{"$f":"'13. Rate Design RSL'!I58","v":""},{"$f":"'13. Rate Design RSL'!H84","v":0},{"$f":"'13. Rate Design RSL'!I84","v":""},{"$f":"'13. Rate Design RSL'!H110","v":0},{"$f":"'13. Rate Design RSL'!I110","v":""}]
[null,null,0,{"$f":"'13. Rate Design RSL'!H33","v":0},{"$f":"'13. Rate Design RSL'!I33","v":""},{"$f":"'13. Rate Design RSL'!H59","v":0},{"$f":"'13. Rate Design RSL'!I59","v":""},{"$f":"'13. Rate Design RSL'!H85","v":0},{"$f":"'13. Rate Design RSL'!I85","v":""},{"$f":"'13. Rate Design RSL'!H111","v":0},{"$f":"'13. Rate Design RSL'!I111","v":""}]
[null,null,0,{"$f":"'13. Rate Design RSL'!H34","v":0},{"$f":"'13. Rate Design RSL'!I34","v":""},{"$f":"'13. Rate Design RSL'!H60","v":0},{"$f":"'13. Rate Design RSL'!I60","v":""},{"$f":"'13. Rate Design RSL'!H86","v":0},{"$f":"'13. Rate Design RSL'!I86","v":""},{"$f":"'13. Rate Design RSL'!H112","v":0},{"$f":"'13. Rate Design RSL'!I112","v":""}]
[null,null,0,{"$f":"'13. Rate Design RSL'!H35","v":0},{"$f":"'13. Rate Design RSL'!I35","v":""},{"$f":"'13. Rate Design RSL'!H61","v":0},{"$f":"'13. Rate Design RSL'!I61","v":""},{"$f":"'13. Rate Design RSL'!H87","v":0},{"$f":"'13. Rate Design RSL'!I87","v":""},{"$f":"'13. Rate Design RSL'!H113","v":0},{"$f":"'13. Rate Design RSL'!I113","v":""}]
[null,null,0,{"$f":"'13. Rate Design RSL'!H36","v":0},{"$f":"'13. Rate Design RSL'!I36","v":""},{"$f":"'13. Rate Design RSL'!H62","v":0},{"$f":"'13. Rate Design RSL'!I62","v":""},{"$f":"'13. Rate Design RSL'!H88","v":0},{"$f":"'13. Rate Design RSL'!I88","v":""},{"$f":"'13. Rate Design RSL'!H114","v":0},{"$f":"'13. Rate Design RSL'!I114","v":""}]
[null,null,0,{"$f":"'13. Rate Design RSL'!H37","v":0},{"$f":"'13. Rate Design RSL'!I37","v":""},{"$f":"'13. Rate Design RSL'!H63","v":0},{"$f":"'13. Rate Design RSL'!I63","v":""},{"$f":"'13. Rate Design RSL'!H89","v":0},{"$f":"'13. Rate Design RSL'!I89","v":""},{"$f":"'13. Rate Design RSL'!H115","v":0},{"$f":"'13. Rate Design RSL'!I115","v":""}]
[]
[]
[null,"Table X","Rate Design"]
[null,null,"Distribution Rates","Initial Application",null,"Interrogatory Responses",null,"Settlement Agreement",null,"Per Board Decision"]
[null,null,null,"Fixed","Variable","Fixed","Variable","Fixed","Variable","Fixed","Variable"]
[null,null,{"$f":"C193","v":0},{"$f":"'13. Rate Design RSL'!K21","v":45.007180040821474},{"$f":"'13. Rate Design RSL'!L21","v":0},{"$f":"'13. Rate Design RSL'!K47","v":""},{"$f":"'13. Rate Design RSL'!L47","v":""},{"$f":"'13. Rate Design RSL'!K73","v":""},{"$f":"'13. Rate Design RSL'!L73","v":""},{"$f":"'13. Rate Design RSL'!K99","v":""},{"$f":"'13. Rate Design RSL'!L99","v":""}]
[null,null,"Residential",{"$f":"'13. Rate Design RSL'!K22","v":37.49},{"$f":"'13. Rate Design RSL'!L22","v":2.58E-2},{"$f":"'13. Rate Design RSL'!K48","v":""},{"$f":"'13. Rate Design RSL'!L48","v":""},{"$f":"'13. Rate Design RSL'!K74","v":""},{"$f":"'13. Rate Design RSL'!L74","v":""},{"$f":"'13. Rate Design RSL'!K100","v":""},{"$f":"'13. Rate Design RSL'!L100","v":""}]
[null,null,"General Service < 50 kW",{"$f":"'13. Rate Design RSL'!K23","v":357.29},{"$f":"'13. Rate Design RSL'!L23","v":4.9528999999999996},{"$f":"'13. Rate Design RSL'!K49","v":""},{"$f":"'13. Rate Design RSL'!L49","v":""},{"$f":"'13. Rate Design RSL'!K75","v":""},{"$f":"'13. Rate Design RSL'!L75","v":""},{"$f":"'13. Rate Design RSL'!K101","v":""},{"$f":"'13. Rate Design RSL'!L101","v":""}]
[null,null,"General Service > 50 to 4999 kW",{"$f":"'13. Rate Design RSL'!K24","v":6.0086045580325367},{"$f":"'13. Rate Design RSL'!L24","v":2.75E-2},{"$f":"'13. Rate Design RSL'!K50","v":""},{"$f":"'13. Rate Design RSL'!L50","v":""},{"$f":"'13. Rate Design RSL'!K76","v":""},{"$f":"'13. Rate Design RSL'!L76","v":""},{"$f":"'13. Rate Design RSL'!K102","v":""},{"$f":"'13. Rate Design RSL'!L102","v":""}]
[null,null,"Unmetered Scattered Load",{"$f":"'13. Rate Design RSL'!K25","v":4.32},{"$f":"'13. Rate Design RSL'!L25","v":103.1801},{"$f":"'13. Rate Design RSL'!K51","v":""},{"$f":"'13. Rate Design RSL'!L51","v":""},{"$f":"'13. Rate Design RSL'!K77","v":""},{"$f":"'13. Rate Design RSL'!L77","v":""},{"$f":"'13. Rate Design RSL'!K103","v":""},{"$f":"'13. Rate Design RSL'!L103","v":""}]
[null,null,"Sentinel",{"$f":"'13. Rate Design RSL'!K26","v":4.8499999999999996},{"$f":"'13. Rate Design RSL'!L26","v":47.132399999999997},{"$f":"'13. Rate Design RSL'!K52","v":""},{"$f":"'13. Rate Design RSL'!L52","v":""},{"$f":"'13. Rate Design RSL'!K78","v":""},{"$f":"'13. Rate Design RSL'!L78","v":""},{"$f":"'13. Rate Design RSL'!K104","v":""},{"$f":"'13. Rate Design RSL'!L104","v":""}]
[null,null,"StreetLights",{"$f":"'13. Rate Design RSL'!K27","v":""},{"$f":"'13. Rate Design RSL'!L27","v":""},{"$f":"'13. Rate Design RSL'!K53","v":""},{"$f":"'13. Rate Design RSL'!L53","v":""},{"$f":"'13. Rate Design RSL'!K79","v":""},{"$f":"'13. Rate Design RSL'!L79","v":""},{"$f":"'13. Rate Design RSL'!K105","v":""},{"$f":"'13. Rate Design RSL'!L105","v":""}]
[null,null,0,{"$f":"'13. Rate Design RSL'!K28","v":""},{"$f":"'13. Rate Design RSL'!L28","v":""},{"$f":"'13. Rate Design RSL'!K54","v":""},{"$f":"'13. Rate Design RSL'!L54","v":""},{"$f":"'13. Rate Design RSL'!K80","v":""},{"$f":"'13. Rate Design RSL'!L80","v":""},{"$f":"'13. Rate Design RSL'!K106","v":""},{"$f":"'13. Rate Design RSL'!L106","v":""}]
[null,null,0,{"$f":"'13. Rate Design RSL'!K29","v":""},{"$f":"'13. Rate Design RSL'!L29","v":""},{"$f":"'13. Rate Design RSL'!K55","v":""},{"$f":"'13. Rate Design RSL'!L55","v":""},{"$f":"'13. Rate Design RSL'!K81","v":""},{"$f":"'13. Rate Design RSL'!L81","v":""},{"$f":"'13. Rate Design RSL'!K107","v":""},{"$f":"'13. Rate Design RSL'!L107","v":""}]
[null,null,0,{"$f":"'13. Rate Design RSL'!K30","v":""},{"$f":"'13. Rate Design RSL'!L30","v":""},{"$f":"'13. Rate Design RSL'!K56","v":""},{"$f":"'13. Rate Design RSL'!L56","v":""},{"$f":"'13. Rate Design RSL'!K82","v":""},{"$f":"'13. Rate Design RSL'!L82","v":""},{"$f":"'13. Rate Design RSL'!K108","v":""},{"$f":"'13. Rate Design RSL'!L108","v":""}]
[null,null,0,{"$f":"'13. Rate Design RSL'!K31","v":""},{"$f":"'13. Rate Design RSL'!L31","v":""},{"$f":"'13. Rate Design RSL'!K57","v":""},{"$f":"'13. Rate Design RSL'!L57","v":""},{"$f":"'13. Rate Design RSL'!K83","v":""},{"$f":"'13. Rate Design RSL'!L83","v":""},{"$f":"'13. Rate Design RSL'!K109","v":""},{"$f":"'13. Rate Design RSL'!L109","v":""}]
[null,null,0,{"$f":"'13. Rate Design RSL'!K32","v":""},{"$f":"'13. Rate Design RSL'!L32","v":""},{"$f":"'13. Rate Design RSL'!K58","v":""},{"$f":"'13. Rate Design RSL'!L58","v":""},{"$f":"'13. Rate Design RSL'!K84","v":""},{"$f":"'13. Rate Design RSL'!L84","v":""},{"$f":"'13. Rate Design RSL'!K110","v":""},{"$f":"'13. Rate Design RSL'!L110","v":""}]
[null,null,0,{"$f":"'13. Rate Design RSL'!K33","v":""},{"$f":"'13. Rate Design RSL'!L33","v":""},{"$f":"'13. Rate Design RSL'!K59","v":""},{"$f":"'13. Rate Design RSL'!L59","v":""},{"$f":"'13. Rate Design RSL'!K85","v":""},{"$f":"'13. Rate Design RSL'!L85","v":""},{"$f":"'13. Rate Design RSL'!K111","v":""},{"$f":"'13. Rate Design RSL'!L111","v":""}]
[null,null,0,{"$f":"'13. Rate Design RSL'!K34","v":""},{"$f":"'13. Rate Design RSL'!L34","v":""},{"$f":"'13. Rate Design RSL'!K60","v":""},{"$f":"'13. Rate Design RSL'!L60","v":""},{"$f":"'13. Rate Design RSL'!K86","v":""},{"$f":"'13. Rate Design RSL'!L86","v":""},{"$f":"'13. Rate Design RSL'!K112","v":""},{"$f":"'13. Rate Design RSL'!L112","v":""}]
[null,null,0,{"$f":"'13. Rate Design RSL'!K35","v":""},{"$f":"'13. Rate Design RSL'!L35","v":""},{"$f":"'13. Rate Design RSL'!K61","v":""},{"$f":"'13. Rate Design RSL'!L61","v":""},{"$f":"'13. Rate Design RSL'!K87","v":""},{"$f":"'13. Rate Design RSL'!L87","v":""},{"$f":"'13. Rate Design RSL'!K113","v":""},{"$f":"'13. Rate Design RSL'!L113","v":""}]
[null,null,0,{"$f":"'13. Rate Design RSL'!K36","v":""},{"$f":"'13. Rate Design RSL'!L36","v":""},{"$f":"'13. Rate Design RSL'!K62","v":""},{"$f":"'13. Rate Design RSL'!L62","v":""},{"$f":"'13. Rate Design RSL'!K88","v":""},{"$f":"'13. Rate Design RSL'!L88","v":""},{"$f":"'13. Rate Design RSL'!K114","v":""},{"$f":"'13. Rate Design RSL'!L114","v":""}]
[null,null,0,{"$f":"'13. Rate Design RSL'!K37","v":""},{"$f":"'13. Rate Design RSL'!L37","v":""},{"$f":"'13. Rate Design RSL'!K63","v":""},{"$f":"'13. Rate Design RSL'!L63","v":""},{"$f":"'13. Rate Design RSL'!K89","v":""},{"$f":"'13. Rate Design RSL'!L89","v":""},{"$f":"'13. Rate Design RSL'!K115","v":""},{"$f":"'13. Rate Design RSL'!L115","v":""}]

{"sheet":"Sheet4","index":19,"n_rows":0,"n_cols":0,"rows_kept":0,"cut":false,"hidden":true,"merged":[]}