{"text_format":"1","workbook":"xlsx","n_sheets":17,"sheets":["1. Info","2. Table of Contents","3. Data_Input_Sheet","Hidden_Data Input","4. Rate_Base","5. Utility Income","6. Taxes_PILs","7. Cost_of_Capital","8. Rev_Def_Suff","9. Rev_Reqt","Hidden Data_Rev Reqt","10. Load Forecast","11. Cost_Allocation","12. Res_Rate_Design","13. Rate Design","14. Tracking_Sheet","Sheet4"],"not_rendered":{"charts":0,"images":4,"macros":1,"external_links":0,"defined_names":52,"comments":4,"pivot_tables":0},"unopened":[],"bounds":{"document_bytes":16777216,"sheet_cells":100000,"rows_first":2000,"rows_last":500,"rows_between":2000,"halvings":0,"cell_chars":16384,"cell_head_chars":4096},"cells_cut":0,"cells_raw":0,"read":"whole","date_system":"1900"}

{"sheet":"1. Info","index":0,"n_rows":92,"n_cols":29,"rows_kept":92,"cut":false,"hidden":false,"merged":[[27,4,27,5],[29,4,29,5],[31,4,31,5],[27,6,27,10],[29,6,29,10],[31,6,31,10],[38,0,38,16],[35,1,35,3],[43,1,49,11],[0,2,1,12],[2,2,3,12],[35,4,35,9],[25,6,25,10],[21,1,21,2],[15,6,15,12],[17,6,17,10],[19,6,19,10],[21,6,21,10],[23,6,23,10],[23,1,23,2],[25,1,25,3],[36,0,36,16]]}
[null,null,null,null,null,null,null,null,null,null,null,null,null,null,null,null,null,null,null,null,null,null,null,null,null,null,"Revenue Requirement Workform\n(RRWF) for 2026 Filers\n",null,{"$f":"IF('3. Data_Input_Sheet'!M12=0, \"\", '3. Data_Input_Sheet'!M12)","v":"Interrogatory Responses"}]
[null,null,null,null,null,null,null,null,null,null,null,null,null,null,null,null,null,null,null,null,null,null,null,null,null,null,1.1000000000000001,null,{"$f":"IF('3. Data_Input_Sheet'!U12=0, \"\", '3. Data_Input_Sheet'!U12)","v":"Settlement Agreement"}]
[]
[]
[]
[]
[]
[]
[]
[]
[null,null,null,null,null,null,null,null,null,null,null,null,null,null,null,"Version",{"$f":"$AA$2","v":1.1000000000000001}]
[]
[]
[]
[]
{"$rows_left_out":78}
{"sheet":"2. Table of Contents","index":1,"n_rows":31,"n_cols":9,"rows_kept":31,"cut":false,"hidden":false,"merged":[[29,1,29,13],[30,1,30,13],[28,1,28,7],[0,2,0,4],[1,3,1,6],[3,3,3,4],[26,1,26,7],[27,1,27,7]]}
[]
[]
[]
[]
[]
[]
[]
[]
[]
["Table of Contents"]
[]
[null,null,null,"1. Info",null,null,null,null,"8. Rev_Def_Suff"]
[]
[null,null,null,"2. Table of Contents",null,null,null,null,"9. Rev_Reqt"]
[]
{"$rows_left_out":17}
{"sheet":"3. Data_Input_Sheet","index":2,"n_rows":77,"n_cols":31,"rows_kept":77,"cut":false,"hidden":false,"merged":[[78,2,78,30],[68,2,68,30],[69,2,69,30],[70,2,70,30],[71,2,71,30],[72,2,72,30],[73,2,73,30],[74,2,74,30],[75,2,75,30],[76,2,77,30],[0,2,0,12],[7,4,7,20],[3,2,3,10],[1,2,1,10],[2,2,2,10],[86,2,87,20],[84,2,84,30],[85,2,85,30],[79,2,79,30],[80,2,80,30],[81,2,81,30],[82,2,82,30],[83,2,83,30]]}
[null,null,null,null,null,null,null,null,null,null,null,null,null,null,null,null,null,null,null,null,{"$f":"CONCATENATE('2. Table of Contents'!$F$6,\" \",'2. Table of Contents'!$G$6)","v":" "}]
[]
[]
[]
[]
[]
[]
[]
[null,"Data Input Sheet"]
[]
[]
[null,null,null,null,"Initial Application",null,"(1)",null,{"$f":"IF(ISBLANK(M12),\"\",\"Adjustments\")","v":"Adjustments"},null,null,null,"Interrogatory Responses",null,"(5)",null,{"$f":"IF(ISBLANK(M12),\"\",\"Adjustments\")","v":"Adjustments"},null,null,null,"Settlement Agreement",null,"(5)",null,{"$f":"IF(ISBLANK(U12),\"\",\"Adjustments\")","v":"Adjustments"},null,null,null,"Per Board Decision"]
[]
[]
[null,1,"Rate Base"]
{"$rows_left_out":63}
{"sheet":"Hidden_Data Input","index":3,"n_rows":30,"n_cols":9,"rows_kept":30,"cut":false,"hidden":true,"merged":[]}
["Utility Name","EB Number","Test Year","Bridge Year","Last Rebasing Year","Data Elements","Heading","Intital Application","Per Board Decision"]
[{"$f":"'1. Info'!$G$16","v":"Oshawa PUC Networks Inc."},{"$f":"'1. Info'!$G$20","v":"EB-2025-0014"},{"$f":"'1. Info'!$G$28","v":2026},{"$f":"'1. Info'!$G$30","v":2025},{"$f":"'1. Info'!$G$32","v":2021},"Gross Fixed Assets (average)","Rate Base",{"$f":"'3. Data_Input_Sheet'!E16","v":301724307.86000001},{"$f":"'3. Data_Input_Sheet'!U16","v":301724307.86000001}]
[{"$f":"'1. Info'!$G$16","v":"Oshawa PUC Networks Inc."},{"$f":"'1. Info'!$G$20","v":"EB-2025-0014"},{"$f":"'1. Info'!$G$28","v":2026},{"$f":"'1. Info'!$G$30","v":2025},{"$f":"'1. Info'!$G$32","v":2021},"Accumulated Depreciation (average)","Rate Base",{"$f":"'3. Data_Input_Sheet'!E17","v":-129563334.18000001},{"$f":"'3. Data_Input_Sheet'!U17","v":-129563334.18000001}]
[{"$f":"'1. Info'!$G$16","v":"Oshawa PUC Networks Inc."},{"$f":"'1. Info'!$G$20","v":"EB-2025-0014"},{"$f":"'1. Info'!$G$28","v":2026},{"$f":"'1. Info'!$G$30","v":2025},{"$f":"'1. Info'!$G$32","v":2021},"Controllable Expenses","Allowance for Working Capital",{"$f":"'3. Data_Input_Sheet'!E19","v":22436551.690000001},{"$f":"'3. Data_Input_Sheet'!U19","v":22436551.690000001}]
[{"$f":"'1. Info'!$G$16","v":"Oshawa PUC Networks Inc."},{"$f":"'1. Info'!$G$20","v":"EB-2025-0014"},{"$f":"'1. Info'!$G$28","v":2026},{"$f":"'1. Info'!$G$30","v":2025},{"$f":"'1. Info'!$G$32","v":2021},"Cost of Power","Allowance for Working Capital",{"$f":"'3. Data_Input_Sheet'!E20","v":134866266.17057413},{"$f":"'3. Data_Input_Sheet'!U20","v":134887992.71190116}]
[{"$f":"'1. Info'!$G$16","v":"Oshawa PUC Networks Inc."},{"$f":"'1. Info'!$G$20","v":"EB-2025-0014"},{"$f":"'1. Info'!$G$28","v":2026},{"$f":"'1. Info'!$G$30","v":2025},{"$f":"'1. Info'!$G$32","v":2021},"Working Capital Rate (%)","Allowance for Working Capital",{"$f":"'3. Data_Input_Sheet'!E21","v":7.4999999999999997E-2},{"$f":"'3. Data_Input_Sheet'!U21","v":7.4999999999999997E-2}]
[{"$f":"'1. Info'!$G$16","v":"Oshawa PUC Networks Inc."},{"$f":"'1. Info'!$G$20","v":"EB-2025-0014"},{"$f":"'1. Info'!$G$28","v":2026},{"$f":"'1. Info'!$G$30","v":2025},{"$f":"'1. Info'!$G$32","v":2021},"Distribution Revenue at Current Rates","Utility Income",{"$f":"'3. Data_Input_Sheet'!E25","v":32178736.269876499},{"$f":"'3. Data_Input_Sheet'!U25","v":32209176.349938262}]
[{"$f":"'1. Info'!$G$16","v":"Oshawa PUC Networks Inc."},{"$f":"'1. Info'!$G$20","v":"EB-2025-0014"},{"$f":"'1. Info'!$G$28","v":2026},{"$f":"'1. Info'!$G$30","v":2025},{"$f":"'1. Info'!$G$32","v":2021},"Distribution Revenue at Proposed Rates","Utility Income",{"$f":"'3. Data_Input_Sheet'!E26","v":38848892.253207311},{"$f":"'3. Data_Input_Sheet'!U26","v":38499817.085144691}]
[{"$f":"'1. Info'!$G$16","v":"Oshawa PUC Networks Inc."},{"$f":"'1. Info'!$G$20","v":"EB-2025-0014"},{"$f":"'1. Info'!$G$28","v":2026},{"$f":"'1. Info'!$G$30","v":2025},{"$f":"'1. Info'!$G$32","v":2021},"Specific Service Charges","Other Revenue",{"$f":"'3. Data_Input_Sheet'!E28","v":411466.2},{"$f":"'3. Data_Input_Sheet'!U28","v":411491.44}]
[{"$f":"'1. Info'!$G$16","v":"Oshawa PUC Networks Inc."},{"$f":"'1. Info'!$G$20","v":"EB-2025-0014"},{"$f":"'1. Info'!$G$28","v":2026},{"$f":"'1. Info'!$G$30","v":2025},{"$f":"'1. Info'!$G$32","v":2021},"Late Payment Charges","Other Revenue",{"$f":"'3. Data_Input_Sheet'!E29","v":416050.08},{"$f":"'3. Data_Input_Sheet'!U29","v":700050.08000000007}]
[{"$f":"'1. Info'!$G$16","v":"Oshawa PUC Networks Inc."},{"$f":"'1. Info'!$G$20","v":"EB-2025-0014"},{"$f":"'1. Info'!$G$28","v":2026},{"$f":"'1. Info'!$G$30","v":2025},{"$f":"'1. Info'!$G$32","v":2021},"Other Distribution Revenue","Other Revenue",{"$f":"'3. Data_Input_Sheet'!E30","v":2131572.86},{"$f":"'3. Data_Input_Sheet'!U30","v":2131907.1150000002}]
[{"$f":"'1. Info'!$G$16","v":"Oshawa PUC Networks Inc."},{"$f":"'1. Info'!$G$16","v":"Oshawa PUC Networks Inc."},{"$f":"'1. Info'!$G$16","v":"Oshawa PUC Networks Inc."},{"$f":"'1. Info'!$G$16","v":"Oshawa PUC Networks Inc."},{"$f":"'1. Info'!$G$16","v":"Oshawa PUC Networks Inc."},"Other Income and Deductions","Other Revenue",{"$f":"'3. Data_Input_Sheet'!E31","v":519017.72},{"$f":"'3. Data_Input_Sheet'!U31","v":583825.72}]
[{"$f":"'1. Info'!$G$16","v":"Oshawa PUC Networks Inc."},{"$f":"'1. Info'!$G$16","v":"Oshawa PUC Networks Inc."},{"$f":"'1. Info'!$G$16","v":"Oshawa PUC Networks Inc."},{"$f":"'1. Info'!$G$16","v":"Oshawa PUC Networks Inc."},{"$f":"'1. Info'!$G$16","v":"Oshawa PUC Networks Inc."},"Total Revenue Offsets","Other Revenue",{"$f":"'3. Data_Input_Sheet'!E33","v":3478106.86},{"$f":"'3. Data_Input_Sheet'!U33","v":3827274.355}]
[{"$f":"'1. Info'!$G$16","v":"Oshawa PUC Networks Inc."},{"$f":"'1. Info'!$G$20","v":"EB-2025-0014"},{"$f":"'1. Info'!$G$28","v":2026},{"$f":"'1. Info'!$G$30","v":2025},{"$f":"'1. Info'!$G$32","v":2021},"OM+A Expenses","Operating Expenses",{"$f":"'3. Data_Input_Sheet'!E36","v":22271990.050000001},{"$f":"'3. Data_Input_Sheet'!U36","v":22271990.050000001}]
[{"$f":"'1. Info'!$G$16","v":"Oshawa PUC Networks Inc."},{"$f":"'1. Info'!$G$20","v":"EB-2025-0014"},{"$f":"'1. Info'!$G$28","v":2026},{"$f":"'1. Info'!$G$30","v":2025},{"$f":"'1. Info'!$G$32","v":2021},"Depreciation/Amortization","Operating Expenses",{"$f":"'3. Data_Input_Sheet'!E37","v":9467348.3300000001},{"$f":"'3. Data_Input_Sheet'!U37","v":9467348.3300000001}]
{"$rows_left_out":16}
{"sheet":"4. Rate_Base","index":4,"n_rows":35,"n_cols":29,"rows_kept":35,"cut":false,"hidden":false,"merged":[[41,3,41,28],[2,2,2,6],[3,2,3,6],[0,2,0,10],[1,2,1,22],[32,1,32,22],[21,3,21,22],[36,3,36,28],[37,3,37,28],[38,3,38,28],[39,3,39,28],[40,3,40,28],[33,3,33,28],[34,3,34,28],[35,3,35,28]]}
[]
[]
[]
[]
[]
[null,"Rate Base and Working Capital"]
[]
[]
[]
[null,null,null,"Rate Base"]
[null,"Line No.",null,"Particulars",null,null,"Initial Application",null,null,null,{"$f":"IF(ISBLANK('3. Data_Input_Sheet'!M12),\"\",'3. Data_Input_Sheet'!I12)","v":"Adjustments"},null,null,null,{"$f":"IF(ISBLANK('3. Data_Input_Sheet'!M12),\" \",'3. Data_Input_Sheet'!M12)","v":"Interrogatory Responses"},null,null,null,{"$f":"IF(ISBLANK('3. Data_Input_Sheet'!Q12),\"\",'3. Data_Input_Sheet'!Q12)","v":"Adjustments"},null,null,null,{"$f":"IF(ISBLANK('3. Data_Input_Sheet'!U12),\" \",'3. Data_Input_Sheet'!U12)","v":"Settlement Agreement"},null,{"$f":"IF(ISBLANK('3. Data_Input_Sheet'!Y12),\"\",'3. Data_Input_Sheet'!Y12)","v":"Adjustments"},null,null,null,{"$f":"IF(ISBLANK('3. Data_Input_Sheet'!AC12),\" \",'3. Data_Input_Sheet'!AC12)","v":"Per Board Decision"}]
[]
[null,1,null,"Gross Fixed Assets (average)","(2)",null,{"$f":"IFERROR('3. Data_Input_Sheet'!E16,0)","v":301724307.86000001},null,null,null,{"$f":"IFERROR('3. Data_Input_Sheet'!I16,0)","v":0},null,null,null,{"$f":"IFERROR(G13+K13,0)","v":301724307.86000001},null,null,null,{"$f":"'3. Data_Input_Sheet'!Q16","v":0},null,null,null,{"$f":"IFERROR(G13+K13+S13,0)","v":301724307.86000001},null,{"$f":"'3. Data_Input_Sheet'!Y16","v":-3405173.6549999714},null,null,null,{"$f":"IFERROR(Y13+W13,0)","v":298319134.20500004}]
[null,2,null,"Accumulated Depreciation (average)","(2)",null,{"$f":"IFERROR('3. Data_Input_Sheet'!E17,0)","v":-129563334.18000001},null,null,null,{"$f":"IFERROR('3. Data_Input_Sheet'!I17,0)","v":0},null,null,null,{"$f":"IFERROR(G14+K14,0)","v":-129563334.18000001},null,null,null,{"$f":"'3. Data_Input_Sheet'!Q17","v":0},null,null,null,{"$f":"IFERROR(G14+K14+S14,0)","v":-129563334.18000001},null,{"$f":"'3. Data_Input_Sheet'!Y17","v":418656.37000000477},null,null,null,{"$f":"IFERROR(Y14+W14,0)","v":-129144677.81}]
[null,3,null,"Net Fixed Assets (average)","(2)",null,{"$f":"IFERROR(SUM(G13:G14),0)","v":172160973.68000001},null,null,null,{"$f":"IFERROR(SUM(K13:K14),0)","v":0},null,null,null,{"$f":"SUM(O13:O14)","v":172160973.68000001},null,null,null,{"$f":"IFERROR(SUM(S13:S14),0)","v":0},null,null,null,{"$f":"IFERROR(SUM(W13:W14),0)","v":172160973.68000001},null,{"$f":"IFERROR(SUM(Y13:Y14),0)","v":-2986517.2849999666},null,null,null,{"$f":"IFERROR(SUM(AC13:AC14),0)","v":169174456.39500004}]
{"$rows_left_out":21}
{"sheet":"5. Utility Income","index":5,"n_rows":51,"n_cols":30,"rows_kept":51,"cut":false,"hidden":false,"merged":[[0,2,0,11],[2,2,2,7],[3,2,3,7],[1,2,1,21],[17,21,18,21],[17,13,18,13],[17,17,18,17],[7,5,7,21],[17,5,18,5],[17,9,18,9],[26,9,27,9],[34,21,35,21],[34,5,35,5],[36,21,37,21],[36,5,37,5],[36,17,37,17],[34,9,35,9],[36,9,37,9],[26,5,27,5],[26,21,27,21],[26,13,27,13],[34,13,35,13],[26,17,27,17],[34,17,35,17],[17,25,18,25],[17,29,18,29],[26,25,27,25],[26,29,27,29],[34,25,35,25],[34,29,35,29],[36,25,37,25],[36,29,37,29],[47,25,48,25],[47,29,48,29],[51,3,51,29],[47,9,48,9],[47,13,48,13],[47,17,48,17],[47,5,48,5],[47,21,48,21],[41,1,41,21],[36,13,37,13],[50,1,50,21],[52,3,52,29],[53,3,53,29],[54,3,54,29],[55,3,55,29],[56,3,56,29]]}
[]
[]
[]
[]
[]
[]
[]
[]
[]
[]
[null,"Utility Income"]
[]
[null,"Line No.",null,"Particulars                                ",null,"Initial Application   ",null,null,null,{"$f":"IF(N13=\"\",\"\",\"Adjustments\")","v":"Adjustments"},null,null,null,{"$f":"IF(ISBLANK('3. Data_Input_Sheet'!M12),\"\",'3. Data_Input_Sheet'!M12)","v":"Interrogatory Responses"},null,null,null,{"$f":"IF(N13=\"\",\"\",\"Adjustments\")","v":"Adjustments"},null,null,null,{"$f":"IF(ISBLANK('3. Data_Input_Sheet'!U12),\"\",'3. Data_Input_Sheet'!U12)","v":"Settlement Agreement"},null,null,null,{"$f":"IF(V13=\"\",\"\",\"Adjustments\")","v":"Adjustments"},null,null,null,{"$f":"'3. Data_Input_Sheet'!AC12","v":"Per Board Decision"}]
[]
[null,null,null,"Operating Revenues:"]
{"$rows_left_out":37}
{"sheet":"6. Taxes_PILs","index":6,"n_rows":45,"n_cols":19,"rows_kept":45,"cut":false,"hidden":false,"merged":[[52,3,52,20],[25,10,26,10],[44,3,44,14],[49,3,49,20],[50,3,50,20],[51,3,51,20],[25,18,26,18],[45,3,45,20],[46,3,46,20],[48,3,48,20],[0,3,0,12],[2,2,2,6],[3,2,3,6],[1,2,1,14],[43,1,43,14],[8,1,8,12],[25,6,26,6],[25,14,26,14],[15,3,15,4],[17,3,17,4],[19,3,19,4],[32,3,32,4]]}
[]
[]
[]
[]
[]
[]
[]
[]
[null,"Taxes/PILs"]
[]
[]
[null,"Line No.",null,"Particulars ",null,null,"Application",null,null,null,{"$f":"IF(ISBLANK('3. Data_Input_Sheet'!M12),\"\",'3. Data_Input_Sheet'!M12)","v":"Interrogatory Responses"},null,null,null,{"$f":"IF(ISBLANK('3. Data_Input_Sheet'!U12),\"\",'3. Data_Input_Sheet'!U12)","v":"Settlement Agreement"},null,null,null,{"$f":"'3. Data_Input_Sheet'!AC12","v":"Per Board Decision"}]
[]
[null,null,null,"Determination of Taxable Income"]
[]
{"$rows_left_out":31}
{"sheet":"7. Cost_of_Capital","index":7,"n_rows":80,"n_cols":16,"rows_kept":80,"cut":false,"hidden":false,"merged":[[13,3,13,15],[29,3,29,15],[45,5,45,9],[28,5,28,9],[85,3,85,15],[79,1,79,15],[46,3,46,15],[62,5,62,9],[63,3,63,15],[86,3,86,15],[84,3,84,15],[81,3,81,15],[82,3,82,15],[83,3,83,15],[0,2,0,13],[2,2,2,13],[3,2,3,9],[1,2,1,17],[12,5,12,9],[4,1,4,13],[10,5,10,9]]}
[]
[]
[]
[]
[null,"Capitalization/Cost of Capital"]
[]
[]
[]
[]
[]
[null,"Line No.",null,"Particulars",null,"Capitalization Ratio",null,null,null,null,null,"Cost Rate",null,null,null,"Return"]
[]
[null,null,null,null,null,"Initial Application"]
[]
[null,null,null,null,null,"(%)",null,null,null,"($)",null,"(%)",null,null,null,"($)"]
{"$rows_left_out":66}
{"sheet":"8. Rev_Def_Suff","index":8,"n_rows":57,"n_cols":20,"rows_kept":57,"cut":false,"hidden":false,"merged":[[14,11,15,11],[12,17,12,19],[14,17,15,17],[14,19,15,19],[59,3,59,15],[55,3,55,15],[57,3,57,15],[58,3,58,15],[56,3,56,15],[0,2,0,14],[1,2,1,14],[2,2,2,14],[3,2,3,7],[54,1,54,8],[14,3,15,3],[14,1,15,1],[12,5,12,7],[7,5,7,15],[14,7,15,7],[14,15,15,15],[14,5,15,5],[12,13,12,15],[14,13,15,13],[12,9,12,11],[14,9,15,9]]}
[null,null,null,null,null,null,null,null,null,null,null,null,null,null,null,{"$f":"CONCATENATE('2. Table of Contents'!$F$6,\" \",'2. Table of Contents'!$G$6)","v":" "}]
[]
[]
[]
[]
[]
[]
[]
[]
[null,"Revenue Deficiency/Sufficiency"]
[]
[]
[null,null,null,null,null,"Initial Application",null,null,null,{"$f":"IF(ISBLANK('3. Data_Input_Sheet'!M12),\"\",'3. Data_Input_Sheet'!M12)","v":"Interrogatory Responses"},null,null,null,{"$f":"IF(ISBLANK('3. Data_Input_Sheet'!U12),\"\",'3. Data_Input_Sheet'!U12)","v":"Settlement Agreement"},null,null,null,{"$f":"'3. Data_Input_Sheet'!AC12","v":"Per Board Decision"}]
[]
[null,"Line No.",null,"Particulars",null,"At Current Approved Rates",null,"At Proposed Rates",null,"At Current Approved Rates",null,"At Proposed Rates",null,"At Current Approved Rates",null,"At Proposed Rates",null,"At Current Approved Rates",null,"At Proposed Rates"]
{"$rows_left_out":43}
{"sheet":"9. Rev_Reqt","index":9,"n_rows":51,"n_cols":20,"rows_kept":51,"cut":false,"hidden":false,"merged":[[56,3,56,20],[0,2,0,13],[0,14,0,15],[1,2,1,16],[2,2,2,16],[3,2,3,13],[7,5,7,13],[48,1,48,13],[38,3,38,15],[49,3,49,20],[50,3,50,20],[51,3,51,20],[52,3,52,20],[53,3,53,20],[54,3,54,20],[55,3,55,20]]}
[]
[]
[]
[]
[]
[]
[]
[]
[]
[]
[null,"Revenue Requirement"]
[]
[null,"Line No.",null,"Particulars",null,"Application   ",null,null,null,{"$f":"IF(ISBLANK('3. Data_Input_Sheet'!M12),\"\",'3. Data_Input_Sheet'!M12)","v":"Interrogatory Responses"},null,null,null,{"$f":"IF(ISBLANK('3. Data_Input_Sheet'!U12),\"\",'3. Data_Input_Sheet'!U12)","v":"Settlement Agreement"},null,null,null,{"$f":"'3. Data_Input_Sheet'!AC12","v":"Per Board Decision"}]
[]
[null,1,null,"OM&A Expenses",null,{"$f":"'5. Utility Income'!F22","v":22271990.050000001},null,null,null,{"$f":"'5. Utility Income'!N22","v":22271990.050000001},null,null,null,{"$f":"'5. Utility Income'!V22","v":22271990.050000001},null,null,null,{"$f":"'5. Utility Income'!AD22","v":19500000}]
{"$rows_left_out":37}
{"sheet":"Hidden Data_Rev Reqt","index":10,"n_rows":4,"n_cols":8,"rows_kept":4,"cut":false,"hidden":true,"merged":[]}
["Utility Name","EB Number","Test Year","Bridge Year","Last Rebasing Year","Data Elements","Intital Application","Per Board Decision"]
[{"$f":"'1. Info'!$G$16","v":"Oshawa PUC Networks Inc."},{"$f":"'1. Info'!$G$20","v":"EB-2025-0014"},{"$f":"'1. Info'!$G$28","v":2026},{"$f":"'1. Info'!$G$30","v":2025},{"$f":"'1. Info'!$G$32","v":2021},"Service Revenue Requirement (before Revenues)",{"$f":"'9. Rev_Reqt'!F25","v":42326999.11320731},{"$f":"'9. Rev_Reqt'!N25","v":42327091.440144688}]
[{"$f":"'1. Info'!$G$16","v":"Oshawa PUC Networks Inc."},{"$f":"'1. Info'!$G$20","v":"EB-2025-0014"},{"$f":"'1. Info'!$G$28","v":2026},{"$f":"'1. Info'!$G$30","v":2025},{"$f":"'1. Info'!$G$32","v":2021},"Base Revenue Requirement",{"$f":"'9. Rev_Reqt'!F28","v":38848892.253207311},{"$f":"'9. Rev_Reqt'!N28","v":38499817.085144691}]
[{"$f":"'1. Info'!$G$16","v":"Oshawa PUC Networks Inc."},{"$f":"'1. Info'!$G$20","v":"EB-2025-0014"},{"$f":"'1. Info'!$G$28","v":2026},{"$f":"'1. Info'!$G$30","v":2025},{"$f":"'1. Info'!$G$32","v":2021},"Revenue Deficiency/(Sufficiency) Associated with Base Revenue Requirement",{"$f":"'9. Rev_Reqt'!F46","v":6670155.9833308123},{"$f":"'9. Rev_Reqt'!N46","v":6290640.7352064289}]

{"sheet":"10. Load Forecast","index":11,"n_rows":54,"n_cols":28,"rows_kept":54,"cut":false,"hidden":false,"merged":[[23,23,23,27],[54,2,54,27],[55,2,55,27],[56,2,56,27],[57,2,57,27],[13,1,13,21],[25,3,26,3],[23,5,23,9],[23,11,23,15],[23,17,23,21],[15,1,15,21],[17,1,17,21],[21,5,21,9],[19,1,19,21],[63,2,63,27],[58,2,58,27],[59,2,59,27],[60,2,60,27],[61,2,61,27],[62,2,62,27]]}
[]
[]
[]
[]
[]
[]
[]
[]
[]
[]
[]
[]
[]
[null,"Load Forecast Summary"]
[]
{"$rows_left_out":40}
{"sheet":"11. Cost_Allocation","index":12,"n_rows":152,"n_cols":15,"rows_kept":152,"cut":false,"hidden":false,"merged":[[13,1,13,12],[56,2,56,12],[21,2,21,12],[19,4,19,6],[15,1,15,12],[52,2,52,12],[53,2,53,12],[54,2,54,12],[50,4,50,6],[23,4,24,4],[23,8,24,8],[85,2,85,12],[151,2,151,12],[123,2,123,12],[93,6,94,6],[86,2,86,12],[87,2,87,12],[88,2,88,12],[119,2,119,12],[90,2,90,12],[126,6,126,8],[125,4,125,8],[120,2,120,12],[121,2,121,12]]}
[]
[]
[]
[]
[]
[]
[]
[]
[]
[]
[]
[]
[]
[null,"Cost Allocation and Rate Design"]
[]
{"$rows_left_out":138}
{"sheet":"12. Res_Rate_Design","index":13,"n_rows":67,"n_cols":7,"rows_kept":67,"cut":false,"hidden":true,"merged":[[58,2,59,6],[66,2,67,6],[13,1,13,8],[19,2,19,3],[25,2,25,3],[51,2,51,3],[53,2,54,2],[23,5,23,6],[25,5,28,6],[61,2,64,6]]}
[]
[]
[]
[]
[]
[]
[]
[]
[]
[]
[]
[]
[]
[null,"New Rate Design Policy For Residential Customers"]
[]
{"$rows_left_out":53}
{"sheet":"13. Rate Design","index":14,"n_rows":59,"n_cols":43,"rows_kept":59,"cut":false,"hidden":false,"merged":[[58,3,58,40],[23,18,25,18],[44,42,46,42],[19,36,19,40],[50,30,53,34],[21,20,21,22],[21,14,22,18],[22,20,22,22],[48,18,48,22],[23,26,23,28],[55,3,56,33],[14,1,14,40],[16,1,16,40],[23,30,23,34],[23,11,25,11],[21,3,21,11],[23,24,25,24],[19,26,19,34],[23,40,25,40],[19,7,19,11],[23,5,25,5],[23,7,25,7],[23,9,25,9],[19,14,19,18],[23,14,25,14],[23,16,25,16]]}
[]
[]
[]
[null,null,null,null,null,null,null,null,null,null,null,null,null,null,null,null,null,null,null,null,null,null,null,null,null,null,null,null,{"$f":"'3. Data_Input_Sheet'!E12","v":"Initial Application"},1,"F","H","J"]
[null,null,null,null,null,null,null,null,null,null,null,null,null,null,null,null,null,null,null,null,null,null,null,null,null,null,null,null,{"$f":"IF(ISBLANK('3. Data_Input_Sheet'!M12),\" \",'3. Data_Input_Sheet'!M12)","v":"Interrogatory Responses"},2,"L","N","P"]
[null,null,null,null,null,null,null,null,null,null,null,null,null,null,null,null,null,null,null,null,null,null,null,null,null,null,null,null,{"$f":"IF(ISBLANK('3. Data_Input_Sheet'!U12),\" \",'3. Data_Input_Sheet'!U12)","v":"Settlement Agreement"},3,"R","T","V"]
[null,null,null,null,null,null,null,null,null,null,null,null,null,null,null,null,null,null,null,null,null,null,null,null,null,null,null,null,{"$f":"'3. Data_Input_Sheet'!AC12","v":"Per Board Decision"}]
[]
[]
[]
[]
[]
[]
[]
[null,"Rate Design and Revenue Reconciliation"]
{"$rows_left_out":45}
{"sheet":"14. Tracking_Sheet","index":15,"n_rows":203,"n_cols":18,"rows_kept":203,"cut":false,"hidden":false,"merged":[[210,1,210,14],[211,1,211,14],[15,1,15,14],[73,0,75,0],[73,1,74,1],[208,1,208,14],[76,0,78,0],[76,1,77,1],[79,0,81,0],[79,1,80,1],[67,0,69,0],[67,1,68,1],[70,0,72,0],[70,1,71,1],[61,0,63,0],[52,0,54,0],[52,1,53,1],[43,0,45,0],[43,1,44,1],[46,0,48,0],[46,1,47,1],[61,1,62,1],[64,0,66,0],[64,1,65,1],[55,0,57,0],[55,1,56,1],[58,0,60,0],[58,1,59,1],[37,0,39,0],[37,1,38,1],[40,0,42,0],[40,1,41,1],[31,0,33,0],[31,1,32,1],[34,0,36,0],[34,1,35,1],[49,0,51,0],[49,1,50,1],[17,3,17,4],[17,8,17,10],[17,5,17,7],[17,11,17,14],[22,1,23,1],[25,1,26,1],[22,0,24,0],[25,0,27,0],[28,0,30,0],[28,1,29,1],[91,0,93,0],[91,1,92,1],[94,0,96,0],[94,1,95,1],[97,0,99,0],[97,1,98,1],[82,0,84,0],[82,1,83,1],[85,0,87,0],[85,1,86,1],[88,0,90,0],[88,1,89,1],[109,0,111,0],[109,1,110,1],[112,0,114,0],[112,1,113,1],[115,0,117,0],[115,1,116,1],[100,0,102,0],[100,1,101,1],[103,0,105,0],[103,1,104,1],[106,0,108,0],[106,1,107,1],[127,0,129,0],[127,1,128,1],[130,0,132,0],[130,1,131,1],[133,0,135,0],[133,1,134,1],[118,0,120,0],[118,1,119,1],[121,0,123,0],[121,1,122,1],[124,0,126,0],[124,1,125,1],[145,0,147,0],[145,1,146,1],[148,0,150,0],[148,1,149,1],[151,0,153,0],[151,1,152,1],[136,0,138,0],[136,1,137,1],[139,0,141,0],[139,1,140,1],[142,0,144,0],[142,1,143,1],[166,1,167,1],[169,0,171,0],[169,1,170,1],[154,0,156,0],[154,1,155,1],[157,0,159,0],[157,1,158,1],[160,0,162,0],[160,1,161,1],[14,1,14,14],[199,0,201,0],[199,1,200,1],[190,0,192,0],[190,1,191,1],[193,0,195,0],[193,1,194,1],[196,0,198,0],[196,1,197,1],[181,0,183,0],[181,1,182,1],[184,0,186,0],[184,1,185,1],[187,0,189,0],[187,1,188,1],[172,0,174,0],[172,1,173,1],[175,0,177,0],[175,1,176,1],[178,0,180,0],[178,1,179,1],[163,0,165,0],[163,1,164,1],[166,0,168,0]]}
[]
[]
[]
[]
[]
[]
[]
[]
[]
[]
[]
[]
[]
[null,"Tracking Form"]
[null,"The first row shown, labelled \"Original Application\", summarizes key statistics based on the data inputs into the RRWF. After the original application filing, the applicant provides key changes in capital and operating expenses, load forecasts, cost of capital, etc., as revised through the processing of the application. This could be due to revisions or responses to interrogatories. The last row shown is the most current estimate of the cost of service data reflecting the original application and any updates provided by the applicant distributor (for updated evidence, responses to interrogatories, undertakings, etc.)\nPlease ensure a Reference (Column B) and/or Item Description (Column C) is entered. \n(1) Short reference to evidence material (interrogatory response, undertaking, exhibit number, Board Decision, Code, Guideline, Report of the Board, etc.)\n(2) Short description of change, issue, etc.\n\n60 Tracking Rows have been provided below.  If you require more, please contact Industry Relations @ IndustryRelations@ontarioenergyboard.ca. "]
{"$rows_left_out":189}
{"sheet":"Sheet4","index":16,"n_rows":0,"n_cols":0,"rows_kept":0,"cut":false,"hidden":true,"merged":[]}